Parameters/TestRpc.TestCallWithChainCertAndRootCA/SSL_TCP: /data0/somelongdirectorytoavoidrpathissues/src/kudu/src/kudu/rpc/rpc-test.cc:303: Failure
Failed
Bad status: Runtime error: could not verify certificate chain (error with cert: subject=CN = localhost, ST = sadfjas, C = AS, emailAddress = sdflkdsajf, O = lskdfjlsad, OU = sldfkja, issuer=C = AS, ST = ASDfkjdhf, L = lskdjf, O = saldfja, OU = skdjf, CN = localhost, emailAddress = sadjflkadsj): : certificate has expired
Google Test trace:
/data0/somelongdirectorytoavoidrpathissues/src/kudu/src/kudu/rpc/rpc-test.cc:300: Connecting to 0.0.0.0:43893
I20260926 22:06:44.131933 21566 test_util.cc:175] -----------------------------------------------
I20260926 22:06:44.132112 21566 test_util.cc:176] Had fatal failures, leaving test files at /tmp/dist-test-taskqK7VGB/test-tmp/rpc-test.1.Parameters_TestRpc.TestCallWithChainCertAndRootCA_SSL_TCP.1790460402512266-21566-0
Note: This is test shard 2 of 8.
[==========] Running 21 tests from 2 test suites.
[----------] Global test environment set-up.
[----------] 1 test from TestRpc
[ RUN ] TestRpc.TestMethodsByName
[ OK ] TestRpc.TestMethodsByName (6 ms)
[----------] 1 test from TestRpc (7 ms total)
[----------] 20 tests from Parameters/TestRpc
[ RUN ] Parameters/TestRpc.TestAcceptorPoolStartStop/SSL_TCP
WARNING: Logging before InitGoogleLogging() is written to STDERR
I20260926 22:06:42.643231 21581 acceptor_pool.cc:254] collecting diagnostics on the listening RPC socket 0.0.0.0:33039 every 8 connection(s)
W20260926 22:06:43.645776 21566 thread.cc:536] Waited for 1000ms trying to join with acceptor (tid 21582)
I20260926 22:06:42.645043 21582 acceptor_pool.cc:254] collecting diagnostics on the listening RPC socket 0.0.0.0:33039 every 8 connection(s)
I20260926 22:06:43.858224 21593 acceptor_pool.cc:254] collecting diagnostics on the listening RPC socket 0.0.0.0:34013 every 8 connection(s)
I20260926 22:06:43.859925 21594 acceptor_pool.cc:254] collecting diagnostics on the listening RPC socket 0.0.0.0:34013 every 8 connection(s)
I20260926 22:06:43.883322 21604 acceptor_pool.cc:254] collecting diagnostics on the listening RPC socket 0.0.0.0:34221 every 8 connection(s)
I20260926 22:06:43.884752 21605 acceptor_pool.cc:254] collecting diagnostics on the listening RPC socket 0.0.0.0:34221 every 8 connection(s)
I20260926 22:06:43.921072 21615 acceptor_pool.cc:254] collecting diagnostics on the listening RPC socket 0.0.0.0:39031 every 8 connection(s)
I20260926 22:06:43.921788 21616 acceptor_pool.cc:254] collecting diagnostics on the listening RPC socket 0.0.0.0:39031 every 8 connection(s)
I20260926 22:06:43.944350 21626 acceptor_pool.cc:254] collecting diagnostics on the listening RPC socket 0.0.0.0:39727 every 8 connection(s)
I20260926 22:06:43.945051 21627 acceptor_pool.cc:254] collecting diagnostics on the listening RPC socket 0.0.0.0:39727 every 8 connection(s)
[ OK ] Parameters/TestRpc.TestAcceptorPoolStartStop/SSL_TCP (1378 ms)
[ RUN ] Parameters/TestRpc.TestCall/SSL_TCP
I20260926 22:06:43.981595 21639 acceptor_pool.cc:254] collecting diagnostics on the listening RPC socket 0.0.0.0:32891 every 8 connection(s)
I20260926 22:06:43.983953 21640 acceptor_pool.cc:254] collecting diagnostics on the listening RPC socket 0.0.0.0:32891 every 8 connection(s)
I20260926 22:06:43.989310 21566 rpc-test.cc:234] Connecting to 0.0.0.0:32891
[ OK ] Parameters/TestRpc.TestCall/SSL_TCP (140 ms)
[ RUN ] Parameters/TestRpc.TestCallWithChainCertAndRootCA/SSL_TCP
I20260926 22:06:44.111079 21664 acceptor_pool.cc:254] collecting diagnostics on the listening RPC socket 0.0.0.0:43893 every 8 connection(s)
I20260926 22:06:44.111842 21665 acceptor_pool.cc:254] collecting diagnostics on the listening RPC socket 0.0.0.0:43893 every 8 connection(s)
/data0/somelongdirectorytoavoidrpathissues/src/kudu/src/kudu/rpc/rpc-test.cc:303: Failure
Failed
Bad status: Runtime error: could not verify certificate chain (error with cert: subject=CN = localhost, ST = sadfjas, C = AS, emailAddress = sdflkdsajf, O = lskdfjlsad, OU = sldfkja, issuer=C = AS, ST = ASDfkjdhf, L = lskdjf, O = saldfja, OU = skdjf, CN = localhost, emailAddress = sadjflkadsj): : certificate has expired
Google Test trace:
/data0/somelongdirectorytoavoidrpathissues/src/kudu/src/kudu/rpc/rpc-test.cc:300: Connecting to 0.0.0.0:43893
I20260926 22:06:44.131933 21566 test_util.cc:175] -----------------------------------------------
I20260926 22:06:44.132112 21566 test_util.cc:176] Had fatal failures, leaving test files at /tmp/dist-test-taskqK7VGB/test-tmp/rpc-test.1.Parameters_TestRpc.TestCallWithChainCertAndRootCA_SSL_TCP.1790460402512266-21566-0
[ FAILED ] Parameters/TestRpc.TestCallWithChainCertAndRootCA/SSL_TCP, where GetParam() = (true, false) (41 ms)
[ RUN ] Parameters/TestRpc.TestCallWithBadPasswordProtectedKey/SSL_TCP
[ OK ] Parameters/TestRpc.TestCallWithBadPasswordProtectedKey/SSL_TCP (33 ms)
[ RUN ] Parameters/TestRpc.TestInvalidMethodCall/SSL_TCP
I20260926 22:06:44.199958 21701 acceptor_pool.cc:254] collecting diagnostics on the listening RPC socket 0.0.0.0:38817 every 8 connection(s)
I20260926 22:06:44.200811 21702 acceptor_pool.cc:254] collecting diagnostics on the listening RPC socket 0.0.0.0:38817 every 8 connection(s)
I20260926 22:06:44.204186 21566 rpc-test.cc:406] Connecting to 0.0.0.0:38817
[ OK ] Parameters/TestRpc.TestInvalidMethodCall/SSL_TCP (79 ms)
[ RUN ] Parameters/TestRpc.TestHighFDs/SSL_TCP
I20260926 22:06:44.462023 21726 acceptor_pool.cc:254] collecting diagnostics on the listening RPC socket 0.0.0.0:44139 every 8 connection(s)
I20260926 22:06:44.462759 21727 acceptor_pool.cc:254] collecting diagnostics on the listening RPC socket 0.0.0.0:44139 every 8 connection(s)
[ OK ] Parameters/TestRpc.TestHighFDs/SSL_TCP (265 ms)
[ RUN ] Parameters/TestRpc.TestConnectionAlwaysKeepalive/SSL_TCP
I20260926 22:06:44.530627 21749 acceptor_pool.cc:254] collecting diagnostics on the listening RPC socket 0.0.0.0:37869 every 8 connection(s)
I20260926 22:06:44.531409 21750 acceptor_pool.cc:254] collecting diagnostics on the listening RPC socket 0.0.0.0:37869 every 8 connection(s)
I20260926 22:06:44.534696 21566 rpc-test.cc:532] Connecting to 0.0.0.0:37869
[ OK ] Parameters/TestRpc.TestConnectionAlwaysKeepalive/SSL_TCP (3075 ms)
[ RUN ] Parameters/TestRpc.TestReopenOutboundConnections/SSL_TCP
I20260926 22:06:47.615712 21772 acceptor_pool.cc:254] collecting diagnostics on the listening RPC socket 0.0.0.0:42795 every 8 connection(s)
I20260926 22:06:47.616389 21773 acceptor_pool.cc:254] collecting diagnostics on the listening RPC socket 0.0.0.0:42795 every 8 connection(s)
I20260926 22:06:47.619532 21566 rpc-test.cc:658] Connecting to 0.0.0.0:42795
[ OK ] Parameters/TestRpc.TestReopenOutboundConnections/SSL_TCP (382 ms)
[ RUN ] Parameters/TestRpc.TestConnectionNetworkPlane/SSL_TCP
I20260926 22:06:48.001034 21795 acceptor_pool.cc:254] collecting diagnostics on the listening RPC socket 0.0.0.0:45533 every 8 connection(s)
I20260926 22:06:48.001698 21796 acceptor_pool.cc:254] collecting diagnostics on the listening RPC socket 0.0.0.0:45533 every 8 connection(s)
I20260926 22:06:48.004962 21566 rpc-test.cc:772] Connecting to 0.0.0.0:45533
[ OK ] Parameters/TestRpc.TestConnectionNetworkPlane/SSL_TCP (79 ms)
[ RUN ] Parameters/TestRpc.TestTCPKeepalive/SSL_TCP
I20260926 22:06:48.071031 21820 acceptor_pool.cc:254] collecting diagnostics on the listening RPC socket 0.0.0.0:39459 every 8 connection(s)
I20260926 22:06:48.071856 21821 acceptor_pool.cc:254] collecting diagnostics on the listening RPC socket 0.0.0.0:39459 every 8 connection(s)
I20260926 22:06:48.109205 21824 rpc-test-base.h:222] got call: sleep_micros: 8000000 deferred: true
I20260926 22:06:56.113260 21824 rpcz_store.cc:275] Call kudu.rpc.GenericCalculatorService.Sleep from 127.0.0.1:43482 (request call id 0) took 8004 ms. Trace:
I20260926 22:06:56.113698 21824 rpcz_store.cc:276] 0926 22:06:48.108955 (+ 0us) service_pool.cc:170] Inserting onto call queue
0926 22:06:48.109053 (+ 98us) service_pool.cc:227] Handling call
0926 22:06:56.113098 (+8004045us) inbound_call.cc:173] Queueing success response
Metrics: {}
[ OK ] Parameters/TestRpc.TestTCPKeepalive/SSL_TCP (8078 ms)
[ RUN ] Parameters/TestRpc.TestMaxSmallSidecars/SSL_TCP
I20260926 22:06:56.155189 21846 acceptor_pool.cc:254] collecting diagnostics on the listening RPC socket 0.0.0.0:45973 every 8 connection(s)
I20260926 22:06:56.156011 21847 acceptor_pool.cc:254] collecting diagnostics on the listening RPC socket 0.0.0.0:45973 every 8 connection(s)
[ OK ] Parameters/TestRpc.TestMaxSmallSidecars/SSL_TCP (195 ms)
[ RUN ] Parameters/TestRpc.TestCallTimeout/SSL_TCP
I20260926 22:06:56.344435 21871 acceptor_pool.cc:254] collecting diagnostics on the listening RPC socket 0.0.0.0:33667 every 8 connection(s)
I20260926 22:06:56.345151 21872 acceptor_pool.cc:254] collecting diagnostics on the listening RPC socket 0.0.0.0:33667 every 8 connection(s)
I20260926 22:06:56.372560 21566 rpc-test-base.h:595] status: Timed out: connection negotiation to 0.0.0.0:33667 for RPC Sleep timed out after 0.000s (ON_OUTBOUND_QUEUE), seconds elapsed: 0.00247094
I20260926 22:06:56.380771 21875 rpc-test-base.h:222] got call: sleep_micros: 700000
I20260926 22:06:56.573498 21566 rpc-test-base.h:595] status: Timed out: Sleep RPC to 0.0.0.0:33667 timed out after 0.200s (SENT), seconds elapsed: 0.200573
I20260926 22:06:56.575124 21874 rpc-test-base.h:222] got call: sleep_micros: 2000000
W20260926 22:06:57.081424 21875 rpcz_store.cc:267] Call kudu.rpc.GenericCalculatorService.Sleep from 127.0.0.1:59612 (request call id 1) took 700 ms (client timeout 200 ms). Trace:
W20260926 22:06:57.081741 21875 rpcz_store.cc:269] 0926 22:06:56.380583 (+ 0us) service_pool.cc:170] Inserting onto call queue
0926 22:06:56.380702 (+ 119us) service_pool.cc:227] Handling call
0926 22:06:57.081357 (+700655us) inbound_call.cc:173] Queueing success response
Metrics: {}
I20260926 22:06:58.076380 21566 rpc-test-base.h:595] status: Timed out: Sleep RPC to 0.0.0.0:33667 timed out after 1.500s (SENT), seconds elapsed: 1.50254
W20260926 22:06:58.575686 21874 rpcz_store.cc:267] Call kudu.rpc.GenericCalculatorService.Sleep from 127.0.0.1:59612 (request call id 2) took 2000 ms (client timeout 1500 ms). Trace:
W20260926 22:06:58.575991 21874 rpcz_store.cc:269] 0926 22:06:56.574818 (+ 0us) service_pool.cc:170] Inserting onto call queue
0926 22:06:56.574953 (+ 135us) service_pool.cc:227] Handling call
0926 22:06:58.575626 (+2000673us) inbound_call.cc:173] Queueing success response
Metrics: {}
W20260926 22:06:58.576598 21869 connection.cc:441] server connection from 127.0.0.1:59612 torn down before Call kudu.rpc.GenericCalculatorService.Sleep from 127.0.0.1:59612 (request call id 2) could send its response
[ OK ] Parameters/TestRpc.TestCallTimeout/SSL_TCP (2258 ms)
[ RUN ] Parameters/TestRpc.TestServerShutsDown/SSL_TCP
I20260926 22:06:58.583659 21566 rpc-test.cc:1125] Connecting to 0.0.0.0:36465
W20260926 22:06:58.593175 21888 negotiation.cc:337] Failed RPC negotiation. Trace:
0926 22:06:58.591699 (+ 0us) reactor.cc:625] Submitting negotiation task for client connection to 0.0.0.0:36465 (local address 127.0.0.1:34748)
0926 22:06:58.592134 (+ 435us) negotiation.cc:107] Waiting for socket to connect
0926 22:06:58.592165 (+ 31us) client_negotiation.cc:174] Beginning negotiation
0926 22:06:58.592387 (+ 222us) client_negotiation.cc:252] Sending NEGOTIATE NegotiatePB request
0926 22:06:58.592604 (+ 217us) negotiation.cc:327] Negotiation complete: Network error: Client connection negotiation failed: client connection to 0.0.0.0:36465: BlockingWrite error: write error: Broken pipe (error 32)
Metrics: {"client-negotiator.queue_time_us":111}
[ OK ] Parameters/TestRpc.TestServerShutsDown/SSL_TCP (13 ms)
[ RUN ] Parameters/TestRpc.TimedOutOnResponseMetric/SSL_TCP
I20260926 22:06:58.617326 21905 acceptor_pool.cc:254] collecting diagnostics on the listening RPC socket 0.0.0.0:44163 every 8 connection(s)
I20260926 22:06:58.618039 21906 acceptor_pool.cc:254] collecting diagnostics on the listening RPC socket 0.0.0.0:44163 every 8 connection(s)
W20260926 22:06:58.855414 21909 rpcz_store.cc:267] Call kudu.rpc_test.CalculatorService.Sleep from 127.0.0.1:48822 (request call id 3) took 50 ms (client timeout 25 ms). Trace:
W20260926 22:06:58.855801 21909 rpcz_store.cc:269] 0926 22:06:58.804726 (+ 0us) service_pool.cc:170] Inserting onto call queue
0926 22:06:58.804831 (+ 105us) service_pool.cc:227] Handling call
0926 22:06:58.855325 (+ 50494us) inbound_call.cc:173] Queueing success response
Related trace 'test_child':
Metrics: {"test_sleep_us":50000,"child_traces":[["test_child",{"related_trace_metric":1}]]}
W20260926 22:06:58.915030 21909 rpcz_store.cc:267] Call kudu.rpc_test.CalculatorService.Sleep from 127.0.0.1:48822 (request call id 4) took 50 ms (client timeout 50 ms). Trace:
W20260926 22:06:58.915349 21909 rpcz_store.cc:269] 0926 22:06:58.864473 (+ 0us) service_pool.cc:170] Inserting onto call queue
0926 22:06:58.864613 (+ 140us) service_pool.cc:227] Handling call
0926 22:06:58.914964 (+ 50351us) inbound_call.cc:173] Queueing success response
Related trace 'test_child':
Metrics: {"test_sleep_us":50000,"child_traces":[["test_child",{"related_trace_metric":1}]]}
[ OK ] Parameters/TestRpc.TimedOutOnResponseMetric/SSL_TCP (327 ms)
[ RUN ] Parameters/TestRpc.AcceptorDispatchingTimesMetric/SSL_TCP
I20260926 22:06:58.935091 21930 acceptor_pool.cc:254] collecting diagnostics on the listening RPC socket 0.0.0.0:45053 every 8 connection(s)
I20260926 22:06:58.935753 21931 acceptor_pool.cc:254] collecting diagnostics on the listening RPC socket 0.0.0.0:45053 every 8 connection(s)
W20260926 22:06:58.941514 21926 negotiation.cc:337] Failed RPC negotiation. Trace:
0926 22:06:58.939243 (+ 0us) reactor.cc:625] Submitting negotiation task for server connection from 127.0.0.1:51944 (local address 127.0.0.1:45053)
0926 22:06:58.940271 (+ 1028us) server_negotiation.cc:206] Beginning negotiation
0926 22:06:58.940317 (+ 46us) server_negotiation.cc:399] Waiting for connection header
0926 22:06:58.940722 (+ 405us) negotiation.cc:327] Negotiation complete: Network error: Server connection negotiation failed: server connection from 127.0.0.1:51944: BlockingRecv error: recv got EOF from 127.0.0.1:51944 (error 108)
Metrics: {"server-negotiator.queue_time_us":438}
[ OK ] Parameters/TestRpc.AcceptorDispatchingTimesMetric/SSL_TCP (21 ms)
[ RUN ] Parameters/TestRpc.TestRpcCallbackDestroysMessenger/SSL_TCP
[ OK ] Parameters/TestRpc.TestRpcCallbackDestroysMessenger/SSL_TCP (25 ms)
[ RUN ] Parameters/TestRpc.TestApplicationFeatureFlag/SSL_TCP
I20260926 22:06:58.989185 21955 acceptor_pool.cc:254] collecting diagnostics on the listening RPC socket 0.0.0.0:43747 every 8 connection(s)
I20260926 22:06:58.989923 21956 acceptor_pool.cc:254] collecting diagnostics on the listening RPC socket 0.0.0.0:43747 every 8 connection(s)
W20260926 22:06:59.028573 21952 messenger.cc:357] Unable to handle RPC call: Not implemented: call requires unsupported application feature flags: 99
[ OK ] Parameters/TestRpc.TestApplicationFeatureFlag/SSL_TCP (65 ms)
[ RUN ] Parameters/TestRpc.TestCancellation/SSL_TCP
I20260926 22:06:59.057749 21980 acceptor_pool.cc:254] collecting diagnostics on the listening RPC socket 0.0.0.0:43027 every 8 connection(s)
I20260926 22:06:59.058463 21981 acceptor_pool.cc:254] collecting diagnostics on the listening RPC socket 0.0.0.0:43027 every 8 connection(s)
I20260926 22:06:59.061477 21566 rpc-test.cc:1648] Connecting to 0.0.0.0:43027
I20260926 22:06:59.161255 21566 rpc-test-base.h:595] status: Aborted: Sleep RPC to 0.0.0.0:43027 is cancelled in state READY, seconds elapsed: 0.000401696
I20260926 22:06:59.300570 21566 rpc-test-base.h:595] status: Aborted: Sleep RPC to 0.0.0.0:43027 is cancelled in state SENT, seconds elapsed: 0.000844782
I20260926 22:06:59.339473 21983 rpc-test-base.h:222] got call: sleep_micros: 510000
I20260926 22:06:59.463317 21566 rpc-test-base.h:595] status: Aborted: Sleep RPC to 0.0.0.0:43027 is cancelled in state SENT, seconds elapsed: 0.000913737
I20260926 22:06:59.519140 21982 rpc-test-base.h:222] got call: sleep_micros: 510000
I20260926 22:06:59.635975 21566 rpc-test-base.h:595] status: Aborted: Sleep RPC to 0.0.0.0:43027 is cancelled in state SENT, seconds elapsed: 0.00109194
W20260926 22:06:59.675072 21984 rpcz_store.cc:267] Call kudu.rpc.GenericCalculatorService.Sleep from 127.0.0.1:43590 (request call id 11) took 15 ms (client timeout 10 ms). Trace:
W20260926 22:06:59.675436 21984 rpcz_store.cc:269] 0926 22:06:59.659724 (+ 0us) service_pool.cc:170] Inserting onto call queue
0926 22:06:59.674818 (+ 15094us) service_pool.cc:214] Skipping call since client already timed out
0926 22:06:59.674893 (+ 75us) inbound_call.cc:173] Queueing failure response
Metrics: {}
I20260926 22:06:59.675999 21984 rpc-test-base.h:222] got call: sleep_micros: 1500000
W20260926 22:06:59.850138 21983 rpcz_store.cc:267] Call kudu.rpc.GenericCalculatorService.Sleep from 127.0.0.1:43590 (request call id 3) took 510 ms (client timeout 10 ms). Trace:
W20260926 22:06:59.850437 21983 rpcz_store.cc:269] 0926 22:06:59.339304 (+ 0us) service_pool.cc:170] Inserting onto call queue
0926 22:06:59.339413 (+ 109us) service_pool.cc:227] Handling call
0926 22:06:59.850084 (+510671us) inbound_call.cc:173] Queueing success response
Metrics: {}
W20260926 22:07:00.029935 21982 rpcz_store.cc:267] Call kudu.rpc.GenericCalculatorService.Sleep from 127.0.0.1:43590 (request call id 7) took 511 ms (client timeout 10 ms). Trace:
W20260926 22:07:00.030267 21982 rpcz_store.cc:269] 0926 22:06:59.518866 (+ 0us) service_pool.cc:170] Inserting onto call queue
0926 22:06:59.519062 (+ 196us) service_pool.cc:227] Handling call
0926 22:07:00.029880 (+510818us) inbound_call.cc:173] Queueing success response
Metrics: {}
I20260926 22:07:00.637986 21566 rpc-test-base.h:595] status: Timed out: Sleep RPC to 0.0.0.0:43027 timed out after 1.000s (SENT), seconds elapsed: 1.00156
I20260926 22:07:00.639451 21982 rpc-test-base.h:222] got call: sleep_micros: 1500000
W20260926 22:07:01.176558 21984 rpcz_store.cc:267] Call kudu.rpc.GenericCalculatorService.Sleep from 127.0.0.1:43590 (request call id 12) took 1516 ms (client timeout 1000 ms). Trace:
W20260926 22:07:01.176856 21984 rpcz_store.cc:269] 0926 22:06:59.659939 (+ 0us) service_pool.cc:170] Inserting onto call queue
0926 22:06:59.675970 (+ 16031us) service_pool.cc:227] Handling call
0926 22:07:01.176509 (+1500539us) inbound_call.cc:173] Queueing success response
Metrics: {}
I20260926 22:07:01.639890 21566 rpc-test-base.h:595] status: Timed out: Sleep RPC to 0.0.0.0:43027 timed out after 1.000s (SENT), seconds elapsed: 1.00149
W20260926 22:07:01.641407 21978 messenger.cc:357] Unable to handle RPC call: Not implemented: call requires unsupported application feature flags: 99, 1
W20260926 22:07:01.642788 21978 messenger.cc:357] Unable to handle RPC call: Not implemented: call requires unsupported application feature flags: 99, 1
W20260926 22:07:02.139955 21982 rpcz_store.cc:267] Call kudu.rpc.GenericCalculatorService.Sleep from 127.0.0.1:43590 (request call id 13) took 1500 ms (client timeout 1000 ms). Trace:
W20260926 22:07:02.140251 21982 rpcz_store.cc:269] 0926 22:07:00.639227 (+ 0us) service_pool.cc:170] Inserting onto call queue
0926 22:07:00.639393 (+ 166us) service_pool.cc:227] Handling call
0926 22:07:02.139906 (+1500513us) inbound_call.cc:173] Queueing success response
Metrics: {}
W20260926 22:07:02.140805 21978 connection.cc:441] server connection from 127.0.0.1:43590 torn down before Call kudu.rpc.GenericCalculatorService.Sleep from 127.0.0.1:43590 (request call id 13) could send its response
[ OK ] Parameters/TestRpc.TestCancellation/SSL_TCP (3110 ms)
[ RUN ] Parameters/TestRpc.TestCancellationMultiThreads/SSL_TCP
I20260926 22:07:02.164615 22005 acceptor_pool.cc:254] collecting diagnostics on the listening RPC socket 0.0.0.0:44263 every 8 connection(s)
I20260926 22:07:02.165360 22006 acceptor_pool.cc:254] collecting diagnostics on the listening RPC socket 0.0.0.0:44263 every 8 connection(s)
I20260926 22:07:02.168563 21566 rpc-test.cc:1808] Connecting to 0.0.0.0:44263
I20260926 22:07:02.334259 22019 test_util.cc:268] Using random seed: 225781521
I20260926 22:07:02.335361 22020 test_util.cc:268] Using random seed: 225782633
I20260926 22:07:02.337169 22021 test_util.cc:268] Using random seed: 225784439
I20260926 22:07:02.338524 22022 test_util.cc:268] Using random seed: 225785781
I20260926 22:07:02.340023 22023 test_util.cc:268] Using random seed: 225787192
I20260926 22:07:02.341349 22024 test_util.cc:268] Using random seed: 225788497
I20260926 22:07:02.342947 22025 test_util.cc:268] Using random seed: 225790065
I20260926 22:07:02.344473 22026 test_util.cc:268] Using random seed: 225791610
I20260926 22:07:02.345715 22027 test_util.cc:268] Using random seed: 225792890
I20260926 22:07:02.347561 22028 test_util.cc:268] Using random seed: 225794681
I20260926 22:07:02.349220 22029 test_util.cc:268] Using random seed: 225796336
I20260926 22:07:02.350629 22030 test_util.cc:268] Using random seed: 225797721
I20260926 22:07:02.352248 22031 test_util.cc:268] Using random seed: 225799398
I20260926 22:07:02.353972 22032 test_util.cc:268] Using random seed: 225801106
I20260926 22:07:02.356590 22033 test_util.cc:268] Using random seed: 225803706
I20260926 22:07:02.358322 22034 test_util.cc:268] Using random seed: 225805394
I20260926 22:07:02.361549 22035 test_util.cc:268] Using random seed: 225808621
I20260926 22:07:02.363122 22036 test_util.cc:268] Using random seed: 225810239
I20260926 22:07:02.364841 22037 test_util.cc:268] Using random seed: 225811940
I20260926 22:07:02.366402 22038 test_util.cc:268] Using random seed: 225813538
I20260926 22:07:02.368513 22039 test_util.cc:268] Using random seed: 225815598
I20260926 22:07:02.370131 22040 test_util.cc:268] Using random seed: 225817241
I20260926 22:07:02.371817 22041 test_util.cc:268] Using random seed: 225818867
I20260926 22:07:02.373930 22042 test_util.cc:268] Using random seed: 225820996
I20260926 22:07:02.375546 22043 test_util.cc:268] Using random seed: 225822609
I20260926 22:07:02.377235 22044 test_util.cc:268] Using random seed: 225824361
I20260926 22:07:02.378909 22045 test_util.cc:268] Using random seed: 225825994
I20260926 22:07:02.380498 22046 test_util.cc:268] Using random seed: 225827627
I20260926 22:07:02.382107 22047 test_util.cc:268] Using random seed: 225829239
I20260926 22:07:02.383730 22048 test_util.cc:268] Using random seed: 225830831
[ OK ] Parameters/TestRpc.TestCancellationMultiThreads/SSL_TCP (18093 ms)
[ RUN ] Parameters/TestRpc.TestCallId/SSL_TCP
I20260926 22:07:20.273875 22062 acceptor_pool.cc:254] collecting diagnostics on the listening RPC socket 0.0.0.0:43325 every 8 connection(s)
I20260926 22:07:20.274643 22063 acceptor_pool.cc:254] collecting diagnostics on the listening RPC socket 0.0.0.0:43325 every 8 connection(s)
[ OK ] Parameters/TestRpc.TestCallId/SSL_TCP (91 ms)
[----------] 20 tests from Parameters/TestRpc (37761 ms total)
[----------] Global test environment tear-down
[==========] 21 tests from 2 test suites ran. (37769 ms total)
[ PASSED ] 20 tests.
[ FAILED ] 1 test, listed below:
[ FAILED ] Parameters/TestRpc.TestCallWithChainCertAndRootCA/SSL_TCP, where GetParam() = (true, false)
1 FAILED TEST