Diagnosed failure

Parameters/TestRpc.TestCallWithChainCertAndChainCA/SSL_UnixSocket: /data0/somelongdirectorytoavoidrpathissues/src/kudu/src/kudu/rpc/rpc-test.cc:270: Failure
Failed
Bad status: Runtime error: could not verify certificate chain (error with cert: subject=CN = localhost, ST = sadfjas, C = AS, emailAddress = sdflkdsajf, O = lskdfjlsad, OU = sldfkja, issuer=C = AS, ST = ASDfkjdhf, L = lskdjf, O = saldfja, OU = skdjf, CN = localhost, emailAddress = sadjflkadsj): : certificate has expired
Google Test trace:
/data0/somelongdirectorytoavoidrpathissues/src/kudu/src/kudu/rpc/rpc-test.cc:267: Connecting to unix:/tmp/dist-test-taskuZ9aln/test-tmp/rpc-test-0ac0473dc11b4b21a71aa7e8e5100fbc.sock
I20260929 10:50:27.529260  6218 test_util.cc:175] -----------------------------------------------
I20260929 10:50:27.529309  6218 test_util.cc:176] Had fatal failures, leaving test files at /tmp/dist-test-taskuZ9aln/test-tmp/rpc-test.6.Parameters_TestRpc.TestCallWithChainCertAndChainCA_SSL_UnixSocket.1790679027442659-6218-0

Full log

Note: This is test shard 7 of 8.
[==========] Running 21 tests from 2 test suites.
[----------] Global test environment set-up.
[----------] 20 tests from Parameters/TestRpc
[ RUN      ] Parameters/TestRpc.TestMessengerCreateDestroy/SSL_UnixSocket
WARNING: Logging before InitGoogleLogging() is written to STDERR
I20260929 10:50:27.489239  6218 rpc-test.cc:169] started messenger TestCreateDestroy
[       OK ] Parameters/TestRpc.TestMessengerCreateDestroy/SSL_UnixSocket (45 ms)
[ RUN      ] Parameters/TestRpc.TestNegotiationDeadlock/SSL_UnixSocket
I20260929 10:50:27.503029  6238 acceptor_pool.cc:254] collecting diagnostics on the listening RPC socket unix:/tmp/dist-test-taskuZ9aln/test-tmp/rpc-test-1b6c6a6370174d12a4dc5d81e56fac30.sock every 8 connection(s)
I20260929 10:50:27.503041  6239 acceptor_pool.cc:254] collecting diagnostics on the listening RPC socket unix:/tmp/dist-test-taskuZ9aln/test-tmp/rpc-test-1b6c6a6370174d12a4dc5d81e56fac30.sock every 8 connection(s)
[       OK ] Parameters/TestRpc.TestNegotiationDeadlock/SSL_UnixSocket (20 ms)
[ RUN      ] Parameters/TestRpc.TestCallWithChainCertAndChainCA/SSL_UnixSocket
I20260929 10:50:27.525348  6254 acceptor_pool.cc:254] collecting diagnostics on the listening RPC socket unix:/tmp/dist-test-taskuZ9aln/test-tmp/rpc-test-0ac0473dc11b4b21a71aa7e8e5100fbc.sock every 8 connection(s)
I20260929 10:50:27.525364  6255 acceptor_pool.cc:254] collecting diagnostics on the listening RPC socket unix:/tmp/dist-test-taskuZ9aln/test-tmp/rpc-test-0ac0473dc11b4b21a71aa7e8e5100fbc.sock every 8 connection(s)
/data0/somelongdirectorytoavoidrpathissues/src/kudu/src/kudu/rpc/rpc-test.cc:270: Failure
Failed
Bad status: Runtime error: could not verify certificate chain (error with cert: subject=CN = localhost, ST = sadfjas, C = AS, emailAddress = sdflkdsajf, O = lskdfjlsad, OU = sldfkja, issuer=C = AS, ST = ASDfkjdhf, L = lskdjf, O = saldfja, OU = skdjf, CN = localhost, emailAddress = sadjflkadsj): : certificate has expired
Google Test trace:
/data0/somelongdirectorytoavoidrpathissues/src/kudu/src/kudu/rpc/rpc-test.cc:267: Connecting to unix:/tmp/dist-test-taskuZ9aln/test-tmp/rpc-test-0ac0473dc11b4b21a71aa7e8e5100fbc.sock
I20260929 10:50:27.529260  6218 test_util.cc:175] -----------------------------------------------
I20260929 10:50:27.529309  6218 test_util.cc:176] Had fatal failures, leaving test files at /tmp/dist-test-taskuZ9aln/test-tmp/rpc-test.6.Parameters_TestRpc.TestCallWithChainCertAndChainCA_SSL_UnixSocket.1790679027442659-6218-0
[  FAILED  ] Parameters/TestRpc.TestCallWithChainCertAndChainCA/SSL_UnixSocket, where GetParam() = (true, true) (18 ms)
[ RUN      ] Parameters/TestRpc.TestCallWithPasswordProtectedKey/SSL_UnixSocket
I20260929 10:50:27.535374  6279 acceptor_pool.cc:254] collecting diagnostics on the listening RPC socket unix:/tmp/dist-test-taskuZ9aln/test-tmp/rpc-test-1314770292554d76be9d10c7df836728.sock every 8 connection(s)
I20260929 10:50:27.535426  6280 acceptor_pool.cc:254] collecting diagnostics on the listening RPC socket unix:/tmp/dist-test-taskuZ9aln/test-tmp/rpc-test-1314770292554d76be9d10c7df836728.sock every 8 connection(s)
W20260929 10:50:27.549146  6276 connection.cc:196] Error closing socket: Network error: TlsSocket::Close: Broken pipe
[       OK ] Parameters/TestRpc.TestCallWithPasswordProtectedKey/SSL_UnixSocket (20 ms)
[ RUN      ] Parameters/TestRpc.TestCallToBadServer/SSL_UnixSocket
I20260929 10:50:27.566891  6218 rpc-test.cc:394] Status: Network error: Client connection negotiation failed: client connection to 0.0.0.0:0: connect: Connection refused (error 111)
I20260929 10:50:27.567229  6218 rpc-test.cc:394] Status: Network error: Client connection negotiation failed: client connection to 0.0.0.0:0: connect: Connection refused (error 111)
I20260929 10:50:27.567534  6218 rpc-test.cc:394] Status: Network error: Client connection negotiation failed: client connection to 0.0.0.0:0: connect: Connection refused (error 111)
I20260929 10:50:27.567770  6218 rpc-test.cc:394] Status: Network error: Client connection negotiation failed: client connection to 0.0.0.0:0: connect: Connection refused (error 111)
I20260929 10:50:27.568059  6218 rpc-test.cc:394] Status: Network error: Client connection negotiation failed: client connection to 0.0.0.0:0: connect: Connection refused (error 111)
[       OK ] Parameters/TestRpc.TestCallToBadServer/SSL_UnixSocket (18 ms)
[ RUN      ] Parameters/TestRpc.TestWrongService/SSL_UnixSocket
I20260929 10:50:27.601244  6314 acceptor_pool.cc:254] collecting diagnostics on the listening RPC socket unix:/tmp/dist-test-taskuZ9aln/test-tmp/rpc-test-7bd530d7e3d348b0a8c25e93fb206987.sock every 8 connection(s)
I20260929 10:50:27.601289  6315 acceptor_pool.cc:254] collecting diagnostics on the listening RPC socket unix:/tmp/dist-test-taskuZ9aln/test-tmp/rpc-test-7bd530d7e3d348b0a8c25e93fb206987.sock every 8 connection(s)
I20260929 10:50:27.614270  6311 messenger.cc:345] service WrongServiceName not registered on TestServer
[       OK ] Parameters/TestRpc.TestWrongService/SSL_UnixSocket (47 ms)
[ RUN      ] Parameters/TestRpc.TestConnectionKeepalive/SSL_UnixSocket
I20260929 10:50:27.648517  6337 acceptor_pool.cc:254] collecting diagnostics on the listening RPC socket unix:/tmp/dist-test-taskuZ9aln/test-tmp/rpc-test-06585d1a27ff4639b6bcd86aa5cd5bcc.sock every 8 connection(s)
I20260929 10:50:27.648566  6338 acceptor_pool.cc:254] collecting diagnostics on the listening RPC socket unix:/tmp/dist-test-taskuZ9aln/test-tmp/rpc-test-06585d1a27ff4639b6bcd86aa5cd5bcc.sock every 8 connection(s)
I20260929 10:50:27.648751  6218 rpc-test.cc:488] Connecting to unix:/tmp/dist-test-taskuZ9aln/test-tmp/rpc-test-06585d1a27ff4639b6bcd86aa5cd5bcc.sock
W20260929 10:50:28.117930  6350 connection.cc:196] Error closing socket: Network error: TlsSocket::Close: Broken pipe
[       OK ] Parameters/TestRpc.TestConnectionKeepalive/SSL_UnixSocket (1050 ms)
[ RUN      ] Parameters/TestRpc.TestClientConnectionMetrics/SSL_UnixSocket
I20260929 10:50:28.690898  6362 acceptor_pool.cc:254] collecting diagnostics on the listening RPC socket unix:/tmp/dist-test-taskuZ9aln/test-tmp/rpc-test-5cfc8b6794e84fe6b8058c673d053826.sock every 8 connection(s)
I20260929 10:50:28.690958  6363 acceptor_pool.cc:254] collecting diagnostics on the listening RPC socket unix:/tmp/dist-test-taskuZ9aln/test-tmp/rpc-test-5cfc8b6794e84fe6b8058c673d053826.sock every 8 connection(s)
I20260929 10:50:28.691135  6218 rpc-test.cc:569] Connecting to unix:/tmp/dist-test-taskuZ9aln/test-tmp/rpc-test-5cfc8b6794e84fe6b8058c673d053826.sock
W20260929 10:50:36.905959  6359 connection.cc:196] Error closing socket: Network error: TlsSocket::Close: Broken pipe
[       OK ] Parameters/TestRpc.TestClientConnectionMetrics/SSL_UnixSocket (8239 ms)
[ RUN      ] Parameters/TestRpc.TestCredentialsPolicy/SSL_UnixSocket
I20260929 10:50:36.932528  6385 acceptor_pool.cc:254] collecting diagnostics on the listening RPC socket unix:/tmp/dist-test-taskuZ9aln/test-tmp/rpc-test-1aa5a42958f14c7fa5c0fd6c61c87c18.sock every 8 connection(s)
I20260929 10:50:36.932574  6386 acceptor_pool.cc:254] collecting diagnostics on the listening RPC socket unix:/tmp/dist-test-taskuZ9aln/test-tmp/rpc-test-1aa5a42958f14c7fa5c0fd6c61c87c18.sock every 8 connection(s)
I20260929 10:50:36.932739  6218 rpc-test.cc:700] Connecting to unix:/tmp/dist-test-taskuZ9aln/test-tmp/rpc-test-1aa5a42958f14c7fa5c0fd6c61c87c18.sock
W20260929 10:50:36.960722  6384 connection.cc:196] Error closing socket: Network error: TlsSocket::Close: Broken pipe
W20260929 10:50:36.965344  6384 connection.cc:196] Error closing socket: Network error: TlsSocket::Close: Broken pipe
[       OK ] Parameters/TestRpc.TestCredentialsPolicy/SSL_UnixSocket (59 ms)
[ RUN      ] Parameters/TestRpc.TestCallLongerThanKeepalive/SSL_UnixSocket
I20260929 10:50:36.982299  6410 acceptor_pool.cc:254] collecting diagnostics on the listening RPC socket unix:/tmp/dist-test-taskuZ9aln/test-tmp/rpc-test-70dc702c965a4fe69f140fe628bc1f0d.sock every 8 connection(s)
I20260929 10:50:36.982304  6411 acceptor_pool.cc:254] collecting diagnostics on the listening RPC socket unix:/tmp/dist-test-taskuZ9aln/test-tmp/rpc-test-70dc702c965a4fe69f140fe628bc1f0d.sock every 8 connection(s)
I20260929 10:50:36.991297  6414 rpc-test-base.h:222] got call: sleep_micros: 3000000 deferred: true
I20260929 10:50:39.991972  6414 rpcz_store.cc:275] Call kudu.rpc.GenericCalculatorService.Sleep from unix:<unnamed> (request call id 0) took 3000 ms. Trace:
I20260929 10:50:39.992081  6414 rpcz_store.cc:276] 0929 10:50:36.991197 (+     0us) service_pool.cc:170] Inserting onto call queue
0929 10:50:36.991244 (+    47us) service_pool.cc:227] Handling call
0929 10:50:39.991953 (+3000709us) inbound_call.cc:173] Queueing success response
Metrics: {}
W20260929 10:50:39.993003  6407 connection.cc:196] Error closing socket: Network error: TlsSocket::Close: Broken pipe
[       OK ] Parameters/TestRpc.TestCallLongerThanKeepalive/SSL_UnixSocket (3027 ms)
[ RUN      ] Parameters/TestRpc.TestRpcSidecar/SSL_UnixSocket
I20260929 10:50:40.005311  6435 acceptor_pool.cc:254] collecting diagnostics on the listening RPC socket unix:/tmp/dist-test-taskuZ9aln/test-tmp/rpc-test-6c37bed0d988418d9b068fc14cc87e16.sock every 8 connection(s)
I20260929 10:50:40.005409  6436 acceptor_pool.cc:254] collecting diagnostics on the listening RPC socket unix:/tmp/dist-test-taskuZ9aln/test-tmp/rpc-test-6c37bed0d988418d9b068fc14cc87e16.sock every 8 connection(s)
W20260929 10:50:40.053130  6432 connection.cc:196] Error closing socket: Network error: TlsSocket::Close: Broken pipe
[       OK ] Parameters/TestRpc.TestRpcSidecar/SSL_UnixSocket (60 ms)
[ RUN      ] Parameters/TestRpc.TestRpcSidecarLimits/SSL_UnixSocket
I20260929 10:50:42.522692  6460 acceptor_pool.cc:254] collecting diagnostics on the listening RPC socket unix:/tmp/dist-test-taskuZ9aln/test-tmp/rpc-test-431c6146a1ea42cbaa8df28d57645642.sock every 8 connection(s)
I20260929 10:50:42.522746  6461 acceptor_pool.cc:254] collecting diagnostics on the listening RPC socket unix:/tmp/dist-test-taskuZ9aln/test-tmp/rpc-test-431c6146a1ea42cbaa8df28d57645642.sock every 8 connection(s)
W20260929 10:50:42.542164  6218 serialization.cc:72] Serialized kudu.rpc_test.PushStringsRequestPB (2147483654 bytes) is larger than the maximum configured RPC message size (52428800 bytes). Sending anyway, but peer may reject the data.
W20260929 10:50:42.545426  6457 connection.cc:535] server connection from unix:<unnamed> recv error: Network error: RPC frame had a length of 2147483714, but we only support messages up to 52428800 bytes long.
W20260929 10:50:42.545504  6457 connection.cc:158] shutting down server connection from unix:<unnamed> with pending inbound data: 4/2147483714 bytes received; last active 0 ns ago: status Network error: RPC frame had a length of 2147483714, but we only support messages up to 52428800 bytes long.
W20260929 10:50:42.545637  6473 connection.cc:698] client connection to unix:/tmp/dist-test-taskuZ9aln/test-tmp/rpc-test-431c6146a1ea42cbaa8df28d57645642.sock send error: Network error: failed to write to TLS socket: Broken pipe
W20260929 10:50:42.545787  6473 connection.cc:196] Error closing socket: Network error: TlsSocket::Close: Success
I20260929 10:50:42.561199  6485 acceptor_pool.cc:254] collecting diagnostics on the listening RPC socket unix:/tmp/dist-test-taskuZ9aln/test-tmp/rpc-test-431c6146a1ea42cbaa8df28d57645642.sock every 8 connection(s)
I20260929 10:50:42.561280  6486 acceptor_pool.cc:254] collecting diagnostics on the listening RPC socket unix:/tmp/dist-test-taskuZ9aln/test-tmp/rpc-test-431c6146a1ea42cbaa8df28d57645642.sock every 8 connection(s)
W20260929 10:50:47.231614  6482 connection.cc:577] server connection from unix:<unnamed>: received bad data: 'Corruption: Invalid packet: message had a length of 2147483710, but we only support messages up to 2147483647 bytes
'
W20260929 10:50:47.231984  6498 connection.cc:196] Error closing socket: Network error: TlsSocket::Close: Broken pipe
[       OK ] Parameters/TestRpc.TestRpcSidecarLimits/SSL_UnixSocket (7180 ms)
[ RUN      ] Parameters/TestRpc.TestCallTimeoutDoesntAffectNegotiation/SSL_UnixSocket
I20260929 10:50:47.247896  6510 acceptor_pool.cc:254] collecting diagnostics on the listening RPC socket unix:/tmp/dist-test-taskuZ9aln/test-tmp/rpc-test-9df53b0f923f453fbe94660044b660d9.sock every 8 connection(s)
I20260929 10:50:47.248123  6511 acceptor_pool.cc:254] collecting diagnostics on the listening RPC socket unix:/tmp/dist-test-taskuZ9aln/test-tmp/rpc-test-9df53b0f923f453fbe94660044b660d9.sock every 8 connection(s)
W20260929 10:50:47.259547  6506 negotiation.cc:266] Injecting 500ms delay in negotiation
I20260929 10:50:47.309852  6218 rpc-test-base.h:595] status: Timed out: connection negotiation to unix:/tmp/dist-test-taskuZ9aln/test-tmp/rpc-test-9df53b0f923f453fbe94660044b660d9.sock for RPC Sleep timed out after 0.050s (ON_OUTBOUND_QUEUE), seconds elapsed: 0.0506509
W20260929 10:50:47.763913  6507 connection.cc:196] Error closing socket: Network error: TlsSocket::Close: Broken pipe
[       OK ] Parameters/TestRpc.TestCallTimeoutDoesntAffectNegotiation/SSL_UnixSocket (529 ms)
[ RUN      ] Parameters/TestRpc.TestRpcHandlerLatencyMetric/SSL_UnixSocket
I20260929 10:50:47.773466  6535 acceptor_pool.cc:254] collecting diagnostics on the listening RPC socket unix:/tmp/dist-test-taskuZ9aln/test-tmp/rpc-test-54e2a1c20c7b4249934cf1edd818b1fe.sock every 8 connection(s)
I20260929 10:50:47.773607  6536 acceptor_pool.cc:254] collecting diagnostics on the listening RPC socket unix:/tmp/dist-test-taskuZ9aln/test-tmp/rpc-test-54e2a1c20c7b4249934cf1edd818b1fe.sock every 8 connection(s)
I20260929 10:50:47.835022  6218 rpc-test.cc:1236] Sleep() min lat: 20289
I20260929 10:50:47.835096  6218 rpc-test.cc:1237] Sleep() mean lat: 20289
I20260929 10:50:47.835124  6218 rpc-test.cc:1238] Sleep() max lat: 20289
I20260929 10:50:47.835137  6218 rpc-test.cc:1239] Sleep() #calls: 1
W20260929 10:50:47.835762  6532 connection.cc:196] Error closing socket: Network error: TlsSocket::Close: Broken pipe
[       OK ] Parameters/TestRpc.TestRpcHandlerLatencyMetric/SSL_UnixSocket (72 ms)
[ RUN      ] Parameters/TestRpc.TimedOutOnResponseMetricServiceQueue/SSL_UnixSocket
I20260929 10:50:47.889837  6562 acceptor_pool.cc:254] collecting diagnostics on the listening RPC socket unix:/tmp/dist-test-taskuZ9aln/test-tmp/rpc-test-67c3af415f8041469133f4a0f0b1fe18.sock every 8 connection(s)
I20260929 10:50:47.889954  6561 acceptor_pool.cc:254] collecting diagnostics on the listening RPC socket unix:/tmp/dist-test-taskuZ9aln/test-tmp/rpc-test-67c3af415f8041469133f4a0f0b1fe18.sock every 8 connection(s)
W20260929 10:50:47.953926  6563 rpcz_store.cc:267] Call kudu.rpc_test.CalculatorService.Sleep from unix:<unnamed> (request call id 2) took 20 ms (client timeout 20 ms). Trace:
W20260929 10:50:47.954058  6563 rpcz_store.cc:269] 0929 10:50:47.933665 (+     0us) service_pool.cc:170] Inserting onto call queue
0929 10:50:47.953902 (+ 20237us) service_pool.cc:214] Skipping call since client already timed out
0929 10:50:47.953912 (+    10us) inbound_call.cc:173] Queueing failure response
Metrics: {}
[       OK ] Parameters/TestRpc.TimedOutOnResponseMetricServiceQueue/SSL_UnixSocket (118 ms)
[ RUN      ] Parameters/TestRpc.RpcPendingConnectionsMetric/SSL_UnixSocket
I20260929 10:50:47.957480  6584 acceptor_pool.cc:254] collecting diagnostics on the listening RPC socket 0.0.0.0:45543 every 8 connection(s)
I20260929 10:50:47.957546  6585 acceptor_pool.cc:254] collecting diagnostics on the listening RPC socket 0.0.0.0:45543 every 8 connection(s)
W20260929 10:50:47.958164  6580 negotiation.cc:337] Failed RPC negotiation. Trace:
0929 10:50:47.957981 (+     0us) reactor.cc:625] Submitting negotiation task for server connection from 127.0.0.1:46430 (local address 127.0.0.1:45543)
0929 10:50:47.958035 (+    54us) server_negotiation.cc:206] Beginning negotiation
0929 10:50:47.958037 (+     2us) server_negotiation.cc:399] Waiting for connection header
0929 10:50:47.958114 (+    77us) negotiation.cc:327] Negotiation complete: Network error: Server connection negotiation failed: server connection from 127.0.0.1:46430: BlockingRecv error: recv got EOF from 127.0.0.1:46430 (error 108)
Metrics: {"server-negotiator.queue_time_us":26}
[       OK ] Parameters/TestRpc.RpcPendingConnectionsMetric/SSL_UnixSocket (13 ms)
[ RUN      ] Parameters/TestRpc.TestRpcContextClientDeadline/SSL_UnixSocket
I20260929 10:50:47.981761  6600 acceptor_pool.cc:254] collecting diagnostics on the listening RPC socket unix:/tmp/dist-test-taskuZ9aln/test-tmp/rpc-test-9a45c01621b34a1683416e51128bf169.sock every 8 connection(s)
I20260929 10:50:47.981802  6601 acceptor_pool.cc:254] collecting diagnostics on the listening RPC socket unix:/tmp/dist-test-taskuZ9aln/test-tmp/rpc-test-9a45c01621b34a1683416e51128bf169.sock every 8 connection(s)
[       OK ] Parameters/TestRpc.TestRpcContextClientDeadline/SSL_UnixSocket (55 ms)
[ RUN      ] Parameters/TestRpc.TestApplicationFeatureFlagUnsupportedServer/SSL_UnixSocket
I20260929 10:50:48.035187  6625 acceptor_pool.cc:254] collecting diagnostics on the listening RPC socket unix:/tmp/dist-test-taskuZ9aln/test-tmp/rpc-test-0b996b3221dc470cb43cbb0dd5b41f05.sock every 8 connection(s)
I20260929 10:50:48.035223  6626 acceptor_pool.cc:254] collecting diagnostics on the listening RPC socket unix:/tmp/dist-test-taskuZ9aln/test-tmp/rpc-test-0b996b3221dc470cb43cbb0dd5b41f05.sock every 8 connection(s)
W20260929 10:50:48.083210  6622 connection.cc:196] Error closing socket: Network error: TlsSocket::Close: Broken pipe
[       OK ] Parameters/TestRpc.TestApplicationFeatureFlagUnsupportedServer/SSL_UnixSocket (59 ms)
[ RUN      ] Parameters/TestRpc.TestCancellationAsync/SSL_UnixSocket
I20260929 10:50:48.107764  6650 acceptor_pool.cc:254] collecting diagnostics on the listening RPC socket unix:/tmp/dist-test-taskuZ9aln/test-tmp/rpc-test-d065f87b7d054c7abc5139d4eaa3ec1a.sock every 8 connection(s)
I20260929 10:50:48.107846  6651 acceptor_pool.cc:254] collecting diagnostics on the listening RPC socket unix:/tmp/dist-test-taskuZ9aln/test-tmp/rpc-test-d065f87b7d054c7abc5139d4eaa3ec1a.sock every 8 connection(s)
I20260929 10:50:48.108012  6218 rpc-test.cc:1716] Connecting to unix:/tmp/dist-test-taskuZ9aln/test-tmp/rpc-test-d065f87b7d054c7abc5139d4eaa3ec1a.sock
I20260929 10:50:48.117977  6218 test_util.cc:268] Using random seed: -191766826
I20260929 10:50:48.132511  6654 rpc-test-base.h:240] got call: sleep_micros: 500 pattern: 4294967295 num_repetitions: 2097152 sidecar_idx: 0
I20260929 10:50:48.143018  6654 rpc-test-base.h:240] got call: sleep_micros: 500 pattern: 4294967295 num_repetitions: 2097152 sidecar_idx: 0
I20260929 10:50:48.153370  6654 rpc-test-base.h:240] got call: sleep_micros: 500 pattern: 4294967295 num_repetitions: 2097152 sidecar_idx: 0
I20260929 10:50:48.163513  6654 rpc-test-base.h:240] got call: sleep_micros: 500 pattern: 4294967295 num_repetitions: 2097152 sidecar_idx: 0
I20260929 10:50:48.173724  6654 rpc-test-base.h:240] got call: sleep_micros: 500 pattern: 4294967295 num_repetitions: 2097152 sidecar_idx: 0
I20260929 10:50:48.184453  6654 rpc-test-base.h:240] got call: sleep_micros: 500 pattern: 4294967295 num_repetitions: 2097152 sidecar_idx: 0
I20260929 10:50:48.194727  6654 rpc-test-base.h:240] got call: sleep_micros: 500 pattern: 4294967295 num_repetitions: 2097152 sidecar_idx: 0
I20260929 10:50:48.205044  6654 rpc-test-base.h:240] got call: sleep_micros: 500 pattern: 4294967295 num_repetitions: 2097152 sidecar_idx: 0
W20260929 10:50:48.206640  6647 connection.cc:196] Error closing socket: Network error: TlsSocket::Close: Broken pipe
W20260929 10:50:48.208261  6647 connection.cc:441] server connection from unix:<unnamed> torn down before Call kudu.rpc.GenericCalculatorService.SleepWithSidecar from unix:<unnamed> (request call id 9) could send its response
[       OK ] Parameters/TestRpc.TestCancellationAsync/SSL_UnixSocket (125 ms)
[ RUN      ] Parameters/TestRpc.TestPerformanceBySocketType/SSL_UnixSocket
I20260929 10:50:48.238716  6675 acceptor_pool.cc:254] collecting diagnostics on the listening RPC socket unix:/tmp/dist-test-taskuZ9aln/test-tmp/rpc-test-2b28d8e8c4b14db3a2e7f58549352c79.sock every 8 connection(s)
I20260929 10:50:48.238775  6676 acceptor_pool.cc:254] collecting diagnostics on the listening RPC socket unix:/tmp/dist-test-taskuZ9aln/test-tmp/rpc-test-2b28d8e8c4b14db3a2e7f58549352c79.sock every 8 connection(s)
I20260929 10:50:48.239138  6218 rpc-test.cc:1846] Connecting to unix:/tmp/dist-test-taskuZ9aln/test-tmp/rpc-test-2b28d8e8c4b14db3a2e7f58549352c79.sock
I20260929 10:50:49.481179  6218 rpc-test.cc:1859] Sending 1024MB via ssl-enabled unix socket: real 1.226s	user 1.322s	sys 0.884s
I20260929 10:50:50.704182  6218 rpc-test.cc:1859] Sending 1024MB via ssl-enabled unix socket: real 1.223s	user 1.304s	sys 0.899s
I20260929 10:50:51.973023  6218 rpc-test.cc:1859] Sending 1024MB via ssl-enabled unix socket: real 1.269s	user 1.454s	sys 0.824s
I20260929 10:50:53.262475  6218 rpc-test.cc:1859] Sending 1024MB via ssl-enabled unix socket: real 1.289s	user 1.373s	sys 0.935s
I20260929 10:50:54.480825  6218 rpc-test.cc:1859] Sending 1024MB via ssl-enabled unix socket: real 1.218s	user 1.243s	sys 0.947s
W20260929 10:50:54.481608  6672 connection.cc:196] Error closing socket: Network error: TlsSocket::Close: Broken pipe
[       OK ] Parameters/TestRpc.TestPerformanceBySocketType/SSL_UnixSocket (6273 ms)
[----------] 20 tests from Parameters/TestRpc (27037 ms total)

[----------] 1 test from Parameters/TestRpcSocketTxRxQueue
[ RUN      ] Parameters/TestRpcSocketTxRxQueue.AcceptorRxQueueSizeMetric/0
I20260929 10:50:54.484295  6700 acceptor_pool.cc:254] collecting diagnostics on the listening RPC socket 0.0.0.0:41317 every 1 connection(s)
I20260929 10:50:54.484369  6701 acceptor_pool.cc:254] collecting diagnostics on the listening RPC socket 0.0.0.0:41317 every 1 connection(s)
W20260929 10:50:54.484887  6696 negotiation.cc:337] Failed RPC negotiation. Trace:
0929 10:50:54.484737 (+     0us) reactor.cc:625] Submitting negotiation task for server connection from 127.0.0.1:47674 (local address 127.0.0.1:41317)
0929 10:50:54.484777 (+    40us) server_negotiation.cc:206] Beginning negotiation
0929 10:50:54.484778 (+     1us) server_negotiation.cc:399] Waiting for connection header
0929 10:50:54.484854 (+    76us) negotiation.cc:327] Negotiation complete: Network error: Server connection negotiation failed: server connection from 127.0.0.1:47674: BlockingRecv error: recv got EOF from 127.0.0.1:47674 (error 108)
Metrics: {"server-negotiator.queue_time_us":14}
[       OK ] Parameters/TestRpcSocketTxRxQueue.AcceptorRxQueueSizeMetric/0 (4 ms)
[----------] 1 test from Parameters/TestRpcSocketTxRxQueue (4 ms total)

[----------] Global test environment tear-down
[==========] 21 tests from 2 test suites ran. (27041 ms total)
[  PASSED  ] 20 tests.
[  FAILED  ] 1 test, listed below:
[  FAILED  ] Parameters/TestRpc.TestCallWithChainCertAndChainCA/SSL_UnixSocket, where GetParam() = (true, true)

 1 FAILED TEST