Diagnosed failure
Parameters/TestRpc.TestCallWithChainCertAndChainCA/SSL_UnixSocket: /data0/somelongdirectorytoavoidrpathissues/src/kudu/src/kudu/rpc/rpc-test.cc:270: Failure
Failed
Bad status: Runtime error: could not verify certificate chain (error with cert: subject=CN = localhost, ST = sadfjas, C = AS, emailAddress = sdflkdsajf, O = lskdfjlsad, OU = sldfkja, issuer=C = AS, ST = ASDfkjdhf, L = lskdjf, O = saldfja, OU = skdjf, CN = localhost, emailAddress = sadjflkadsj): : certificate has expired
Google Test trace:
/data0/somelongdirectorytoavoidrpathissues/src/kudu/src/kudu/rpc/rpc-test.cc:267: Connecting to unix:/tmp/dist-test-task3ISvla/test-tmp/rpc-test-c4907fa3d6b142d791995021fb83d9bd.sock
I20260928 05:50:37.299245 773 test_util.cc:175] -----------------------------------------------
I20260928 05:50:37.299331 773 test_util.cc:176] Had fatal failures, leaving test files at /tmp/dist-test-task3ISvla/test-tmp/rpc-test.6.Parameters_TestRpc.TestCallWithChainCertAndChainCA_SSL_UnixSocket.1790574637169245-773-0
Full log
Note: This is test shard 7 of 8.
[==========] Running 21 tests from 2 test suites.
[----------] Global test environment set-up.
[----------] 20 tests from Parameters/TestRpc
[ RUN ] Parameters/TestRpc.TestMessengerCreateDestroy/SSL_UnixSocket
WARNING: Logging before InitGoogleLogging() is written to STDERR
I20260928 05:50:37.224788 773 rpc-test.cc:169] started messenger TestCreateDestroy
[ OK ] Parameters/TestRpc.TestMessengerCreateDestroy/SSL_UnixSocket (39 ms)
[ RUN ] Parameters/TestRpc.TestNegotiationDeadlock/SSL_UnixSocket
I20260928 05:50:37.260119 793 acceptor_pool.cc:254] collecting diagnostics on the listening RPC socket unix:/tmp/dist-test-task3ISvla/test-tmp/rpc-test-e13c24f8e87c4ce3a4a8975e95a3f4a9.sock every 8 connection(s)
I20260928 05:50:37.260439 794 acceptor_pool.cc:254] collecting diagnostics on the listening RPC socket unix:/tmp/dist-test-task3ISvla/test-tmp/rpc-test-e13c24f8e87c4ce3a4a8975e95a3f4a9.sock every 8 connection(s)
[ OK ] Parameters/TestRpc.TestNegotiationDeadlock/SSL_UnixSocket (50 ms)
[ RUN ] Parameters/TestRpc.TestCallWithChainCertAndChainCA/SSL_UnixSocket
I20260928 05:50:37.288579 809 acceptor_pool.cc:254] collecting diagnostics on the listening RPC socket unix:/tmp/dist-test-task3ISvla/test-tmp/rpc-test-c4907fa3d6b142d791995021fb83d9bd.sock every 8 connection(s)
I20260928 05:50:37.288918 810 acceptor_pool.cc:254] collecting diagnostics on the listening RPC socket unix:/tmp/dist-test-task3ISvla/test-tmp/rpc-test-c4907fa3d6b142d791995021fb83d9bd.sock every 8 connection(s)
/data0/somelongdirectorytoavoidrpathissues/src/kudu/src/kudu/rpc/rpc-test.cc:270: Failure
Failed
Bad status: Runtime error: could not verify certificate chain (error with cert: subject=CN = localhost, ST = sadfjas, C = AS, emailAddress = sdflkdsajf, O = lskdfjlsad, OU = sldfkja, issuer=C = AS, ST = ASDfkjdhf, L = lskdjf, O = saldfja, OU = skdjf, CN = localhost, emailAddress = sadjflkadsj): : certificate has expired
Google Test trace:
/data0/somelongdirectorytoavoidrpathissues/src/kudu/src/kudu/rpc/rpc-test.cc:267: Connecting to unix:/tmp/dist-test-task3ISvla/test-tmp/rpc-test-c4907fa3d6b142d791995021fb83d9bd.sock
I20260928 05:50:37.299245 773 test_util.cc:175] -----------------------------------------------
I20260928 05:50:37.299331 773 test_util.cc:176] Had fatal failures, leaving test files at /tmp/dist-test-task3ISvla/test-tmp/rpc-test.6.Parameters_TestRpc.TestCallWithChainCertAndChainCA_SSL_UnixSocket.1790574637169245-773-0
[ FAILED ] Parameters/TestRpc.TestCallWithChainCertAndChainCA/SSL_UnixSocket, where GetParam() = (true, true) (21 ms)
[ RUN ] Parameters/TestRpc.TestCallWithPasswordProtectedKey/SSL_UnixSocket
I20260928 05:50:37.313433 834 acceptor_pool.cc:254] collecting diagnostics on the listening RPC socket unix:/tmp/dist-test-task3ISvla/test-tmp/rpc-test-314e11d986e5443c8e49667b7bcc7b96.sock every 8 connection(s)
I20260928 05:50:37.313655 835 acceptor_pool.cc:254] collecting diagnostics on the listening RPC socket unix:/tmp/dist-test-task3ISvla/test-tmp/rpc-test-314e11d986e5443c8e49667b7bcc7b96.sock every 8 connection(s)
W20260928 05:50:37.341867 831 connection.cc:196] Error closing socket: Network error: TlsSocket::Close: Broken pipe
[ OK ] Parameters/TestRpc.TestCallWithPasswordProtectedKey/SSL_UnixSocket (46 ms)
[ RUN ] Parameters/TestRpc.TestCallToBadServer/SSL_UnixSocket
I20260928 05:50:37.376855 773 rpc-test.cc:394] Status: Network error: Client connection negotiation failed: client connection to 0.0.0.0:0: connect: Connection refused (error 111)
I20260928 05:50:37.377548 773 rpc-test.cc:394] Status: Network error: Client connection negotiation failed: client connection to 0.0.0.0:0: connect: Connection refused (error 111)
I20260928 05:50:37.378123 773 rpc-test.cc:394] Status: Network error: Client connection negotiation failed: client connection to 0.0.0.0:0: connect: Connection refused (error 111)
I20260928 05:50:37.378676 773 rpc-test.cc:394] Status: Network error: Client connection negotiation failed: client connection to 0.0.0.0:0: connect: Connection refused (error 111)
I20260928 05:50:37.379244 773 rpc-test.cc:394] Status: Network error: Client connection negotiation failed: client connection to 0.0.0.0:0: connect: Connection refused (error 111)
[ OK ] Parameters/TestRpc.TestCallToBadServer/SSL_UnixSocket (35 ms)
[ RUN ] Parameters/TestRpc.TestWrongService/SSL_UnixSocket
I20260928 05:50:37.395071 869 acceptor_pool.cc:254] collecting diagnostics on the listening RPC socket unix:/tmp/dist-test-task3ISvla/test-tmp/rpc-test-c43dba148fe546fdbc5fcdc02c7df4ef.sock every 8 connection(s)
I20260928 05:50:37.395296 870 acceptor_pool.cc:254] collecting diagnostics on the listening RPC socket unix:/tmp/dist-test-task3ISvla/test-tmp/rpc-test-c43dba148fe546fdbc5fcdc02c7df4ef.sock every 8 connection(s)
I20260928 05:50:37.410420 866 messenger.cc:345] service WrongServiceName not registered on TestServer
[ OK ] Parameters/TestRpc.TestWrongService/SSL_UnixSocket (33 ms)
[ RUN ] Parameters/TestRpc.TestConnectionKeepalive/SSL_UnixSocket
I20260928 05:50:37.429251 892 acceptor_pool.cc:254] collecting diagnostics on the listening RPC socket unix:/tmp/dist-test-task3ISvla/test-tmp/rpc-test-a9fb3633cd6141cbab6f246d41de4eab.sock every 8 connection(s)
I20260928 05:50:37.429489 893 acceptor_pool.cc:254] collecting diagnostics on the listening RPC socket unix:/tmp/dist-test-task3ISvla/test-tmp/rpc-test-a9fb3633cd6141cbab6f246d41de4eab.sock every 8 connection(s)
I20260928 05:50:37.430339 773 rpc-test.cc:488] Connecting to unix:/tmp/dist-test-task3ISvla/test-tmp/rpc-test-a9fb3633cd6141cbab6f246d41de4eab.sock
W20260928 05:50:37.917032 905 connection.cc:196] Error closing socket: Network error: TlsSocket::Close: Broken pipe
[ OK ] Parameters/TestRpc.TestConnectionKeepalive/SSL_UnixSocket (1039 ms)
[ RUN ] Parameters/TestRpc.TestClientConnectionMetrics/SSL_UnixSocket
I20260928 05:50:38.488772 917 acceptor_pool.cc:254] collecting diagnostics on the listening RPC socket unix:/tmp/dist-test-task3ISvla/test-tmp/rpc-test-789db5b32e294ab191df14ea68ef571e.sock every 8 connection(s)
I20260928 05:50:38.489004 918 acceptor_pool.cc:254] collecting diagnostics on the listening RPC socket unix:/tmp/dist-test-task3ISvla/test-tmp/rpc-test-789db5b32e294ab191df14ea68ef571e.sock every 8 connection(s)
I20260928 05:50:38.489925 773 rpc-test.cc:569] Connecting to unix:/tmp/dist-test-task3ISvla/test-tmp/rpc-test-789db5b32e294ab191df14ea68ef571e.sock
W20260928 05:50:58.854470 914 connection.cc:196] Error closing socket: Network error: TlsSocket::Close: Broken pipe
[ OK ] Parameters/TestRpc.TestClientConnectionMetrics/SSL_UnixSocket (20406 ms)
[ RUN ] Parameters/TestRpc.TestCredentialsPolicy/SSL_UnixSocket
I20260928 05:50:58.871601 940 acceptor_pool.cc:254] collecting diagnostics on the listening RPC socket unix:/tmp/dist-test-task3ISvla/test-tmp/rpc-test-14f8841283df4007a5944f751c5ea21e.sock every 8 connection(s)
I20260928 05:50:58.871833 941 acceptor_pool.cc:254] collecting diagnostics on the listening RPC socket unix:/tmp/dist-test-task3ISvla/test-tmp/rpc-test-14f8841283df4007a5944f751c5ea21e.sock every 8 connection(s)
I20260928 05:50:58.872726 773 rpc-test.cc:700] Connecting to unix:/tmp/dist-test-task3ISvla/test-tmp/rpc-test-14f8841283df4007a5944f751c5ea21e.sock
W20260928 05:50:58.897543 939 connection.cc:196] Error closing socket: Network error: TlsSocket::Close: Broken pipe
[ OK ] Parameters/TestRpc.TestCredentialsPolicy/SSL_UnixSocket (46 ms)
[ RUN ] Parameters/TestRpc.TestCallLongerThanKeepalive/SSL_UnixSocket
I20260928 05:50:58.916412 965 acceptor_pool.cc:254] collecting diagnostics on the listening RPC socket unix:/tmp/dist-test-task3ISvla/test-tmp/rpc-test-2f79015c61874b70a2697eb8deca20c0.sock every 8 connection(s)
I20260928 05:50:58.916603 966 acceptor_pool.cc:254] collecting diagnostics on the listening RPC socket unix:/tmp/dist-test-task3ISvla/test-tmp/rpc-test-2f79015c61874b70a2697eb8deca20c0.sock every 8 connection(s)
I20260928 05:50:58.938740 969 rpc-test-base.h:222] got call: sleep_micros: 3000000 deferred: true
I20260928 05:51:01.940398 969 rpcz_store.cc:275] Call kudu.rpc.GenericCalculatorService.Sleep from unix:<unnamed> (request call id 0) took 3001 ms. Trace:
I20260928 05:51:01.940593 969 rpcz_store.cc:276] 0928 05:50:58.938635 (+ 0us) service_pool.cc:170] Inserting onto call queue
0928 05:50:58.938701 (+ 66us) service_pool.cc:227] Handling call
0928 05:51:01.940357 (+3001656us) inbound_call.cc:173] Queueing success response
Metrics: {}
W20260928 05:51:01.942837 962 connection.cc:196] Error closing socket: Network error: TlsSocket::Close: Broken pipe
[ OK ] Parameters/TestRpc.TestCallLongerThanKeepalive/SSL_UnixSocket (3039 ms)
[ RUN ] Parameters/TestRpc.TestRpcSidecar/SSL_UnixSocket
I20260928 05:51:01.970641 990 acceptor_pool.cc:254] collecting diagnostics on the listening RPC socket unix:/tmp/dist-test-task3ISvla/test-tmp/rpc-test-3c0322f5dbfa4ba9b5a6fef3427e6b5d.sock every 8 connection(s)
I20260928 05:51:01.970891 991 acceptor_pool.cc:254] collecting diagnostics on the listening RPC socket unix:/tmp/dist-test-task3ISvla/test-tmp/rpc-test-3c0322f5dbfa4ba9b5a6fef3427e6b5d.sock every 8 connection(s)
W20260928 05:51:02.060922 987 connection.cc:196] Error closing socket: Network error: TlsSocket::Close: Broken pipe
[ OK ] Parameters/TestRpc.TestRpcSidecar/SSL_UnixSocket (117 ms)
[ RUN ] Parameters/TestRpc.TestRpcSidecarLimits/SSL_UnixSocket
I20260928 05:51:04.121178 1015 acceptor_pool.cc:254] collecting diagnostics on the listening RPC socket unix:/tmp/dist-test-task3ISvla/test-tmp/rpc-test-999bfd83349a4afc82cfb73a45812bb0.sock every 8 connection(s)
I20260928 05:51:04.121451 1016 acceptor_pool.cc:254] collecting diagnostics on the listening RPC socket unix:/tmp/dist-test-task3ISvla/test-tmp/rpc-test-999bfd83349a4afc82cfb73a45812bb0.sock every 8 connection(s)
W20260928 05:51:04.140316 773 serialization.cc:72] Serialized kudu.rpc_test.PushStringsRequestPB (2147483654 bytes) is larger than the maximum configured RPC message size (52428800 bytes). Sending anyway, but peer may reject the data.
W20260928 05:51:04.145776 1012 connection.cc:535] server connection from unix:<unnamed> recv error: Network error: RPC frame had a length of 2147483714, but we only support messages up to 52428800 bytes long.
W20260928 05:51:04.145864 1012 connection.cc:158] shutting down server connection from unix:<unnamed> with pending inbound data: 4/2147483714 bytes received; last active 0 ns ago: status Network error: RPC frame had a length of 2147483714, but we only support messages up to 52428800 bytes long.
W20260928 05:51:04.146294 1028 connection.cc:196] Error closing socket: Network error: TlsSocket::Close: Broken pipe
I20260928 05:51:04.158322 1040 acceptor_pool.cc:254] collecting diagnostics on the listening RPC socket unix:/tmp/dist-test-task3ISvla/test-tmp/rpc-test-999bfd83349a4afc82cfb73a45812bb0.sock every 8 connection(s)
I20260928 05:51:04.158499 1041 acceptor_pool.cc:254] collecting diagnostics on the listening RPC socket unix:/tmp/dist-test-task3ISvla/test-tmp/rpc-test-999bfd83349a4afc82cfb73a45812bb0.sock every 8 connection(s)
W20260928 05:51:09.810600 1037 connection.cc:577] server connection from unix:<unnamed>: received bad data: 'Corruption: Invalid packet: message had a length of 2147483710, but we only support messages up to 2147483647 bytes
'
W20260928 05:51:09.811144 1053 connection.cc:196] Error closing socket: Network error: TlsSocket::Close: Broken pipe
[ OK ] Parameters/TestRpc.TestRpcSidecarLimits/SSL_UnixSocket (8207 ms)
[ RUN ] Parameters/TestRpc.TestCallTimeoutDoesntAffectNegotiation/SSL_UnixSocket
I20260928 05:51:10.291153 1065 acceptor_pool.cc:254] collecting diagnostics on the listening RPC socket unix:/tmp/dist-test-task3ISvla/test-tmp/rpc-test-959ed2d20c644b82a31dba9f4b255d5f.sock every 8 connection(s)
I20260928 05:51:10.291443 1066 acceptor_pool.cc:254] collecting diagnostics on the listening RPC socket unix:/tmp/dist-test-task3ISvla/test-tmp/rpc-test-959ed2d20c644b82a31dba9f4b255d5f.sock every 8 connection(s)
W20260928 05:51:10.328305 1061 negotiation.cc:266] Injecting 500ms delay in negotiation
I20260928 05:51:10.378702 773 rpc-test-base.h:595] status: Timed out: connection negotiation to unix:/tmp/dist-test-task3ISvla/test-tmp/rpc-test-959ed2d20c644b82a31dba9f4b255d5f.sock for RPC Sleep timed out after 0.050s (ON_OUTBOUND_QUEUE), seconds elapsed: 0.0510748
W20260928 05:51:10.834669 1062 connection.cc:196] Error closing socket: Network error: TlsSocket::Close: Broken pipe
[ OK ] Parameters/TestRpc.TestCallTimeoutDoesntAffectNegotiation/SSL_UnixSocket (565 ms)
[ RUN ] Parameters/TestRpc.TestRpcHandlerLatencyMetric/SSL_UnixSocket
I20260928 05:51:10.850546 1090 acceptor_pool.cc:254] collecting diagnostics on the listening RPC socket unix:/tmp/dist-test-task3ISvla/test-tmp/rpc-test-512f7fe234324072bc36cde5c9a6eb99.sock every 8 connection(s)
I20260928 05:51:10.850771 1091 acceptor_pool.cc:254] collecting diagnostics on the listening RPC socket unix:/tmp/dist-test-task3ISvla/test-tmp/rpc-test-512f7fe234324072bc36cde5c9a6eb99.sock every 8 connection(s)
I20260928 05:51:10.907712 773 rpc-test.cc:1236] Sleep() min lat: 20672
I20260928 05:51:10.907795 773 rpc-test.cc:1237] Sleep() mean lat: 20672
I20260928 05:51:10.907838 773 rpc-test.cc:1238] Sleep() max lat: 20672
I20260928 05:51:10.907855 773 rpc-test.cc:1239] Sleep() #calls: 1
[ OK ] Parameters/TestRpc.TestRpcHandlerLatencyMetric/SSL_UnixSocket (75 ms)
[ RUN ] Parameters/TestRpc.TimedOutOnResponseMetricServiceQueue/SSL_UnixSocket
I20260928 05:51:10.920351 1116 acceptor_pool.cc:254] collecting diagnostics on the listening RPC socket unix:/tmp/dist-test-task3ISvla/test-tmp/rpc-test-c002492e734a4c7da60133523edd48b6.sock every 8 connection(s)
I20260928 05:51:10.920568 1117 acceptor_pool.cc:254] collecting diagnostics on the listening RPC socket unix:/tmp/dist-test-task3ISvla/test-tmp/rpc-test-c002492e734a4c7da60133523edd48b6.sock every 8 connection(s)
W20260928 05:51:10.988046 1118 rpcz_store.cc:267] Call kudu.rpc_test.CalculatorService.Sleep from unix:<unnamed> (request call id 2) took 20 ms (client timeout 20 ms). Trace:
W20260928 05:51:10.988209 1118 rpcz_store.cc:269] 0928 05:51:10.967606 (+ 0us) service_pool.cc:170] Inserting onto call queue
0928 05:51:10.987980 (+ 20374us) service_pool.cc:214] Skipping call since client already timed out
0928 05:51:10.988028 (+ 48us) inbound_call.cc:173] Queueing failure response
Metrics: {}
[ OK ] Parameters/TestRpc.TimedOutOnResponseMetricServiceQueue/SSL_UnixSocket (79 ms)
[ RUN ] Parameters/TestRpc.RpcPendingConnectionsMetric/SSL_UnixSocket
I20260928 05:51:10.996628 1139 acceptor_pool.cc:254] collecting diagnostics on the listening RPC socket 0.0.0.0:45625 every 8 connection(s)
I20260928 05:51:10.996829 1140 acceptor_pool.cc:254] collecting diagnostics on the listening RPC socket 0.0.0.0:45625 every 8 connection(s)
W20260928 05:51:11.008401 1135 negotiation.cc:337] Failed RPC negotiation. Trace:
0928 05:51:11.007786 (+ 0us) reactor.cc:625] Submitting negotiation task for server connection from 127.0.0.1:40100 (local address 127.0.0.1:45625)
0928 05:51:11.007975 (+ 189us) server_negotiation.cc:206] Beginning negotiation
0928 05:51:11.007980 (+ 5us) server_negotiation.cc:399] Waiting for connection header
0928 05:51:11.008107 (+ 127us) negotiation.cc:327] Negotiation complete: Network error: Server connection negotiation failed: server connection from 127.0.0.1:40100: BlockingRecv error: recv got EOF from 127.0.0.1:40100 (error 108)
Metrics: {"server-negotiator.queue_time_us":53}
[ OK ] Parameters/TestRpc.RpcPendingConnectionsMetric/SSL_UnixSocket (27 ms)
[ RUN ] Parameters/TestRpc.TestRpcContextClientDeadline/SSL_UnixSocket
I20260928 05:51:11.038139 1155 acceptor_pool.cc:254] collecting diagnostics on the listening RPC socket unix:/tmp/dist-test-task3ISvla/test-tmp/rpc-test-44f92cf0666c4badb6fee80624b3d245.sock every 8 connection(s)
I20260928 05:51:11.038455 1156 acceptor_pool.cc:254] collecting diagnostics on the listening RPC socket unix:/tmp/dist-test-task3ISvla/test-tmp/rpc-test-44f92cf0666c4badb6fee80624b3d245.sock every 8 connection(s)
[ OK ] Parameters/TestRpc.TestRpcContextClientDeadline/SSL_UnixSocket (68 ms)
[ RUN ] Parameters/TestRpc.TestApplicationFeatureFlagUnsupportedServer/SSL_UnixSocket
I20260928 05:51:11.110383 1180 acceptor_pool.cc:254] collecting diagnostics on the listening RPC socket unix:/tmp/dist-test-task3ISvla/test-tmp/rpc-test-baae7d08ea964bed82394d9eed4bb27a.sock every 8 connection(s)
I20260928 05:51:11.110663 1181 acceptor_pool.cc:254] collecting diagnostics on the listening RPC socket unix:/tmp/dist-test-task3ISvla/test-tmp/rpc-test-baae7d08ea964bed82394d9eed4bb27a.sock every 8 connection(s)
[ OK ] Parameters/TestRpc.TestApplicationFeatureFlagUnsupportedServer/SSL_UnixSocket (44 ms)
[ RUN ] Parameters/TestRpc.TestCancellationAsync/SSL_UnixSocket
I20260928 05:51:11.144855 1205 acceptor_pool.cc:254] collecting diagnostics on the listening RPC socket unix:/tmp/dist-test-task3ISvla/test-tmp/rpc-test-f89ba3d557c24ba89cbc5f3a77406292.sock every 8 connection(s)
I20260928 05:51:11.145087 1206 acceptor_pool.cc:254] collecting diagnostics on the listening RPC socket unix:/tmp/dist-test-task3ISvla/test-tmp/rpc-test-f89ba3d557c24ba89cbc5f3a77406292.sock every 8 connection(s)
I20260928 05:51:11.145866 773 rpc-test.cc:1716] Connecting to unix:/tmp/dist-test-task3ISvla/test-tmp/rpc-test-f89ba3d557c24ba89cbc5f3a77406292.sock
I20260928 05:51:11.155558 773 test_util.cc:268] Using random seed: -1489514152
I20260928 05:51:11.187927 1209 rpc-test-base.h:240] got call: sleep_micros: 500 pattern: 4294967295 num_repetitions: 2097152 sidecar_idx: 0
I20260928 05:51:11.213996 1208 rpc-test-base.h:240] got call: sleep_micros: 500 pattern: 4294967295 num_repetitions: 2097152 sidecar_idx: 0
I20260928 05:51:11.241549 1207 rpc-test-base.h:240] got call: sleep_micros: 500 pattern: 4294967295 num_repetitions: 2097152 sidecar_idx: 0
I20260928 05:51:11.274238 1208 rpc-test-base.h:240] got call: sleep_micros: 500 pattern: 4294967295 num_repetitions: 2097152 sidecar_idx: 0
I20260928 05:51:11.305447 1207 rpc-test-base.h:240] got call: sleep_micros: 500 pattern: 4294967295 num_repetitions: 2097152 sidecar_idx: 0
I20260928 05:51:11.336148 1208 rpc-test-base.h:240] got call: sleep_micros: 500 pattern: 4294967295 num_repetitions: 2097152 sidecar_idx: 0
I20260928 05:51:11.366974 1209 rpc-test-base.h:240] got call: sleep_micros: 500 pattern: 4294967295 num_repetitions: 2097152 sidecar_idx: 0
W20260928 05:51:11.371819 1202 connection.cc:196] Error closing socket: Network error: TlsSocket::Close: Broken pipe
W20260928 05:51:11.395386 1202 connection.cc:441] server connection from unix:<unnamed> torn down before Call kudu.rpc.GenericCalculatorService.SleepWithSidecar from unix:<unnamed> (request call id 8) could send its response
W20260928 05:51:11.410076 1202 connection.cc:441] server connection from unix:<unnamed> torn down before Call kudu.rpc.GenericCalculatorService.SleepWithSidecar from unix:<unnamed> (request call id 9) could send its response
[ OK ] Parameters/TestRpc.TestCancellationAsync/SSL_UnixSocket (280 ms)
[ RUN ] Parameters/TestRpc.TestPerformanceBySocketType/SSL_UnixSocket
I20260928 05:51:11.432096 1230 acceptor_pool.cc:254] collecting diagnostics on the listening RPC socket unix:/tmp/dist-test-task3ISvla/test-tmp/rpc-test-3a0b64c76dd54a67819ce7b51f343548.sock every 8 connection(s)
I20260928 05:51:11.432320 1231 acceptor_pool.cc:254] collecting diagnostics on the listening RPC socket unix:/tmp/dist-test-task3ISvla/test-tmp/rpc-test-3a0b64c76dd54a67819ce7b51f343548.sock every 8 connection(s)
I20260928 05:51:11.433161 773 rpc-test.cc:1846] Connecting to unix:/tmp/dist-test-task3ISvla/test-tmp/rpc-test-3a0b64c76dd54a67819ce7b51f343548.sock
I20260928 05:51:14.430938 773 rpc-test.cc:1859] Sending 1024MB via ssl-enabled unix socket: real 2.953s user 2.682s sys 2.371s
I20260928 05:51:17.391299 773 rpc-test.cc:1859] Sending 1024MB via ssl-enabled unix socket: real 2.960s user 2.972s sys 2.079s
I20260928 05:51:20.299219 773 rpc-test.cc:1859] Sending 1024MB via ssl-enabled unix socket: real 2.908s user 2.773s sys 2.191s
I20260928 05:51:23.162241 773 rpc-test.cc:1859] Sending 1024MB via ssl-enabled unix socket: real 2.863s user 2.681s sys 2.186s
I20260928 05:51:26.043048 773 rpc-test.cc:1859] Sending 1024MB via ssl-enabled unix socket: real 2.881s user 2.654s sys 2.251s
W20260928 05:51:26.044931 1227 connection.cc:196] Error closing socket: Network error: TlsSocket::Close: Broken pipe
[ OK ] Parameters/TestRpc.TestPerformanceBySocketType/SSL_UnixSocket (14639 ms)
[----------] 20 tests from Parameters/TestRpc (48865 ms total)
[----------] 1 test from Parameters/TestRpcSocketTxRxQueue
[ RUN ] Parameters/TestRpcSocketTxRxQueue.AcceptorRxQueueSizeMetric/0
I20260928 05:51:26.057363 1255 acceptor_pool.cc:254] collecting diagnostics on the listening RPC socket 0.0.0.0:45765 every 1 connection(s)
I20260928 05:51:26.057610 1256 acceptor_pool.cc:254] collecting diagnostics on the listening RPC socket 0.0.0.0:45765 every 1 connection(s)
W20260928 05:51:26.059173 1251 negotiation.cc:337] Failed RPC negotiation. Trace:
0928 05:51:26.058787 (+ 0us) reactor.cc:625] Submitting negotiation task for server connection from 127.0.0.1:40976 (local address 127.0.0.1:45765)
0928 05:51:26.058934 (+ 147us) server_negotiation.cc:206] Beginning negotiation
0928 05:51:26.058938 (+ 4us) server_negotiation.cc:399] Waiting for connection header
0928 05:51:26.059054 (+ 116us) negotiation.cc:327] Negotiation complete: Network error: Server connection negotiation failed: server connection from 127.0.0.1:40976: BlockingRecv error: recv got EOF from 127.0.0.1:40976 (error 108)
Metrics: {"server-negotiator.queue_time_us":49}
[ OK ] Parameters/TestRpcSocketTxRxQueue.AcceptorRxQueueSizeMetric/0 (9 ms)
[----------] 1 test from Parameters/TestRpcSocketTxRxQueue (9 ms total)
[----------] Global test environment tear-down
[==========] 21 tests from 2 test suites ran. (48874 ms total)
[ PASSED ] 20 tests.
[ FAILED ] 1 test, listed below:
[ FAILED ] Parameters/TestRpc.TestCallWithChainCertAndChainCA/SSL_UnixSocket, where GetParam() = (true, true)
1 FAILED TEST