Diagnosed failure

Parameters/TestRpc.TestCallWithChainCertAndChainCA/SSL_UnixSocket: /data0/somelongdirectorytoavoidrpathissues/src/kudu/src/kudu/rpc/rpc-test.cc:270: Failure
Failed
Bad status: Runtime error: could not verify certificate chain (error with cert: subject=CN = localhost, ST = sadfjas, C = AS, emailAddress = sdflkdsajf, O = lskdfjlsad, OU = sldfkja, issuer=C = AS, ST = ASDfkjdhf, L = lskdjf, O = saldfja, OU = skdjf, CN = localhost, emailAddress = sadjflkadsj): : certificate has expired
Google Test trace:
/data0/somelongdirectorytoavoidrpathissues/src/kudu/src/kudu/rpc/rpc-test.cc:267: Connecting to unix:/tmp/dist-test-taskOhSisN/test-tmp/rpc-test-2be4c2612a754394be064a9375e62710.sock
I20260925 14:51:23.853287   383 test_util.cc:175] -----------------------------------------------
I20260925 14:51:23.853359   383 test_util.cc:176] Had fatal failures, leaving test files at /tmp/dist-test-taskOhSisN/test-tmp/rpc-test.6.Parameters_TestRpc.TestCallWithChainCertAndChainCA_SSL_UnixSocket.1790347883795428-383-0

Full log

Note: This is test shard 7 of 8.
[==========] Running 21 tests from 2 test suites.
[----------] Global test environment set-up.
[----------] 20 tests from Parameters/TestRpc
[ RUN      ] Parameters/TestRpc.TestMessengerCreateDestroy/SSL_UnixSocket
WARNING: Logging before InitGoogleLogging() is written to STDERR
I20260925 14:51:23.813589   383 rpc-test.cc:169] started messenger TestCreateDestroy
[       OK ] Parameters/TestRpc.TestMessengerCreateDestroy/SSL_UnixSocket (16 ms)
[ RUN      ] Parameters/TestRpc.TestNegotiationDeadlock/SSL_UnixSocket
I20260925 14:51:23.832734   404 acceptor_pool.cc:254] collecting diagnostics on the listening RPC socket unix:/tmp/dist-test-taskOhSisN/test-tmp/rpc-test-3a53a07f50284684af2abccf1c088a1a.sock every 8 connection(s)
I20260925 14:51:23.833575   403 acceptor_pool.cc:254] collecting diagnostics on the listening RPC socket unix:/tmp/dist-test-taskOhSisN/test-tmp/rpc-test-3a53a07f50284684af2abccf1c088a1a.sock every 8 connection(s)
[       OK ] Parameters/TestRpc.TestNegotiationDeadlock/SSL_UnixSocket (25 ms)
[ RUN      ] Parameters/TestRpc.TestCallWithChainCertAndChainCA/SSL_UnixSocket
I20260925 14:51:23.849539   419 acceptor_pool.cc:254] collecting diagnostics on the listening RPC socket unix:/tmp/dist-test-taskOhSisN/test-tmp/rpc-test-2be4c2612a754394be064a9375e62710.sock every 8 connection(s)
I20260925 14:51:23.849570   420 acceptor_pool.cc:254] collecting diagnostics on the listening RPC socket unix:/tmp/dist-test-taskOhSisN/test-tmp/rpc-test-2be4c2612a754394be064a9375e62710.sock every 8 connection(s)
/data0/somelongdirectorytoavoidrpathissues/src/kudu/src/kudu/rpc/rpc-test.cc:270: Failure
Failed
Bad status: Runtime error: could not verify certificate chain (error with cert: subject=CN = localhost, ST = sadfjas, C = AS, emailAddress = sdflkdsajf, O = lskdfjlsad, OU = sldfkja, issuer=C = AS, ST = ASDfkjdhf, L = lskdjf, O = saldfja, OU = skdjf, CN = localhost, emailAddress = sadjflkadsj): : certificate has expired
Google Test trace:
/data0/somelongdirectorytoavoidrpathissues/src/kudu/src/kudu/rpc/rpc-test.cc:267: Connecting to unix:/tmp/dist-test-taskOhSisN/test-tmp/rpc-test-2be4c2612a754394be064a9375e62710.sock
I20260925 14:51:23.853287   383 test_util.cc:175] -----------------------------------------------
I20260925 14:51:23.853359   383 test_util.cc:176] Had fatal failures, leaving test files at /tmp/dist-test-taskOhSisN/test-tmp/rpc-test.6.Parameters_TestRpc.TestCallWithChainCertAndChainCA_SSL_UnixSocket.1790347883795428-383-0
[  FAILED  ] Parameters/TestRpc.TestCallWithChainCertAndChainCA/SSL_UnixSocket, where GetParam() = (true, true) (13 ms)
[ RUN      ] Parameters/TestRpc.TestCallWithPasswordProtectedKey/SSL_UnixSocket
I20260925 14:51:23.874842   445 acceptor_pool.cc:254] collecting diagnostics on the listening RPC socket unix:/tmp/dist-test-taskOhSisN/test-tmp/rpc-test-06c141586f224ef98a2a99c33d4e5a46.sock every 8 connection(s)
I20260925 14:51:23.874827   444 acceptor_pool.cc:254] collecting diagnostics on the listening RPC socket unix:/tmp/dist-test-taskOhSisN/test-tmp/rpc-test-06c141586f224ef98a2a99c33d4e5a46.sock every 8 connection(s)
[       OK ] Parameters/TestRpc.TestCallWithPasswordProtectedKey/SSL_UnixSocket (34 ms)
[ RUN      ] Parameters/TestRpc.TestCallToBadServer/SSL_UnixSocket
I20260925 14:51:23.907362   383 rpc-test.cc:394] Status: Network error: Client connection negotiation failed: client connection to 0.0.0.0:0: connect: Connection refused (error 111)
I20260925 14:51:23.907632   383 rpc-test.cc:394] Status: Network error: Client connection negotiation failed: client connection to 0.0.0.0:0: connect: Connection refused (error 111)
I20260925 14:51:23.907991   383 rpc-test.cc:394] Status: Network error: Client connection negotiation failed: client connection to 0.0.0.0:0: connect: Connection refused (error 111)
I20260925 14:51:23.908452   383 rpc-test.cc:394] Status: Network error: Client connection negotiation failed: client connection to 0.0.0.0:0: connect: Connection refused (error 111)
I20260925 14:51:23.908697   383 rpc-test.cc:394] Status: Network error: Client connection negotiation failed: client connection to 0.0.0.0:0: connect: Connection refused (error 111)
[       OK ] Parameters/TestRpc.TestCallToBadServer/SSL_UnixSocket (21 ms)
[ RUN      ] Parameters/TestRpc.TestWrongService/SSL_UnixSocket
I20260925 14:51:23.953085   479 acceptor_pool.cc:254] collecting diagnostics on the listening RPC socket unix:/tmp/dist-test-taskOhSisN/test-tmp/rpc-test-d4b64f525ea94740a415c65e82c7c473.sock every 8 connection(s)
I20260925 14:51:23.953109   480 acceptor_pool.cc:254] collecting diagnostics on the listening RPC socket unix:/tmp/dist-test-taskOhSisN/test-tmp/rpc-test-d4b64f525ea94740a415c65e82c7c473.sock every 8 connection(s)
I20260925 14:51:23.988701   476 messenger.cc:345] service WrongServiceName not registered on TestServer
[       OK ] Parameters/TestRpc.TestWrongService/SSL_UnixSocket (81 ms)
[ RUN      ] Parameters/TestRpc.TestConnectionKeepalive/SSL_UnixSocket
I20260925 14:51:23.995947   502 acceptor_pool.cc:254] collecting diagnostics on the listening RPC socket unix:/tmp/dist-test-taskOhSisN/test-tmp/rpc-test-b1f67cf0970b4b798cacc7d61715d824.sock every 8 connection(s)
I20260925 14:51:23.996011   503 acceptor_pool.cc:254] collecting diagnostics on the listening RPC socket unix:/tmp/dist-test-taskOhSisN/test-tmp/rpc-test-b1f67cf0970b4b798cacc7d61715d824.sock every 8 connection(s)
I20260925 14:51:23.996186   383 rpc-test.cc:488] Connecting to unix:/tmp/dist-test-taskOhSisN/test-tmp/rpc-test-b1f67cf0970b4b798cacc7d61715d824.sock
W20260925 14:51:24.492573   515 connection.cc:196] Error closing socket: Network error: TlsSocket::Close: Broken pipe
[       OK ] Parameters/TestRpc.TestConnectionKeepalive/SSL_UnixSocket (1042 ms)
[ RUN      ] Parameters/TestRpc.TestClientConnectionMetrics/SSL_UnixSocket
I20260925 14:51:25.049393   527 acceptor_pool.cc:254] collecting diagnostics on the listening RPC socket unix:/tmp/dist-test-taskOhSisN/test-tmp/rpc-test-0da7a2803fa045cba2de27fcb5460e4f.sock every 8 connection(s)
I20260925 14:51:25.049435   528 acceptor_pool.cc:254] collecting diagnostics on the listening RPC socket unix:/tmp/dist-test-taskOhSisN/test-tmp/rpc-test-0da7a2803fa045cba2de27fcb5460e4f.sock every 8 connection(s)
I20260925 14:51:25.049638   383 rpc-test.cc:569] Connecting to unix:/tmp/dist-test-taskOhSisN/test-tmp/rpc-test-0da7a2803fa045cba2de27fcb5460e4f.sock
W20260925 14:51:33.488611   524 connection.cc:196] Error closing socket: Network error: TlsSocket::Close: Broken pipe
[       OK ] Parameters/TestRpc.TestClientConnectionMetrics/SSL_UnixSocket (8456 ms)
[ RUN      ] Parameters/TestRpc.TestCredentialsPolicy/SSL_UnixSocket
I20260925 14:51:33.517253   550 acceptor_pool.cc:254] collecting diagnostics on the listening RPC socket unix:/tmp/dist-test-taskOhSisN/test-tmp/rpc-test-48eeceb3ba8d4720bd309810a8a001fd.sock every 8 connection(s)
I20260925 14:51:33.517305   551 acceptor_pool.cc:254] collecting diagnostics on the listening RPC socket unix:/tmp/dist-test-taskOhSisN/test-tmp/rpc-test-48eeceb3ba8d4720bd309810a8a001fd.sock every 8 connection(s)
I20260925 14:51:33.517484   383 rpc-test.cc:700] Connecting to unix:/tmp/dist-test-taskOhSisN/test-tmp/rpc-test-48eeceb3ba8d4720bd309810a8a001fd.sock
W20260925 14:51:33.564917   549 connection.cc:196] Error closing socket: Network error: TlsSocket::Close: Broken pipe
[       OK ] Parameters/TestRpc.TestCredentialsPolicy/SSL_UnixSocket (79 ms)
[ RUN      ] Parameters/TestRpc.TestCallLongerThanKeepalive/SSL_UnixSocket
I20260925 14:51:33.585012   575 acceptor_pool.cc:254] collecting diagnostics on the listening RPC socket unix:/tmp/dist-test-taskOhSisN/test-tmp/rpc-test-65833e0944ae4b8092ca8d7b5afd623b.sock every 8 connection(s)
I20260925 14:51:33.585034   576 acceptor_pool.cc:254] collecting diagnostics on the listening RPC socket unix:/tmp/dist-test-taskOhSisN/test-tmp/rpc-test-65833e0944ae4b8092ca8d7b5afd623b.sock every 8 connection(s)
I20260925 14:51:33.600881   577 rpc-test-base.h:222] got call: sleep_micros: 3000000 deferred: true
I20260925 14:51:36.601598   577 rpcz_store.cc:275] Call kudu.rpc.GenericCalculatorService.Sleep from unix:<unnamed> (request call id 0) took 3000 ms. Trace:
I20260925 14:51:36.601708   577 rpcz_store.cc:276] 0925 14:51:33.600812 (+     0us) service_pool.cc:170] Inserting onto call queue
0925 14:51:33.600850 (+    38us) service_pool.cc:227] Handling call
0925 14:51:36.601583 (+3000733us) inbound_call.cc:173] Queueing success response
Metrics: {}
W20260925 14:51:36.602814   572 connection.cc:196] Error closing socket: Network error: TlsSocket::Close: Broken pipe
[       OK ] Parameters/TestRpc.TestCallLongerThanKeepalive/SSL_UnixSocket (3034 ms)
[ RUN      ] Parameters/TestRpc.TestRpcSidecar/SSL_UnixSocket
I20260925 14:51:36.627230   600 acceptor_pool.cc:254] collecting diagnostics on the listening RPC socket unix:/tmp/dist-test-taskOhSisN/test-tmp/rpc-test-03d34d74b8434787b6ed0c411139a06e.sock every 8 connection(s)
I20260925 14:51:36.627286   601 acceptor_pool.cc:254] collecting diagnostics on the listening RPC socket unix:/tmp/dist-test-taskOhSisN/test-tmp/rpc-test-03d34d74b8434787b6ed0c411139a06e.sock every 8 connection(s)
W20260925 14:51:36.672099   597 connection.cc:196] Error closing socket: Network error: TlsSocket::Close: Broken pipe
[       OK ] Parameters/TestRpc.TestRpcSidecar/SSL_UnixSocket (68 ms)
[ RUN      ] Parameters/TestRpc.TestRpcSidecarLimits/SSL_UnixSocket
I20260925 14:51:38.405776   625 acceptor_pool.cc:254] collecting diagnostics on the listening RPC socket unix:/tmp/dist-test-taskOhSisN/test-tmp/rpc-test-4dabf52617d54106abf35e61fe5c6121.sock every 8 connection(s)
I20260925 14:51:38.405836   626 acceptor_pool.cc:254] collecting diagnostics on the listening RPC socket unix:/tmp/dist-test-taskOhSisN/test-tmp/rpc-test-4dabf52617d54106abf35e61fe5c6121.sock every 8 connection(s)
W20260925 14:51:38.421813   383 serialization.cc:72] Serialized kudu.rpc_test.PushStringsRequestPB (2147483654 bytes) is larger than the maximum configured RPC message size (52428800 bytes). Sending anyway, but peer may reject the data.
W20260925 14:51:38.425521   622 connection.cc:535] server connection from unix:<unnamed> recv error: Network error: RPC frame had a length of 2147483714, but we only support messages up to 52428800 bytes long.
W20260925 14:51:38.425597   622 connection.cc:158] shutting down server connection from unix:<unnamed> with pending inbound data: 4/2147483714 bytes received; last active 0 ns ago: status Network error: RPC frame had a length of 2147483714, but we only support messages up to 52428800 bytes long.
W20260925 14:51:38.425803   638 connection.cc:698] client connection to unix:/tmp/dist-test-taskOhSisN/test-tmp/rpc-test-4dabf52617d54106abf35e61fe5c6121.sock send error: Network error: failed to write to TLS socket: Broken pipe
W20260925 14:51:38.426093   638 connection.cc:196] Error closing socket: Network error: TlsSocket::Close: Success
I20260925 14:51:38.437489   650 acceptor_pool.cc:254] collecting diagnostics on the listening RPC socket unix:/tmp/dist-test-taskOhSisN/test-tmp/rpc-test-4dabf52617d54106abf35e61fe5c6121.sock every 8 connection(s)
I20260925 14:51:38.437497   651 acceptor_pool.cc:254] collecting diagnostics on the listening RPC socket unix:/tmp/dist-test-taskOhSisN/test-tmp/rpc-test-4dabf52617d54106abf35e61fe5c6121.sock every 8 connection(s)
W20260925 14:51:42.840777   647 connection.cc:577] server connection from unix:<unnamed>: received bad data: 'Corruption: Invalid packet: message had a length of 2147483710, but we only support messages up to 2147483647 bytes
'
W20260925 14:51:42.841037   663 connection.cc:196] Error closing socket: Network error: TlsSocket::Close: Broken pipe
[       OK ] Parameters/TestRpc.TestRpcSidecarLimits/SSL_UnixSocket (6169 ms)
[ RUN      ] Parameters/TestRpc.TestCallTimeoutDoesntAffectNegotiation/SSL_UnixSocket
I20260925 14:51:42.862869   675 acceptor_pool.cc:254] collecting diagnostics on the listening RPC socket unix:/tmp/dist-test-taskOhSisN/test-tmp/rpc-test-e5dc494eab3d4f528714c9a35964190d.sock every 8 connection(s)
I20260925 14:51:42.862920   676 acceptor_pool.cc:254] collecting diagnostics on the listening RPC socket unix:/tmp/dist-test-taskOhSisN/test-tmp/rpc-test-e5dc494eab3d4f528714c9a35964190d.sock every 8 connection(s)
W20260925 14:51:42.873907   671 negotiation.cc:266] Injecting 500ms delay in negotiation
I20260925 14:51:42.924196   383 rpc-test-base.h:595] status: Timed out: connection negotiation to unix:/tmp/dist-test-taskOhSisN/test-tmp/rpc-test-e5dc494eab3d4f528714c9a35964190d.sock for RPC Sleep timed out after 0.050s (ON_OUTBOUND_QUEUE), seconds elapsed: 0.0506078
W20260925 14:51:43.378548   672 connection.cc:196] Error closing socket: Network error: TlsSocket::Close: Broken pipe
[       OK ] Parameters/TestRpc.TestCallTimeoutDoesntAffectNegotiation/SSL_UnixSocket (535 ms)
[ RUN      ] Parameters/TestRpc.TestRpcHandlerLatencyMetric/SSL_UnixSocket
I20260925 14:51:43.385147   700 acceptor_pool.cc:254] collecting diagnostics on the listening RPC socket unix:/tmp/dist-test-taskOhSisN/test-tmp/rpc-test-568969be52b1400eb328b94c1d56bad5.sock every 8 connection(s)
I20260925 14:51:43.385265   701 acceptor_pool.cc:254] collecting diagnostics on the listening RPC socket unix:/tmp/dist-test-taskOhSisN/test-tmp/rpc-test-568969be52b1400eb328b94c1d56bad5.sock every 8 connection(s)
I20260925 14:51:43.421414   383 rpc-test.cc:1236] Sleep() min lat: 20275
I20260925 14:51:43.421487   383 rpc-test.cc:1237] Sleep() mean lat: 20275
I20260925 14:51:43.421511   383 rpc-test.cc:1238] Sleep() max lat: 20275
I20260925 14:51:43.421525   383 rpc-test.cc:1239] Sleep() #calls: 1
[       OK ] Parameters/TestRpc.TestRpcHandlerLatencyMetric/SSL_UnixSocket (43 ms)
[ RUN      ] Parameters/TestRpc.TimedOutOnResponseMetricServiceQueue/SSL_UnixSocket
I20260925 14:51:43.428550   726 acceptor_pool.cc:254] collecting diagnostics on the listening RPC socket unix:/tmp/dist-test-taskOhSisN/test-tmp/rpc-test-c220f8f8ff0948e6b73c250f170ba153.sock every 8 connection(s)
I20260925 14:51:43.428596   727 acceptor_pool.cc:254] collecting diagnostics on the listening RPC socket unix:/tmp/dist-test-taskOhSisN/test-tmp/rpc-test-c220f8f8ff0948e6b73c250f170ba153.sock every 8 connection(s)
W20260925 14:51:43.496627   728 rpcz_store.cc:267] Call kudu.rpc_test.CalculatorService.Sleep from unix:<unnamed> (request call id 2) took 20 ms (client timeout 20 ms). Trace:
W20260925 14:51:43.496754   728 rpcz_store.cc:269] 0925 14:51:43.476409 (+     0us) service_pool.cc:170] Inserting onto call queue
0925 14:51:43.496604 (+ 20195us) service_pool.cc:214] Skipping call since client already timed out
0925 14:51:43.496614 (+    10us) inbound_call.cc:173] Queueing failure response
Metrics: {}
W20260925 14:51:43.497458   723 connection.cc:196] Error closing socket: Network error: TlsSocket::Close: Broken pipe
[       OK ] Parameters/TestRpc.TimedOutOnResponseMetricServiceQueue/SSL_UnixSocket (75 ms)
[ RUN      ] Parameters/TestRpc.RpcPendingConnectionsMetric/SSL_UnixSocket
I20260925 14:51:43.500321   749 acceptor_pool.cc:254] collecting diagnostics on the listening RPC socket 0.0.0.0:33691 every 8 connection(s)
I20260925 14:51:43.500404   750 acceptor_pool.cc:254] collecting diagnostics on the listening RPC socket 0.0.0.0:33691 every 8 connection(s)
W20260925 14:51:43.510535   745 negotiation.cc:337] Failed RPC negotiation. Trace:
0925 14:51:43.510161 (+     0us) reactor.cc:625] Submitting negotiation task for server connection from 127.0.0.1:37356 (local address 127.0.0.1:33691)
0925 14:51:43.510245 (+    84us) server_negotiation.cc:206] Beginning negotiation
0925 14:51:43.510247 (+     2us) server_negotiation.cc:399] Waiting for connection header
0925 14:51:43.510428 (+   181us) negotiation.cc:327] Negotiation complete: Network error: Server connection negotiation failed: server connection from 127.0.0.1:37356: BlockingRecv error: recv got EOF from 127.0.0.1:37356 (error 108)
Metrics: {"server-negotiator.queue_time_us":50}
[       OK ] Parameters/TestRpc.RpcPendingConnectionsMetric/SSL_UnixSocket (23 ms)
[ RUN      ] Parameters/TestRpc.TestRpcContextClientDeadline/SSL_UnixSocket
I20260925 14:51:43.531949   765 acceptor_pool.cc:254] collecting diagnostics on the listening RPC socket unix:/tmp/dist-test-taskOhSisN/test-tmp/rpc-test-7c97610953f34b13bdd37152ffb010fa.sock every 8 connection(s)
I20260925 14:51:43.531996   766 acceptor_pool.cc:254] collecting diagnostics on the listening RPC socket unix:/tmp/dist-test-taskOhSisN/test-tmp/rpc-test-7c97610953f34b13bdd37152ffb010fa.sock every 8 connection(s)
[       OK ] Parameters/TestRpc.TestRpcContextClientDeadline/SSL_UnixSocket (46 ms)
[ RUN      ] Parameters/TestRpc.TestApplicationFeatureFlagUnsupportedServer/SSL_UnixSocket
I20260925 14:51:43.574637   790 acceptor_pool.cc:254] collecting diagnostics on the listening RPC socket unix:/tmp/dist-test-taskOhSisN/test-tmp/rpc-test-98ad42a83d3d491ba4fe40d88b30e1cf.sock every 8 connection(s)
I20260925 14:51:43.574677   791 acceptor_pool.cc:254] collecting diagnostics on the listening RPC socket unix:/tmp/dist-test-taskOhSisN/test-tmp/rpc-test-98ad42a83d3d491ba4fe40d88b30e1cf.sock every 8 connection(s)
[       OK ] Parameters/TestRpc.TestApplicationFeatureFlagUnsupportedServer/SSL_UnixSocket (25 ms)
[ RUN      ] Parameters/TestRpc.TestCancellationAsync/SSL_UnixSocket
I20260925 14:51:43.602134   815 acceptor_pool.cc:254] collecting diagnostics on the listening RPC socket unix:/tmp/dist-test-taskOhSisN/test-tmp/rpc-test-0487a7287bfe46c1a3d6a3fbb57a7df1.sock every 8 connection(s)
I20260925 14:51:43.602178   816 acceptor_pool.cc:254] collecting diagnostics on the listening RPC socket unix:/tmp/dist-test-taskOhSisN/test-tmp/rpc-test-0487a7287bfe46c1a3d6a3fbb57a7df1.sock every 8 connection(s)
I20260925 14:51:43.602353   383 rpc-test.cc:1716] Connecting to unix:/tmp/dist-test-taskOhSisN/test-tmp/rpc-test-0487a7287bfe46c1a3d6a3fbb57a7df1.sock
I20260925 14:51:43.616958   383 test_util.cc:268] Using random seed: -623786053
I20260925 14:51:43.635017   819 rpc-test-base.h:240] got call: sleep_micros: 500 pattern: 4294967295 num_repetitions: 2097152 sidecar_idx: 0
I20260925 14:51:43.648278   819 rpc-test-base.h:240] got call: sleep_micros: 500 pattern: 4294967295 num_repetitions: 2097152 sidecar_idx: 0
I20260925 14:51:43.661765   819 rpc-test-base.h:240] got call: sleep_micros: 500 pattern: 4294967295 num_repetitions: 2097152 sidecar_idx: 0
I20260925 14:51:43.675123   819 rpc-test-base.h:240] got call: sleep_micros: 500 pattern: 4294967295 num_repetitions: 2097152 sidecar_idx: 0
I20260925 14:51:43.688588   819 rpc-test-base.h:240] got call: sleep_micros: 500 pattern: 4294967295 num_repetitions: 2097152 sidecar_idx: 0
I20260925 14:51:43.701761   819 rpc-test-base.h:240] got call: sleep_micros: 500 pattern: 4294967295 num_repetitions: 2097152 sidecar_idx: 0
I20260925 14:51:43.714767   819 rpc-test-base.h:240] got call: sleep_micros: 500 pattern: 4294967295 num_repetitions: 2097152 sidecar_idx: 0
W20260925 14:51:43.716454   812 connection.cc:196] Error closing socket: Network error: TlsSocket::Close: Broken pipe
W20260925 14:51:43.717846   812 connection.cc:441] server connection from unix:<unnamed> torn down before Call kudu.rpc.GenericCalculatorService.SleepWithSidecar from unix:<unnamed> (request call id 9) could send its response
[       OK ] Parameters/TestRpc.TestCancellationAsync/SSL_UnixSocket (125 ms)
[ RUN      ] Parameters/TestRpc.TestPerformanceBySocketType/SSL_UnixSocket
I20260925 14:51:43.734809   840 acceptor_pool.cc:254] collecting diagnostics on the listening RPC socket unix:/tmp/dist-test-taskOhSisN/test-tmp/rpc-test-51287b2caaff4321b181180cc40c2fb2.sock every 8 connection(s)
I20260925 14:51:43.734844   841 acceptor_pool.cc:254] collecting diagnostics on the listening RPC socket unix:/tmp/dist-test-taskOhSisN/test-tmp/rpc-test-51287b2caaff4321b181180cc40c2fb2.sock every 8 connection(s)
I20260925 14:51:43.735281   383 rpc-test.cc:1846] Connecting to unix:/tmp/dist-test-taskOhSisN/test-tmp/rpc-test-51287b2caaff4321b181180cc40c2fb2.sock
I20260925 14:51:44.985110   383 rpc-test.cc:1859] Sending 1024MB via ssl-enabled unix socket: real 1.229s	user 1.351s	sys 0.853s
I20260925 14:51:46.232522   383 rpc-test.cc:1859] Sending 1024MB via ssl-enabled unix socket: real 1.247s	user 1.363s	sys 0.859s
I20260925 14:51:47.532871   383 rpc-test.cc:1859] Sending 1024MB via ssl-enabled unix socket: real 1.300s	user 1.458s	sys 0.874s
I20260925 14:51:48.823501   383 rpc-test.cc:1859] Sending 1024MB via ssl-enabled unix socket: real 1.291s	user 1.440s	sys 0.880s
I20260925 14:51:50.103367   383 rpc-test.cc:1859] Sending 1024MB via ssl-enabled unix socket: real 1.280s	user 1.383s	sys 0.915s
W20260925 14:51:50.104082   837 connection.cc:196] Error closing socket: Network error: TlsSocket::Close: Broken pipe
[       OK ] Parameters/TestRpc.TestPerformanceBySocketType/SSL_UnixSocket (6386 ms)
[----------] 20 tests from Parameters/TestRpc (26307 ms total)

[----------] 1 test from Parameters/TestRpcSocketTxRxQueue
[ RUN      ] Parameters/TestRpcSocketTxRxQueue.AcceptorRxQueueSizeMetric/0
I20260925 14:51:50.111974   865 acceptor_pool.cc:254] collecting diagnostics on the listening RPC socket 0.0.0.0:37865 every 1 connection(s)
I20260925 14:51:50.112043   866 acceptor_pool.cc:254] collecting diagnostics on the listening RPC socket 0.0.0.0:37865 every 1 connection(s)
W20260925 14:51:50.112581   861 negotiation.cc:337] Failed RPC negotiation. Trace:
0925 14:51:50.112449 (+     0us) reactor.cc:625] Submitting negotiation task for server connection from 127.0.0.1:55812 (local address 127.0.0.1:37865)
0925 14:51:50.112488 (+    39us) server_negotiation.cc:206] Beginning negotiation
0925 14:51:50.112490 (+     2us) server_negotiation.cc:399] Waiting for connection header
0925 14:51:50.112554 (+    64us) negotiation.cc:327] Negotiation complete: Network error: Server connection negotiation failed: server connection from 127.0.0.1:55812: BlockingRecv error: recv got EOF from 127.0.0.1:55812 (error 108)
Metrics: {"server-negotiator.queue_time_us":14}
[       OK ] Parameters/TestRpcSocketTxRxQueue.AcceptorRxQueueSizeMetric/0 (9 ms)
[----------] 1 test from Parameters/TestRpcSocketTxRxQueue (9 ms total)

[----------] Global test environment tear-down
[==========] 21 tests from 2 test suites ran. (26316 ms total)
[  PASSED  ] 20 tests.
[  FAILED  ] 1 test, listed below:
[  FAILED  ] Parameters/TestRpc.TestCallWithChainCertAndChainCA/SSL_UnixSocket, where GetParam() = (true, true)

 1 FAILED TEST