Diagnosed failure

Parameters/TestRpc.TestCallWithChainCertAndChainCA/SSL_UnixSocket: /data0/somelongdirectorytoavoidrpathissues/src/kudu/src/kudu/rpc/rpc-test.cc:270: Failure
Failed
Bad status: Runtime error: could not verify certificate chain (error with cert: subject=CN = localhost, ST = sadfjas, C = AS, emailAddress = sdflkdsajf, O = lskdfjlsad, OU = sldfkja, issuer=C = AS, ST = ASDfkjdhf, L = lskdjf, O = saldfja, OU = skdjf, CN = localhost, emailAddress = sadjflkadsj): : certificate has expired
Google Test trace:
/data0/somelongdirectorytoavoidrpathissues/src/kudu/src/kudu/rpc/rpc-test.cc:267: Connecting to unix:/tmp/dist-test-taskGJzHda/test-tmp/rpc-test-7bcf511a519d4227bd517e8644dbbb9c.sock
I20260924 23:06:29.555431  4047 test_util.cc:175] -----------------------------------------------
I20260924 23:06:29.555496  4047 test_util.cc:176] Had fatal failures, leaving test files at /tmp/dist-test-taskGJzHda/test-tmp/rpc-test.6.Parameters_TestRpc.TestCallWithChainCertAndChainCA_SSL_UnixSocket.1790291189489995-4047-0

Full log

Note: This is test shard 7 of 8.
[==========] Running 21 tests from 2 test suites.
[----------] Global test environment set-up.
[----------] 20 tests from Parameters/TestRpc
[ RUN      ] Parameters/TestRpc.TestMessengerCreateDestroy/SSL_UnixSocket
WARNING: Logging before InitGoogleLogging() is written to STDERR
I20260924 23:06:29.518139  4047 rpc-test.cc:169] started messenger TestCreateDestroy
[       OK ] Parameters/TestRpc.TestMessengerCreateDestroy/SSL_UnixSocket (26 ms)
[ RUN      ] Parameters/TestRpc.TestNegotiationDeadlock/SSL_UnixSocket
I20260924 23:06:29.527137  4067 acceptor_pool.cc:254] collecting diagnostics on the listening RPC socket unix:/tmp/dist-test-taskGJzHda/test-tmp/rpc-test-18f12b596874484a89b1a7611e7a0feb.sock every 8 connection(s)
I20260924 23:06:29.527173  4068 acceptor_pool.cc:254] collecting diagnostics on the listening RPC socket unix:/tmp/dist-test-taskGJzHda/test-tmp/rpc-test-18f12b596874484a89b1a7611e7a0feb.sock every 8 connection(s)
[       OK ] Parameters/TestRpc.TestNegotiationDeadlock/SSL_UnixSocket (14 ms)
[ RUN      ] Parameters/TestRpc.TestCallWithChainCertAndChainCA/SSL_UnixSocket
I20260924 23:06:29.551463  4083 acceptor_pool.cc:254] collecting diagnostics on the listening RPC socket unix:/tmp/dist-test-taskGJzHda/test-tmp/rpc-test-7bcf511a519d4227bd517e8644dbbb9c.sock every 8 connection(s)
I20260924 23:06:29.551472  4084 acceptor_pool.cc:254] collecting diagnostics on the listening RPC socket unix:/tmp/dist-test-taskGJzHda/test-tmp/rpc-test-7bcf511a519d4227bd517e8644dbbb9c.sock every 8 connection(s)
/data0/somelongdirectorytoavoidrpathissues/src/kudu/src/kudu/rpc/rpc-test.cc:270: Failure
Failed
Bad status: Runtime error: could not verify certificate chain (error with cert: subject=CN = localhost, ST = sadfjas, C = AS, emailAddress = sdflkdsajf, O = lskdfjlsad, OU = sldfkja, issuer=C = AS, ST = ASDfkjdhf, L = lskdjf, O = saldfja, OU = skdjf, CN = localhost, emailAddress = sadjflkadsj): : certificate has expired
Google Test trace:
/data0/somelongdirectorytoavoidrpathissues/src/kudu/src/kudu/rpc/rpc-test.cc:267: Connecting to unix:/tmp/dist-test-taskGJzHda/test-tmp/rpc-test-7bcf511a519d4227bd517e8644dbbb9c.sock
I20260924 23:06:29.555431  4047 test_util.cc:175] -----------------------------------------------
I20260924 23:06:29.555496  4047 test_util.cc:176] Had fatal failures, leaving test files at /tmp/dist-test-taskGJzHda/test-tmp/rpc-test.6.Parameters_TestRpc.TestCallWithChainCertAndChainCA_SSL_UnixSocket.1790291189489995-4047-0
[  FAILED  ] Parameters/TestRpc.TestCallWithChainCertAndChainCA/SSL_UnixSocket, where GetParam() = (true, true) (21 ms)
[ RUN      ] Parameters/TestRpc.TestCallWithPasswordProtectedKey/SSL_UnixSocket
I20260924 23:06:29.566164  4108 acceptor_pool.cc:254] collecting diagnostics on the listening RPC socket unix:/tmp/dist-test-taskGJzHda/test-tmp/rpc-test-9c4344bf0ec74295b4f9b8075128623e.sock every 8 connection(s)
I20260924 23:06:29.566182  4109 acceptor_pool.cc:254] collecting diagnostics on the listening RPC socket unix:/tmp/dist-test-taskGJzHda/test-tmp/rpc-test-9c4344bf0ec74295b4f9b8075128623e.sock every 8 connection(s)
W20260924 23:06:29.577395  4105 connection.cc:196] Error closing socket: Network error: TlsSocket::Close: Broken pipe
[       OK ] Parameters/TestRpc.TestCallWithPasswordProtectedKey/SSL_UnixSocket (23 ms)
[ RUN      ] Parameters/TestRpc.TestCallToBadServer/SSL_UnixSocket
I20260924 23:06:29.603972  4047 rpc-test.cc:394] Status: Network error: Client connection negotiation failed: client connection to 0.0.0.0:0: connect: Connection refused (error 111)
I20260924 23:06:29.604387  4047 rpc-test.cc:394] Status: Network error: Client connection negotiation failed: client connection to 0.0.0.0:0: connect: Connection refused (error 111)
I20260924 23:06:29.604652  4047 rpc-test.cc:394] Status: Network error: Client connection negotiation failed: client connection to 0.0.0.0:0: connect: Connection refused (error 111)
I20260924 23:06:29.604883  4047 rpc-test.cc:394] Status: Network error: Client connection negotiation failed: client connection to 0.0.0.0:0: connect: Connection refused (error 111)
I20260924 23:06:29.605080  4047 rpc-test.cc:394] Status: Network error: Client connection negotiation failed: client connection to 0.0.0.0:0: connect: Connection refused (error 111)
[       OK ] Parameters/TestRpc.TestCallToBadServer/SSL_UnixSocket (27 ms)
[ RUN      ] Parameters/TestRpc.TestWrongService/SSL_UnixSocket
I20260924 23:06:29.624598  4143 acceptor_pool.cc:254] collecting diagnostics on the listening RPC socket unix:/tmp/dist-test-taskGJzHda/test-tmp/rpc-test-4628995e710c47fa9622aade24b64c2e.sock every 8 connection(s)
I20260924 23:06:29.624632  4144 acceptor_pool.cc:254] collecting diagnostics on the listening RPC socket unix:/tmp/dist-test-taskGJzHda/test-tmp/rpc-test-4628995e710c47fa9622aade24b64c2e.sock every 8 connection(s)
I20260924 23:06:29.637004  4140 messenger.cc:345] service WrongServiceName not registered on TestServer
W20260924 23:06:29.637835  4140 connection.cc:196] Error closing socket: Network error: TlsSocket::Close: Broken pipe
[       OK ] Parameters/TestRpc.TestWrongService/SSL_UnixSocket (32 ms)
[ RUN      ] Parameters/TestRpc.TestConnectionKeepalive/SSL_UnixSocket
I20260924 23:06:29.648979  4166 acceptor_pool.cc:254] collecting diagnostics on the listening RPC socket unix:/tmp/dist-test-taskGJzHda/test-tmp/rpc-test-fb6b3da4bad74b3cbbf6f3d7e8843ae1.sock every 8 connection(s)
I20260924 23:06:29.649029  4167 acceptor_pool.cc:254] collecting diagnostics on the listening RPC socket unix:/tmp/dist-test-taskGJzHda/test-tmp/rpc-test-fb6b3da4bad74b3cbbf6f3d7e8843ae1.sock every 8 connection(s)
I20260924 23:06:29.649187  4047 rpc-test.cc:488] Connecting to unix:/tmp/dist-test-taskGJzHda/test-tmp/rpc-test-fb6b3da4bad74b3cbbf6f3d7e8843ae1.sock
W20260924 23:06:30.140453  4179 connection.cc:196] Error closing socket: Network error: TlsSocket::Close: Broken pipe
[       OK ] Parameters/TestRpc.TestConnectionKeepalive/SSL_UnixSocket (1036 ms)
[ RUN      ] Parameters/TestRpc.TestClientConnectionMetrics/SSL_UnixSocket
I20260924 23:06:30.705227  4191 acceptor_pool.cc:254] collecting diagnostics on the listening RPC socket unix:/tmp/dist-test-taskGJzHda/test-tmp/rpc-test-f42f9f76f94642fd9bc5ed07c1b9a04d.sock every 8 connection(s)
I20260924 23:06:30.705251  4192 acceptor_pool.cc:254] collecting diagnostics on the listening RPC socket unix:/tmp/dist-test-taskGJzHda/test-tmp/rpc-test-f42f9f76f94642fd9bc5ed07c1b9a04d.sock every 8 connection(s)
I20260924 23:06:30.705430  4047 rpc-test.cc:569] Connecting to unix:/tmp/dist-test-taskGJzHda/test-tmp/rpc-test-f42f9f76f94642fd9bc5ed07c1b9a04d.sock
W20260924 23:06:39.340843  4188 connection.cc:196] Error closing socket: Network error: TlsSocket::Close: Broken pipe
[       OK ] Parameters/TestRpc.TestClientConnectionMetrics/SSL_UnixSocket (8667 ms)
[ RUN      ] Parameters/TestRpc.TestCredentialsPolicy/SSL_UnixSocket
I20260924 23:06:39.383139  4214 acceptor_pool.cc:254] collecting diagnostics on the listening RPC socket unix:/tmp/dist-test-taskGJzHda/test-tmp/rpc-test-afd370be7a0f40a9892650729d2986e3.sock every 8 connection(s)
I20260924 23:06:39.383173  4215 acceptor_pool.cc:254] collecting diagnostics on the listening RPC socket unix:/tmp/dist-test-taskGJzHda/test-tmp/rpc-test-afd370be7a0f40a9892650729d2986e3.sock every 8 connection(s)
I20260924 23:06:39.383334  4047 rpc-test.cc:700] Connecting to unix:/tmp/dist-test-taskGJzHda/test-tmp/rpc-test-afd370be7a0f40a9892650729d2986e3.sock
W20260924 23:06:39.400563  4213 connection.cc:196] Error closing socket: Network error: TlsSocket::Close: Broken pipe
[       OK ] Parameters/TestRpc.TestCredentialsPolicy/SSL_UnixSocket (63 ms)
[ RUN      ] Parameters/TestRpc.TestCallLongerThanKeepalive/SSL_UnixSocket
I20260924 23:06:39.416591  4239 acceptor_pool.cc:254] collecting diagnostics on the listening RPC socket unix:/tmp/dist-test-taskGJzHda/test-tmp/rpc-test-b6f6c73806ae4ea29fd91be11a687e67.sock every 8 connection(s)
I20260924 23:06:39.416625  4240 acceptor_pool.cc:254] collecting diagnostics on the listening RPC socket unix:/tmp/dist-test-taskGJzHda/test-tmp/rpc-test-b6f6c73806ae4ea29fd91be11a687e67.sock every 8 connection(s)
I20260924 23:06:39.445809  4243 rpc-test-base.h:222] got call: sleep_micros: 3000000 deferred: true
I20260924 23:06:42.446555  4243 rpcz_store.cc:275] Call kudu.rpc.GenericCalculatorService.Sleep from unix:<unnamed> (request call id 0) took 3000 ms. Trace:
I20260924 23:06:42.446669  4243 rpcz_store.cc:276] 0924 23:06:39.445735 (+     0us) service_pool.cc:170] Inserting onto call queue
0924 23:06:39.445783 (+    48us) service_pool.cc:227] Handling call
0924 23:06:42.446537 (+3000754us) inbound_call.cc:173] Queueing success response
Metrics: {}
[       OK ] Parameters/TestRpc.TestCallLongerThanKeepalive/SSL_UnixSocket (3043 ms)
[ RUN      ] Parameters/TestRpc.TestRpcSidecar/SSL_UnixSocket
I20260924 23:06:42.462024  4264 acceptor_pool.cc:254] collecting diagnostics on the listening RPC socket unix:/tmp/dist-test-taskGJzHda/test-tmp/rpc-test-79655e67004647d686f441b9fa7e2925.sock every 8 connection(s)
I20260924 23:06:42.462057  4265 acceptor_pool.cc:254] collecting diagnostics on the listening RPC socket unix:/tmp/dist-test-taskGJzHda/test-tmp/rpc-test-79655e67004647d686f441b9fa7e2925.sock every 8 connection(s)
W20260924 23:06:42.505532  4261 connection.cc:196] Error closing socket: Network error: TlsSocket::Close: Broken pipe
[       OK ] Parameters/TestRpc.TestRpcSidecar/SSL_UnixSocket (57 ms)
[ RUN      ] Parameters/TestRpc.TestRpcSidecarLimits/SSL_UnixSocket
I20260924 23:06:44.297345  4290 acceptor_pool.cc:254] collecting diagnostics on the listening RPC socket unix:/tmp/dist-test-taskGJzHda/test-tmp/rpc-test-d8b17c4921fd46e9b0f3836415674999.sock every 8 connection(s)
I20260924 23:06:44.297314  4289 acceptor_pool.cc:254] collecting diagnostics on the listening RPC socket unix:/tmp/dist-test-taskGJzHda/test-tmp/rpc-test-d8b17c4921fd46e9b0f3836415674999.sock every 8 connection(s)
W20260924 23:06:44.306758  4047 serialization.cc:72] Serialized kudu.rpc_test.PushStringsRequestPB (2147483654 bytes) is larger than the maximum configured RPC message size (52428800 bytes). Sending anyway, but peer may reject the data.
W20260924 23:06:44.310521  4286 connection.cc:535] server connection from unix:<unnamed> recv error: Network error: RPC frame had a length of 2147483714, but we only support messages up to 52428800 bytes long.
W20260924 23:06:44.310578  4286 connection.cc:158] shutting down server connection from unix:<unnamed> with pending inbound data: 4/2147483714 bytes received; last active 0 ns ago: status Network error: RPC frame had a length of 2147483714, but we only support messages up to 52428800 bytes long.
W20260924 23:06:44.310734  4302 connection.cc:698] client connection to unix:/tmp/dist-test-taskGJzHda/test-tmp/rpc-test-d8b17c4921fd46e9b0f3836415674999.sock send error: Network error: failed to write to TLS socket: Broken pipe
W20260924 23:06:44.310877  4302 connection.cc:196] Error closing socket: Network error: TlsSocket::Close: Success
I20260924 23:06:44.329906  4314 acceptor_pool.cc:254] collecting diagnostics on the listening RPC socket unix:/tmp/dist-test-taskGJzHda/test-tmp/rpc-test-d8b17c4921fd46e9b0f3836415674999.sock every 8 connection(s)
I20260924 23:06:44.330039  4315 acceptor_pool.cc:254] collecting diagnostics on the listening RPC socket unix:/tmp/dist-test-taskGJzHda/test-tmp/rpc-test-d8b17c4921fd46e9b0f3836415674999.sock every 8 connection(s)
W20260924 23:06:48.557819  4311 connection.cc:577] server connection from unix:<unnamed>: received bad data: 'Corruption: Invalid packet: message had a length of 2147483710, but we only support messages up to 2147483647 bytes
'
W20260924 23:06:48.558185  4327 connection.cc:196] Error closing socket: Network error: TlsSocket::Close: Broken pipe
[       OK ] Parameters/TestRpc.TestRpcSidecarLimits/SSL_UnixSocket (6053 ms)
[ RUN      ] Parameters/TestRpc.TestCallTimeoutDoesntAffectNegotiation/SSL_UnixSocket
I20260924 23:06:48.579169  4339 acceptor_pool.cc:254] collecting diagnostics on the listening RPC socket unix:/tmp/dist-test-taskGJzHda/test-tmp/rpc-test-7eead3b8bbcb488d843ff9e34ddab59a.sock every 8 connection(s)
I20260924 23:06:48.579244  4340 acceptor_pool.cc:254] collecting diagnostics on the listening RPC socket unix:/tmp/dist-test-taskGJzHda/test-tmp/rpc-test-7eead3b8bbcb488d843ff9e34ddab59a.sock every 8 connection(s)
W20260924 23:06:48.591892  4335 negotiation.cc:266] Injecting 500ms delay in negotiation
I20260924 23:06:48.642234  4047 rpc-test-base.h:595] status: Timed out: connection negotiation to unix:/tmp/dist-test-taskGJzHda/test-tmp/rpc-test-7eead3b8bbcb488d843ff9e34ddab59a.sock for RPC Sleep timed out after 0.050s (ON_OUTBOUND_QUEUE), seconds elapsed: 0.0507867
[       OK ] Parameters/TestRpc.TestCallTimeoutDoesntAffectNegotiation/SSL_UnixSocket (538 ms)
[ RUN      ] Parameters/TestRpc.TestRpcHandlerLatencyMetric/SSL_UnixSocket
I20260924 23:06:49.111976  4365 acceptor_pool.cc:254] collecting diagnostics on the listening RPC socket unix:/tmp/dist-test-taskGJzHda/test-tmp/rpc-test-4fa21ca733fe4c839f918e0c5e7c3f53.sock every 8 connection(s)
I20260924 23:06:49.112002  4364 acceptor_pool.cc:254] collecting diagnostics on the listening RPC socket unix:/tmp/dist-test-taskGJzHda/test-tmp/rpc-test-4fa21ca733fe4c839f918e0c5e7c3f53.sock every 8 connection(s)
I20260924 23:06:49.164332  4047 rpc-test.cc:1236] Sleep() min lat: 20353
I20260924 23:06:49.164431  4047 rpc-test.cc:1237] Sleep() mean lat: 20353
I20260924 23:06:49.164458  4047 rpc-test.cc:1238] Sleep() max lat: 20353
I20260924 23:06:49.164470  4047 rpc-test.cc:1239] Sleep() #calls: 1
W20260924 23:06:49.165160  4361 connection.cc:196] Error closing socket: Network error: TlsSocket::Close: Broken pipe
[       OK ] Parameters/TestRpc.TestRpcHandlerLatencyMetric/SSL_UnixSocket (67 ms)
[ RUN      ] Parameters/TestRpc.TimedOutOnResponseMetricServiceQueue/SSL_UnixSocket
I20260924 23:06:49.173265  4390 acceptor_pool.cc:254] collecting diagnostics on the listening RPC socket unix:/tmp/dist-test-taskGJzHda/test-tmp/rpc-test-1b3d078d85df44d7b94627129df70b36.sock every 8 connection(s)
I20260924 23:06:49.173291  4391 acceptor_pool.cc:254] collecting diagnostics on the listening RPC socket unix:/tmp/dist-test-taskGJzHda/test-tmp/rpc-test-1b3d078d85df44d7b94627129df70b36.sock every 8 connection(s)
W20260924 23:06:49.226912  4392 rpcz_store.cc:267] Call kudu.rpc_test.CalculatorService.Sleep from unix:<unnamed> (request call id 2) took 20 ms (client timeout 20 ms). Trace:
W20260924 23:06:49.227059  4392 rpcz_store.cc:269] 0924 23:06:49.206554 (+     0us) service_pool.cc:170] Inserting onto call queue
0924 23:06:49.226859 (+ 20305us) service_pool.cc:214] Skipping call since client already timed out
0924 23:06:49.226880 (+    21us) inbound_call.cc:173] Queueing failure response
Metrics: {}
W20260924 23:06:49.227617  4387 connection.cc:196] Error closing socket: Network error: TlsSocket::Close: Broken pipe
[       OK ] Parameters/TestRpc.TimedOutOnResponseMetricServiceQueue/SSL_UnixSocket (62 ms)
[ RUN      ] Parameters/TestRpc.RpcPendingConnectionsMetric/SSL_UnixSocket
I20260924 23:06:49.230876  4413 acceptor_pool.cc:254] collecting diagnostics on the listening RPC socket 0.0.0.0:43573 every 8 connection(s)
I20260924 23:06:49.230937  4414 acceptor_pool.cc:254] collecting diagnostics on the listening RPC socket 0.0.0.0:43573 every 8 connection(s)
W20260924 23:06:49.231612  4409 negotiation.cc:337] Failed RPC negotiation. Trace:
0924 23:06:49.231411 (+     0us) reactor.cc:625] Submitting negotiation task for server connection from 127.0.0.1:59574 (local address 127.0.0.1:43573)
0924 23:06:49.231455 (+    44us) server_negotiation.cc:206] Beginning negotiation
0924 23:06:49.231457 (+     2us) server_negotiation.cc:399] Waiting for connection header
0924 23:06:49.231553 (+    96us) negotiation.cc:327] Negotiation complete: Network error: Server connection negotiation failed: server connection from 127.0.0.1:59574: BlockingRecv error: recv got EOF from 127.0.0.1:59574 (error 108)
Metrics: {"server-negotiator.queue_time_us":13}
[       OK ] Parameters/TestRpc.RpcPendingConnectionsMetric/SSL_UnixSocket (14 ms)
[ RUN      ] Parameters/TestRpc.TestRpcContextClientDeadline/SSL_UnixSocket
I20260924 23:06:49.259697  4429 acceptor_pool.cc:254] collecting diagnostics on the listening RPC socket unix:/tmp/dist-test-taskGJzHda/test-tmp/rpc-test-3ee6844bed674763b8ebca297d4fdd0b.sock every 8 connection(s)
I20260924 23:06:49.259758  4430 acceptor_pool.cc:254] collecting diagnostics on the listening RPC socket unix:/tmp/dist-test-taskGJzHda/test-tmp/rpc-test-3ee6844bed674763b8ebca297d4fdd0b.sock every 8 connection(s)
W20260924 23:06:49.302167  4426 connection.cc:196] Error closing socket: Network error: TlsSocket::Close: Broken pipe
[       OK ] Parameters/TestRpc.TestRpcContextClientDeadline/SSL_UnixSocket (60 ms)
[ RUN      ] Parameters/TestRpc.TestApplicationFeatureFlagUnsupportedServer/SSL_UnixSocket
I20260924 23:06:49.318809  4454 acceptor_pool.cc:254] collecting diagnostics on the listening RPC socket unix:/tmp/dist-test-taskGJzHda/test-tmp/rpc-test-01a18a7d56b043888d35ac3d5a0bad08.sock every 8 connection(s)
I20260924 23:06:49.318828  4455 acceptor_pool.cc:254] collecting diagnostics on the listening RPC socket unix:/tmp/dist-test-taskGJzHda/test-tmp/rpc-test-01a18a7d56b043888d35ac3d5a0bad08.sock every 8 connection(s)
[       OK ] Parameters/TestRpc.TestApplicationFeatureFlagUnsupportedServer/SSL_UnixSocket (43 ms)
[ RUN      ] Parameters/TestRpc.TestCancellationAsync/SSL_UnixSocket
I20260924 23:06:49.369746  4479 acceptor_pool.cc:254] collecting diagnostics on the listening RPC socket unix:/tmp/dist-test-taskGJzHda/test-tmp/rpc-test-f455b79eef0e4b1d8d6dea3ea7405436.sock every 8 connection(s)
I20260924 23:06:49.369822  4480 acceptor_pool.cc:254] collecting diagnostics on the listening RPC socket unix:/tmp/dist-test-taskGJzHda/test-tmp/rpc-test-f455b79eef0e4b1d8d6dea3ea7405436.sock every 8 connection(s)
I20260924 23:06:49.370093  4047 rpc-test.cc:1716] Connecting to unix:/tmp/dist-test-taskGJzHda/test-tmp/rpc-test-f455b79eef0e4b1d8d6dea3ea7405436.sock
I20260924 23:06:49.380285  4047 test_util.cc:268] Using random seed: -1483447878
I20260924 23:06:49.395545  4483 rpc-test-base.h:240] got call: sleep_micros: 500 pattern: 4294967295 num_repetitions: 2097152 sidecar_idx: 0
I20260924 23:06:49.406404  4483 rpc-test-base.h:240] got call: sleep_micros: 500 pattern: 4294967295 num_repetitions: 2097152 sidecar_idx: 0
I20260924 23:06:49.417559  4483 rpc-test-base.h:240] got call: sleep_micros: 500 pattern: 4294967295 num_repetitions: 2097152 sidecar_idx: 0
I20260924 23:06:49.428325  4483 rpc-test-base.h:240] got call: sleep_micros: 500 pattern: 4294967295 num_repetitions: 2097152 sidecar_idx: 0
I20260924 23:06:49.438848  4483 rpc-test-base.h:240] got call: sleep_micros: 500 pattern: 4294967295 num_repetitions: 2097152 sidecar_idx: 0
I20260924 23:06:49.450095  4483 rpc-test-base.h:240] got call: sleep_micros: 500 pattern: 4294967295 num_repetitions: 2097152 sidecar_idx: 0
I20260924 23:06:49.461184  4483 rpc-test-base.h:240] got call: sleep_micros: 500 pattern: 4294967295 num_repetitions: 2097152 sidecar_idx: 0
I20260924 23:06:49.471951  4483 rpc-test-base.h:240] got call: sleep_micros: 500 pattern: 4294967295 num_repetitions: 2097152 sidecar_idx: 0
W20260924 23:06:49.473754  4476 connection.cc:196] Error closing socket: Network error: TlsSocket::Close: Broken pipe
W20260924 23:06:49.475148  4476 connection.cc:441] server connection from unix:<unnamed> torn down before Call kudu.rpc.GenericCalculatorService.SleepWithSidecar from unix:<unnamed> (request call id 9) could send its response
[       OK ] Parameters/TestRpc.TestCancellationAsync/SSL_UnixSocket (129 ms)
[ RUN      ] Parameters/TestRpc.TestPerformanceBySocketType/SSL_UnixSocket
I20260924 23:06:49.488901  4504 acceptor_pool.cc:254] collecting diagnostics on the listening RPC socket unix:/tmp/dist-test-taskGJzHda/test-tmp/rpc-test-66bf8ebd6c6345f3814319e4885ec8b6.sock every 8 connection(s)
I20260924 23:06:49.488924  4505 acceptor_pool.cc:254] collecting diagnostics on the listening RPC socket unix:/tmp/dist-test-taskGJzHda/test-tmp/rpc-test-66bf8ebd6c6345f3814319e4885ec8b6.sock every 8 connection(s)
I20260924 23:06:49.489140  4047 rpc-test.cc:1846] Connecting to unix:/tmp/dist-test-taskGJzHda/test-tmp/rpc-test-66bf8ebd6c6345f3814319e4885ec8b6.sock
I20260924 23:06:50.856729  4047 rpc-test.cc:1859] Sending 1024MB via ssl-enabled unix socket: real 1.360s	user 1.550s	sys 0.860s
I20260924 23:06:52.142359  4047 rpc-test.cc:1859] Sending 1024MB via ssl-enabled unix socket: real 1.285s	user 1.406s	sys 0.887s
I20260924 23:06:53.461460  4047 rpc-test.cc:1859] Sending 1024MB via ssl-enabled unix socket: real 1.319s	user 1.388s	sys 0.954s
I20260924 23:06:54.795495  4047 rpc-test.cc:1859] Sending 1024MB via ssl-enabled unix socket: real 1.334s	user 1.427s	sys 0.937s
I20260924 23:06:56.091645  4047 rpc-test.cc:1859] Sending 1024MB via ssl-enabled unix socket: real 1.296s	user 1.408s	sys 0.908s
W20260924 23:06:56.092343  4501 connection.cc:196] Error closing socket: Network error: TlsSocket::Close: Broken pipe
[       OK ] Parameters/TestRpc.TestPerformanceBySocketType/SSL_UnixSocket (6618 ms)
[----------] 20 tests from Parameters/TestRpc (26602 ms total)

[----------] 1 test from Parameters/TestRpcSocketTxRxQueue
[ RUN      ] Parameters/TestRpcSocketTxRxQueue.AcceptorRxQueueSizeMetric/0
I20260924 23:06:56.096807  4529 acceptor_pool.cc:254] collecting diagnostics on the listening RPC socket 0.0.0.0:36419 every 1 connection(s)
I20260924 23:06:56.096894  4530 acceptor_pool.cc:254] collecting diagnostics on the listening RPC socket 0.0.0.0:36419 every 1 connection(s)
W20260924 23:06:56.097432  4525 negotiation.cc:337] Failed RPC negotiation. Trace:
0924 23:06:56.097283 (+     0us) reactor.cc:625] Submitting negotiation task for server connection from 127.0.0.1:36362 (local address 127.0.0.1:36419)
0924 23:06:56.097331 (+    48us) server_negotiation.cc:206] Beginning negotiation
0924 23:06:56.097333 (+     2us) server_negotiation.cc:399] Waiting for connection header
0924 23:06:56.097405 (+    72us) negotiation.cc:327] Negotiation complete: Network error: Server connection negotiation failed: server connection from 127.0.0.1:36362: BlockingRecv error: recv got EOF from 127.0.0.1:36362 (error 108)
Metrics: {"server-negotiator.queue_time_us":15}
[       OK ] Parameters/TestRpcSocketTxRxQueue.AcceptorRxQueueSizeMetric/0 (4 ms)
[----------] 1 test from Parameters/TestRpcSocketTxRxQueue (4 ms total)

[----------] Global test environment tear-down
[==========] 21 tests from 2 test suites ran. (26607 ms total)
[  PASSED  ] 20 tests.
[  FAILED  ] 1 test, listed below:
[  FAILED  ] Parameters/TestRpc.TestCallWithChainCertAndChainCA/SSL_UnixSocket, where GetParam() = (true, true)

 1 FAILED TEST