Diagnosed failure

Parameters/TestRpc.TestCallWithChainCertAndChainCA/SSL_TCP: /data0/somelongdirectorytoavoidrpathissues/src/kudu/src/kudu/rpc/rpc-test.cc:270: Failure
Failed
Bad status: Runtime error: could not verify certificate chain (error with cert: subject=CN = localhost, ST = sadfjas, C = AS, emailAddress = sdflkdsajf, O = lskdfjlsad, OU = sldfkja, issuer=C = AS, ST = ASDfkjdhf, L = lskdjf, O = saldfja, OU = skdjf, CN = localhost, emailAddress = sadjflkadsj): : certificate has expired
Google Test trace:
/data0/somelongdirectorytoavoidrpathissues/src/kudu/src/kudu/rpc/rpc-test.cc:267: Connecting to 0.0.0.0:38103
I20260929 22:46:09.368043 31100 test_util.cc:175] -----------------------------------------------
I20260929 22:46:09.368120 31100 test_util.cc:176] Had fatal failures, leaving test files at /tmp/dist-test-taskDgQbul/test-tmp/rpc-test.5.Parameters_TestRpc.TestCallWithChainCertAndChainCA_SSL_TCP.1790721969291097-31100-0

Full log

Note: This is test shard 6 of 8.
[==========] Running 21 tests from 2 test suites.
[----------] Global test environment set-up.
[----------] 20 tests from Parameters/TestRpc
[ RUN      ] Parameters/TestRpc.TestMessengerCreateDestroy/SSL_TCP
WARNING: Logging before InitGoogleLogging() is written to STDERR
I20260929 22:46:09.312573 31100 rpc-test.cc:169] started messenger TestCreateDestroy
[       OK ] Parameters/TestRpc.TestMessengerCreateDestroy/SSL_TCP (20 ms)
[ RUN      ] Parameters/TestRpc.TestNegotiationDeadlock/SSL_TCP
I20260929 22:46:09.328589 31121 acceptor_pool.cc:254] collecting diagnostics on the listening RPC socket 0.0.0.0:42455 every 8 connection(s)
I20260929 22:46:09.328598 31120 acceptor_pool.cc:254] collecting diagnostics on the listening RPC socket 0.0.0.0:42455 every 8 connection(s)
[       OK ] Parameters/TestRpc.TestNegotiationDeadlock/SSL_TCP (22 ms)
[ RUN      ] Parameters/TestRpc.TestCallWithChainCertAndChainCA/SSL_TCP
I20260929 22:46:09.363679 31136 acceptor_pool.cc:254] collecting diagnostics on the listening RPC socket 0.0.0.0:38103 every 8 connection(s)
I20260929 22:46:09.363698 31137 acceptor_pool.cc:254] collecting diagnostics on the listening RPC socket 0.0.0.0:38103 every 8 connection(s)
/data0/somelongdirectorytoavoidrpathissues/src/kudu/src/kudu/rpc/rpc-test.cc:270: Failure
Failed
Bad status: Runtime error: could not verify certificate chain (error with cert: subject=CN = localhost, ST = sadfjas, C = AS, emailAddress = sdflkdsajf, O = lskdfjlsad, OU = sldfkja, issuer=C = AS, ST = ASDfkjdhf, L = lskdjf, O = saldfja, OU = skdjf, CN = localhost, emailAddress = sadjflkadsj): : certificate has expired
Google Test trace:
/data0/somelongdirectorytoavoidrpathissues/src/kudu/src/kudu/rpc/rpc-test.cc:267: Connecting to 0.0.0.0:38103
I20260929 22:46:09.368043 31100 test_util.cc:175] -----------------------------------------------
I20260929 22:46:09.368120 31100 test_util.cc:176] Had fatal failures, leaving test files at /tmp/dist-test-taskDgQbul/test-tmp/rpc-test.5.Parameters_TestRpc.TestCallWithChainCertAndChainCA_SSL_TCP.1790721969291097-31100-0
[  FAILED  ] Parameters/TestRpc.TestCallWithChainCertAndChainCA/SSL_TCP, where GetParam() = (true, false) (31 ms)
[ RUN      ] Parameters/TestRpc.TestCallWithPasswordProtectedKey/SSL_TCP
I20260929 22:46:09.387270 31162 acceptor_pool.cc:254] collecting diagnostics on the listening RPC socket 0.0.0.0:44743 every 8 connection(s)
I20260929 22:46:09.387323 31161 acceptor_pool.cc:254] collecting diagnostics on the listening RPC socket 0.0.0.0:44743 every 8 connection(s)
[       OK ] Parameters/TestRpc.TestCallWithPasswordProtectedKey/SSL_TCP (32 ms)
[ RUN      ] Parameters/TestRpc.TestCallToBadServer/SSL_TCP
I20260929 22:46:09.420498 31100 rpc-test.cc:394] Status: Network error: Client connection negotiation failed: client connection to 0.0.0.0:0: connect: Connection refused (error 111)
I20260929 22:46:09.420849 31100 rpc-test.cc:394] Status: Network error: Client connection negotiation failed: client connection to 0.0.0.0:0: connect: Connection refused (error 111)
I20260929 22:46:09.421105 31100 rpc-test.cc:394] Status: Network error: Client connection negotiation failed: client connection to 0.0.0.0:0: connect: Connection refused (error 111)
I20260929 22:46:09.421330 31100 rpc-test.cc:394] Status: Network error: Client connection negotiation failed: client connection to 0.0.0.0:0: connect: Connection refused (error 111)
I20260929 22:46:09.421530 31100 rpc-test.cc:394] Status: Network error: Client connection negotiation failed: client connection to 0.0.0.0:0: connect: Connection refused (error 111)
[       OK ] Parameters/TestRpc.TestCallToBadServer/SSL_TCP (21 ms)
[ RUN      ] Parameters/TestRpc.TestWrongService/SSL_TCP
I20260929 22:46:09.442214 31196 acceptor_pool.cc:254] collecting diagnostics on the listening RPC socket 0.0.0.0:42729 every 8 connection(s)
I20260929 22:46:09.442281 31197 acceptor_pool.cc:254] collecting diagnostics on the listening RPC socket 0.0.0.0:42729 every 8 connection(s)
I20260929 22:46:09.455063 31195 messenger.cc:345] service WrongServiceName not registered on TestServer
[       OK ] Parameters/TestRpc.TestWrongService/SSL_TCP (34 ms)
[ RUN      ] Parameters/TestRpc.TestConnectionKeepalive/SSL_TCP
I20260929 22:46:09.474148 31219 acceptor_pool.cc:254] collecting diagnostics on the listening RPC socket 0.0.0.0:40271 every 8 connection(s)
I20260929 22:46:09.474185 31220 acceptor_pool.cc:254] collecting diagnostics on the listening RPC socket 0.0.0.0:40271 every 8 connection(s)
I20260929 22:46:09.474371 31100 rpc-test.cc:488] Connecting to 0.0.0.0:40271
[       OK ] Parameters/TestRpc.TestConnectionKeepalive/SSL_TCP (1061 ms)
[ RUN      ] Parameters/TestRpc.TestClientConnectionMetrics/SSL_TCP
I20260929 22:46:10.535811 31244 acceptor_pool.cc:254] collecting diagnostics on the listening RPC socket 0.0.0.0:33875 every 8 connection(s)
I20260929 22:46:10.535873 31245 acceptor_pool.cc:254] collecting diagnostics on the listening RPC socket 0.0.0.0:33875 every 8 connection(s)
I20260929 22:46:10.536060 31100 rpc-test.cc:569] Connecting to 0.0.0.0:33875
[       OK ] Parameters/TestRpc.TestClientConnectionMetrics/SSL_TCP (11057 ms)
[ RUN      ] Parameters/TestRpc.TestCredentialsPolicy/SSL_TCP
I20260929 22:46:21.608832 31267 acceptor_pool.cc:254] collecting diagnostics on the listening RPC socket 0.0.0.0:40531 every 8 connection(s)
I20260929 22:46:21.608868 31268 acceptor_pool.cc:254] collecting diagnostics on the listening RPC socket 0.0.0.0:40531 every 8 connection(s)
I20260929 22:46:21.609025 31100 rpc-test.cc:700] Connecting to 0.0.0.0:40531
[       OK ] Parameters/TestRpc.TestCredentialsPolicy/SSL_TCP (71 ms)
[ RUN      ] Parameters/TestRpc.TestCallLongerThanKeepalive/SSL_TCP
I20260929 22:46:21.685297 31293 acceptor_pool.cc:254] collecting diagnostics on the listening RPC socket 0.0.0.0:36041 every 8 connection(s)
I20260929 22:46:21.685292 31292 acceptor_pool.cc:254] collecting diagnostics on the listening RPC socket 0.0.0.0:36041 every 8 connection(s)
I20260929 22:46:21.700069 31296 rpc-test-base.h:222] got call: sleep_micros: 3000000 deferred: true
I20260929 22:46:24.700752 31296 rpcz_store.cc:275] Call kudu.rpc.GenericCalculatorService.Sleep from 127.0.0.1:39914 (request call id 0) took 3000 ms. Trace:
I20260929 22:46:24.700871 31296 rpcz_store.cc:276] 0929 22:46:21.699989 (+     0us) service_pool.cc:170] Inserting onto call queue
0929 22:46:21.700045 (+    56us) service_pool.cc:227] Handling call
0929 22:46:24.700734 (+3000689us) inbound_call.cc:173] Queueing success response
Metrics: {}
[       OK ] Parameters/TestRpc.TestCallLongerThanKeepalive/SSL_TCP (3054 ms)
[ RUN      ] Parameters/TestRpc.TestRpcSidecar/SSL_TCP
I20260929 22:46:24.719349 31317 acceptor_pool.cc:254] collecting diagnostics on the listening RPC socket 0.0.0.0:41811 every 8 connection(s)
I20260929 22:46:24.719355 31318 acceptor_pool.cc:254] collecting diagnostics on the listening RPC socket 0.0.0.0:41811 every 8 connection(s)
[       OK ] Parameters/TestRpc.TestRpcSidecar/SSL_TCP (75 ms)
[ RUN      ] Parameters/TestRpc.TestRpcSidecarLimits/SSL_TCP
I20260929 22:46:26.711547 31342 acceptor_pool.cc:254] collecting diagnostics on the listening RPC socket 0.0.0.0:39491 every 8 connection(s)
I20260929 22:46:26.711623 31343 acceptor_pool.cc:254] collecting diagnostics on the listening RPC socket 0.0.0.0:39491 every 8 connection(s)
W20260929 22:46:26.732640 31100 serialization.cc:72] Serialized kudu.rpc_test.PushStringsRequestPB (2147483654 bytes) is larger than the maximum configured RPC message size (52428800 bytes). Sending anyway, but peer may reject the data.
W20260929 22:46:26.736028 31341 connection.cc:535] server connection from 127.0.0.1:52026 recv error: Network error: RPC frame had a length of 2147483714, but we only support messages up to 52428800 bytes long.
W20260929 22:46:26.736105 31341 connection.cc:158] shutting down server connection from 127.0.0.1:52026 with pending inbound data: 4/2147483714 bytes received; last active 0 ns ago: status Network error: RPC frame had a length of 2147483714, but we only support messages up to 52428800 bytes long.
W20260929 22:46:26.736328 31355 connection.cc:196] Error closing socket: Network error: TlsSocket::Close: Connection reset by peer
I20260929 22:46:26.745401 31367 acceptor_pool.cc:254] collecting diagnostics on the listening RPC socket 0.0.0.0:42643 every 8 connection(s)
I20260929 22:46:26.745435 31368 acceptor_pool.cc:254] collecting diagnostics on the listening RPC socket 0.0.0.0:42643 every 8 connection(s)
W20260929 22:46:30.874662 31365 connection.cc:577] server connection from 127.0.0.1:48594: received bad data: 'Corruption: Invalid packet: message had a length of 2147483710, but we only support messages up to 2147483647 bytes
'
[       OK ] Parameters/TestRpc.TestRpcSidecarLimits/SSL_TCP (6098 ms)
[ RUN      ] Parameters/TestRpc.TestCallTimeoutDoesntAffectNegotiation/SSL_TCP
I20260929 22:46:30.885079 31392 acceptor_pool.cc:254] collecting diagnostics on the listening RPC socket 0.0.0.0:36703 every 8 connection(s)
I20260929 22:46:30.885103 31393 acceptor_pool.cc:254] collecting diagnostics on the listening RPC socket 0.0.0.0:36703 every 8 connection(s)
W20260929 22:46:30.893443 31388 negotiation.cc:266] Injecting 500ms delay in negotiation
I20260929 22:46:30.943711 31100 rpc-test-base.h:595] status: Timed out: connection negotiation to 0.0.0.0:36703 for RPC Sleep timed out after 0.050s (ON_OUTBOUND_QUEUE), seconds elapsed: 0.0506027
[       OK ] Parameters/TestRpc.TestCallTimeoutDoesntAffectNegotiation/SSL_TCP (521 ms)
[ RUN      ] Parameters/TestRpc.TestRpcHandlerLatencyMetric/SSL_TCP
I20260929 22:46:31.410316 31417 acceptor_pool.cc:254] collecting diagnostics on the listening RPC socket 0.0.0.0:37665 every 8 connection(s)
I20260929 22:46:31.410427 31418 acceptor_pool.cc:254] collecting diagnostics on the listening RPC socket 0.0.0.0:37665 every 8 connection(s)
I20260929 22:46:31.446657 31100 rpc-test.cc:1236] Sleep() min lat: 20283
I20260929 22:46:31.446738 31100 rpc-test.cc:1237] Sleep() mean lat: 20283
I20260929 22:46:31.446766 31100 rpc-test.cc:1238] Sleep() max lat: 20283
I20260929 22:46:31.446781 31100 rpc-test.cc:1239] Sleep() #calls: 1
[       OK ] Parameters/TestRpc.TestRpcHandlerLatencyMetric/SSL_TCP (49 ms)
[ RUN      ] Parameters/TestRpc.TimedOutOnResponseMetricServiceQueue/SSL_TCP
I20260929 22:46:31.463846 31443 acceptor_pool.cc:254] collecting diagnostics on the listening RPC socket 0.0.0.0:38737 every 8 connection(s)
I20260929 22:46:31.463879 31444 acceptor_pool.cc:254] collecting diagnostics on the listening RPC socket 0.0.0.0:38737 every 8 connection(s)
W20260929 22:46:31.514921 31445 rpcz_store.cc:267] Call kudu.rpc_test.CalculatorService.Sleep from 127.0.0.1:49110 (request call id 2) took 20 ms (client timeout 20 ms). Trace:
W20260929 22:46:31.515058 31445 rpcz_store.cc:269] 0929 22:46:31.494667 (+     0us) service_pool.cc:170] Inserting onto call queue
0929 22:46:31.514882 (+ 20215us) service_pool.cc:214] Skipping call since client already timed out
0929 22:46:31.514893 (+    11us) inbound_call.cc:173] Queueing failure response
Metrics: {}
[       OK ] Parameters/TestRpc.TimedOutOnResponseMetricServiceQueue/SSL_TCP (67 ms)
[ RUN      ] Parameters/TestRpc.RpcPendingConnectionsMetric/SSL_TCP
I20260929 22:46:31.518083 31466 acceptor_pool.cc:254] collecting diagnostics on the listening RPC socket 0.0.0.0:39789 every 8 connection(s)
I20260929 22:46:31.518128 31467 acceptor_pool.cc:254] collecting diagnostics on the listening RPC socket 0.0.0.0:39789 every 8 connection(s)
W20260929 22:46:31.518697 31462 negotiation.cc:337] Failed RPC negotiation. Trace:
0929 22:46:31.518519 (+     0us) reactor.cc:625] Submitting negotiation task for server connection from 127.0.0.1:36906 (local address 127.0.0.1:39789)
0929 22:46:31.518573 (+    54us) server_negotiation.cc:206] Beginning negotiation
0929 22:46:31.518575 (+     2us) server_negotiation.cc:399] Waiting for connection header
0929 22:46:31.518646 (+    71us) negotiation.cc:327] Negotiation complete: Network error: Server connection negotiation failed: server connection from 127.0.0.1:36906: BlockingRecv error: recv got EOF from 127.0.0.1:36906 (error 108)
Metrics: {"server-negotiator.queue_time_us":24}
[       OK ] Parameters/TestRpc.RpcPendingConnectionsMetric/SSL_TCP (13 ms)
[ RUN      ] Parameters/TestRpc.TestRpcContextClientDeadline/SSL_TCP
I20260929 22:46:31.547659 31482 acceptor_pool.cc:254] collecting diagnostics on the listening RPC socket 0.0.0.0:33237 every 8 connection(s)
I20260929 22:46:31.547689 31483 acceptor_pool.cc:254] collecting diagnostics on the listening RPC socket 0.0.0.0:33237 every 8 connection(s)
[       OK ] Parameters/TestRpc.TestRpcContextClientDeadline/SSL_TCP (54 ms)
[ RUN      ] Parameters/TestRpc.TestApplicationFeatureFlagUnsupportedServer/SSL_TCP
I20260929 22:46:31.591776 31507 acceptor_pool.cc:254] collecting diagnostics on the listening RPC socket 0.0.0.0:39995 every 8 connection(s)
I20260929 22:46:31.591825 31508 acceptor_pool.cc:254] collecting diagnostics on the listening RPC socket 0.0.0.0:39995 every 8 connection(s)
[       OK ] Parameters/TestRpc.TestApplicationFeatureFlagUnsupportedServer/SSL_TCP (19 ms)
[ RUN      ] Parameters/TestRpc.TestCancellationAsync/SSL_TCP
I20260929 22:46:31.618003 31532 acceptor_pool.cc:254] collecting diagnostics on the listening RPC socket 0.0.0.0:46509 every 8 connection(s)
I20260929 22:46:31.618065 31533 acceptor_pool.cc:254] collecting diagnostics on the listening RPC socket 0.0.0.0:46509 every 8 connection(s)
I20260929 22:46:31.618222 31100 rpc-test.cc:1716] Connecting to 0.0.0.0:46509
I20260929 22:46:31.633844 31100 test_util.cc:268] Using random seed: -197923919
I20260929 22:46:31.655249 31536 rpc-test-base.h:240] got call: sleep_micros: 500 pattern: 4294967295 num_repetitions: 2097152 sidecar_idx: 0
I20260929 22:46:31.671626 31536 rpc-test-base.h:240] got call: sleep_micros: 500 pattern: 4294967295 num_repetitions: 2097152 sidecar_idx: 0
I20260929 22:46:31.690198 31536 rpc-test-base.h:240] got call: sleep_micros: 500 pattern: 4294967295 num_repetitions: 2097152 sidecar_idx: 0
I20260929 22:46:31.708397 31536 rpc-test-base.h:240] got call: sleep_micros: 500 pattern: 4294967295 num_repetitions: 2097152 sidecar_idx: 0
I20260929 22:46:31.720167 31536 rpc-test-base.h:240] got call: sleep_micros: 500 pattern: 4294967295 num_repetitions: 2097152 sidecar_idx: 0
I20260929 22:46:31.731559 31536 rpc-test-base.h:240] got call: sleep_micros: 500 pattern: 4294967295 num_repetitions: 2097152 sidecar_idx: 0
I20260929 22:46:31.743366 31536 rpc-test-base.h:240] got call: sleep_micros: 500 pattern: 4294967295 num_repetitions: 2097152 sidecar_idx: 0
I20260929 22:46:31.755111 31536 rpc-test-base.h:240] got call: sleep_micros: 500 pattern: 4294967295 num_repetitions: 2097152 sidecar_idx: 0
W20260929 22:46:31.758239 31529 connection.cc:441] server connection from 127.0.0.1:53032 torn down before Call kudu.rpc.GenericCalculatorService.SleepWithSidecar from 127.0.0.1:53032 (request call id 9) could send its response
[       OK ] Parameters/TestRpc.TestCancellationAsync/SSL_TCP (155 ms)
[ RUN      ] Parameters/TestRpc.TestPerformanceBySocketType/SSL_TCP
I20260929 22:46:31.779160 31557 acceptor_pool.cc:254] collecting diagnostics on the listening RPC socket 0.0.0.0:33299 every 8 connection(s)
I20260929 22:46:31.779230 31558 acceptor_pool.cc:254] collecting diagnostics on the listening RPC socket 0.0.0.0:33299 every 8 connection(s)
I20260929 22:46:31.779400 31100 rpc-test.cc:1846] Connecting to 0.0.0.0:33299
I20260929 22:46:33.387979 31100 rpc-test.cc:1859] Sending 1024MB via ssl-enabled tcp socket: real 1.596s	user 1.444s	sys 1.395s
I20260929 22:46:34.956007 31100 rpc-test.cc:1859] Sending 1024MB via ssl-enabled tcp socket: real 1.568s	user 1.462s	sys 1.345s
I20260929 22:46:36.620481 31100 rpc-test.cc:1859] Sending 1024MB via ssl-enabled tcp socket: real 1.664s	user 1.583s	sys 1.380s
I20260929 22:46:38.311550 31100 rpc-test.cc:1859] Sending 1024MB via ssl-enabled tcp socket: real 1.691s	user 1.677s	sys 1.338s
I20260929 22:46:39.944094 31100 rpc-test.cc:1859] Sending 1024MB via ssl-enabled tcp socket: real 1.632s	user 1.461s	sys 1.449s
[       OK ] Parameters/TestRpc.TestPerformanceBySocketType/SSL_TCP (8186 ms)
[----------] 20 tests from Parameters/TestRpc (30652 ms total)

[----------] 1 test from Parameters/TestRpcSocketTxRxQueue
[ RUN      ] Parameters/TestRpcSocketTxRxQueue.OverCapacity/0
W20260929 22:46:40.217521 31592 negotiation.cc:337] Failed RPC negotiation. Trace:
0929 22:46:39.956033 (+     0us) reactor.cc:625] Submitting negotiation task for client connection to 0.0.0.0:39909 (local address 127.0.0.1:55218)
0929 22:46:39.956093 (+    60us) negotiation.cc:107] Waiting for socket to connect
0929 22:46:39.956101 (+     8us) client_negotiation.cc:174] Beginning negotiation
0929 22:46:39.956160 (+    59us) client_negotiation.cc:252] Sending NEGOTIATE NegotiatePB request
0929 22:46:40.217389 (+261229us) negotiation.cc:327] Negotiation complete: Network error: Client connection negotiation failed: client connection to 0.0.0.0:39909: BlockingRecv error: recv error from unknown peer: Transport endpoint is not connected (error 107)
Metrics: {"client-negotiator.queue_time_us":35}
W20260929 22:46:40.217619 31601 negotiation.cc:337] Failed RPC negotiation. Trace:
0929 22:46:39.956899 (+     0us) reactor.cc:625] Submitting negotiation task for client connection to 0.0.0.0:39909 (local address 127.0.0.1:55226)
0929 22:46:39.956933 (+    34us) negotiation.cc:107] Waiting for socket to connect
0929 22:46:39.956942 (+     9us) client_negotiation.cc:174] Beginning negotiation
0929 22:46:39.957000 (+    58us) client_negotiation.cc:252] Sending NEGOTIATE NegotiatePB request
0929 22:46:40.217561 (+260561us) negotiation.cc:327] Negotiation complete: Network error: Client connection negotiation failed: client connection to 0.0.0.0:39909: BlockingRecv error: recv error from unknown peer: Transport endpoint is not connected (error 107)
Metrics: {"client-negotiator.queue_time_us":17}
W20260929 22:46:40.217708 31574 negotiation.cc:337] Failed RPC negotiation. Trace:
0929 22:46:39.954177 (+     0us) reactor.cc:625] Submitting negotiation task for client connection to 0.0.0.0:39909 (local address 127.0.0.1:55198)
0929 22:46:39.954248 (+    71us) negotiation.cc:107] Waiting for socket to connect
0929 22:46:39.954258 (+    10us) client_negotiation.cc:174] Beginning negotiation
0929 22:46:39.954315 (+    57us) client_negotiation.cc:252] Sending NEGOTIATE NegotiatePB request
0929 22:46:40.217476 (+263161us) negotiation.cc:327] Negotiation complete: Network error: Client connection negotiation failed: client connection to 0.0.0.0:39909: BlockingRecv error: recv error from unknown peer: Transport endpoint is not connected (error 107)
Metrics: {"client-negotiator.queue_time_us":46}
W20260929 22:46:40.217761 31583 negotiation.cc:337] Failed RPC negotiation. Trace:
0929 22:46:39.955127 (+     0us) reactor.cc:625] Submitting negotiation task for client connection to 0.0.0.0:39909 (local address 127.0.0.1:55210)
0929 22:46:39.955212 (+    85us) negotiation.cc:107] Waiting for socket to connect
0929 22:46:39.955245 (+    33us) client_negotiation.cc:174] Beginning negotiation
0929 22:46:39.955312 (+    67us) client_negotiation.cc:252] Sending NEGOTIATE NegotiatePB request
0929 22:46:40.217476 (+262164us) negotiation.cc:327] Negotiation complete: Network error: Client connection negotiation failed: client connection to 0.0.0.0:39909: BlockingRecv error: recv error from unknown peer: Transport endpoint is not connected (error 107)
Metrics: {"client-negotiator.queue_time_us":36}
W20260929 22:46:40.217844 31619 negotiation.cc:337] Failed RPC negotiation. Trace:
0929 22:46:39.958588 (+     0us) reactor.cc:625] Submitting negotiation task for client connection to 0.0.0.0:39909 (local address 127.0.0.1:55248)
0929 22:46:39.958621 (+    33us) negotiation.cc:107] Waiting for socket to connect
0929 22:46:39.958629 (+     8us) client_negotiation.cc:174] Beginning negotiation
0929 22:46:39.958684 (+    55us) client_negotiation.cc:252] Sending NEGOTIATE NegotiatePB request
0929 22:46:40.217639 (+258955us) negotiation.cc:327] Negotiation complete: Network error: Client connection negotiation failed: client connection to 0.0.0.0:39909: BlockingRecv error: recv error from unknown peer: Transport endpoint is not connected (error 107)
Metrics: {"client-negotiator.queue_time_us":17}
W20260929 22:46:40.217917 31610 negotiation.cc:337] Failed RPC negotiation. Trace:
0929 22:46:39.957743 (+     0us) reactor.cc:625] Submitting negotiation task for client connection to 0.0.0.0:39909 (local address 127.0.0.1:55234)
0929 22:46:39.957798 (+    55us) negotiation.cc:107] Waiting for socket to connect
0929 22:46:39.957806 (+     8us) client_negotiation.cc:174] Beginning negotiation
0929 22:46:39.957865 (+    59us) client_negotiation.cc:252] Sending NEGOTIATE NegotiatePB request
0929 22:46:40.217524 (+259659us) negotiation.cc:327] Negotiation complete: Network error: Client connection negotiation failed: client connection to 0.0.0.0:39909: BlockingRecv error: recv error from unknown peer: Transport endpoint is not connected (error 107)
Metrics: {"client-negotiator.queue_time_us":35}
[       OK ] Parameters/TestRpcSocketTxRxQueue.OverCapacity/0 (1031 ms)
[----------] 1 test from Parameters/TestRpcSocketTxRxQueue (1031 ms total)

[----------] Global test environment tear-down
[==========] 21 tests from 2 test suites ran. (31683 ms total)
[  PASSED  ] 20 tests.
[  FAILED  ] 1 test, listed below:
[  FAILED  ] Parameters/TestRpc.TestCallWithChainCertAndChainCA/SSL_TCP, where GetParam() = (true, false)

 1 FAILED TEST