Diagnosed failure

Parameters/TestRpc.TestCallWithChainCertAndChainCA/SSL_TCP: /data0/somelongdirectorytoavoidrpathissues/src/kudu/src/kudu/rpc/rpc-test.cc:270: Failure
Failed
Bad status: Runtime error: could not verify certificate chain (error with cert: subject=CN = localhost, ST = sadfjas, C = AS, emailAddress = sdflkdsajf, O = lskdfjlsad, OU = sldfkja, issuer=C = AS, ST = ASDfkjdhf, L = lskdjf, O = saldfja, OU = skdjf, CN = localhost, emailAddress = sadjflkadsj): : certificate has expired
Google Test trace:
/data0/somelongdirectorytoavoidrpathissues/src/kudu/src/kudu/rpc/rpc-test.cc:267: Connecting to 0.0.0.0:34611
I20260925 10:08:30.405787 14597 test_util.cc:175] -----------------------------------------------
I20260925 10:08:30.406010 14597 test_util.cc:176] Had fatal failures, leaving test files at /tmp/dist-test-taskUnv3Dl/test-tmp/rpc-test.5.Parameters_TestRpc.TestCallWithChainCertAndChainCA_SSL_TCP.1790330909002544-14597-0

Full log

Note: This is test shard 6 of 8.
[==========] Running 21 tests from 2 test suites.
[----------] Global test environment set-up.
[----------] 20 tests from Parameters/TestRpc
[ RUN      ] Parameters/TestRpc.TestMessengerCreateDestroy/SSL_TCP
WARNING: Logging before InitGoogleLogging() is written to STDERR
I20260925 10:08:29.107316 14597 rpc-test.cc:169] started messenger TestCreateDestroy
[       OK ] Parameters/TestRpc.TestMessengerCreateDestroy/SSL_TCP (1208 ms)
[ RUN      ] Parameters/TestRpc.TestNegotiationDeadlock/SSL_TCP
I20260925 10:08:30.295286 14619 acceptor_pool.cc:254] collecting diagnostics on the listening RPC socket 0.0.0.0:41647 every 8 connection(s)
I20260925 10:08:30.297103 14620 acceptor_pool.cc:254] collecting diagnostics on the listening RPC socket 0.0.0.0:41647 every 8 connection(s)
[       OK ] Parameters/TestRpc.TestNegotiationDeadlock/SSL_TCP (84 ms)
[ RUN      ] Parameters/TestRpc.TestCallWithChainCertAndChainCA/SSL_TCP
I20260925 10:08:30.376629 14635 acceptor_pool.cc:254] collecting diagnostics on the listening RPC socket 0.0.0.0:34611 every 8 connection(s)
I20260925 10:08:30.378969 14636 acceptor_pool.cc:254] collecting diagnostics on the listening RPC socket 0.0.0.0:34611 every 8 connection(s)
/data0/somelongdirectorytoavoidrpathissues/src/kudu/src/kudu/rpc/rpc-test.cc:270: Failure
Failed
Bad status: Runtime error: could not verify certificate chain (error with cert: subject=CN = localhost, ST = sadfjas, C = AS, emailAddress = sdflkdsajf, O = lskdfjlsad, OU = sldfkja, issuer=C = AS, ST = ASDfkjdhf, L = lskdjf, O = saldfja, OU = skdjf, CN = localhost, emailAddress = sadjflkadsj): : certificate has expired
Google Test trace:
/data0/somelongdirectorytoavoidrpathissues/src/kudu/src/kudu/rpc/rpc-test.cc:267: Connecting to 0.0.0.0:34611
I20260925 10:08:30.405787 14597 test_util.cc:175] -----------------------------------------------
I20260925 10:08:30.406010 14597 test_util.cc:176] Had fatal failures, leaving test files at /tmp/dist-test-taskUnv3Dl/test-tmp/rpc-test.5.Parameters_TestRpc.TestCallWithChainCertAndChainCA_SSL_TCP.1790330909002544-14597-0
[  FAILED  ] Parameters/TestRpc.TestCallWithChainCertAndChainCA/SSL_TCP, where GetParam() = (true, false) (54 ms)
[ RUN      ] Parameters/TestRpc.TestCallWithPasswordProtectedKey/SSL_TCP
I20260925 10:08:30.444754 14660 acceptor_pool.cc:254] collecting diagnostics on the listening RPC socket 0.0.0.0:45371 every 8 connection(s)
I20260925 10:08:30.445499 14661 acceptor_pool.cc:254] collecting diagnostics on the listening RPC socket 0.0.0.0:45371 every 8 connection(s)
[       OK ] Parameters/TestRpc.TestCallWithPasswordProtectedKey/SSL_TCP (93 ms)
[ RUN      ] Parameters/TestRpc.TestCallToBadServer/SSL_TCP
I20260925 10:08:30.518913 14597 rpc-test.cc:394] Status: Network error: Client connection negotiation failed: client connection to 0.0.0.0:0: connect: Connection refused (error 111)
I20260925 10:08:30.520181 14597 rpc-test.cc:394] Status: Network error: Client connection negotiation failed: client connection to 0.0.0.0:0: connect: Connection refused (error 111)
I20260925 10:08:30.521358 14597 rpc-test.cc:394] Status: Network error: Client connection negotiation failed: client connection to 0.0.0.0:0: connect: Connection refused (error 111)
I20260925 10:08:30.522547 14597 rpc-test.cc:394] Status: Network error: Client connection negotiation failed: client connection to 0.0.0.0:0: connect: Connection refused (error 111)
I20260925 10:08:30.523738 14597 rpc-test.cc:394] Status: Network error: Client connection negotiation failed: client connection to 0.0.0.0:0: connect: Connection refused (error 111)
[       OK ] Parameters/TestRpc.TestCallToBadServer/SSL_TCP (26 ms)
[ RUN      ] Parameters/TestRpc.TestWrongService/SSL_TCP
I20260925 10:08:30.563091 14695 acceptor_pool.cc:254] collecting diagnostics on the listening RPC socket 0.0.0.0:33929 every 8 connection(s)
I20260925 10:08:30.563891 14696 acceptor_pool.cc:254] collecting diagnostics on the listening RPC socket 0.0.0.0:33929 every 8 connection(s)
I20260925 10:08:30.600456 14693 messenger.cc:345] service WrongServiceName not registered on TestServer
[       OK ] Parameters/TestRpc.TestWrongService/SSL_TCP (81 ms)
[ RUN      ] Parameters/TestRpc.TestConnectionKeepalive/SSL_TCP
I20260925 10:08:30.639194 14718 acceptor_pool.cc:254] collecting diagnostics on the listening RPC socket 0.0.0.0:33185 every 8 connection(s)
I20260925 10:08:30.639904 14719 acceptor_pool.cc:254] collecting diagnostics on the listening RPC socket 0.0.0.0:33185 every 8 connection(s)
I20260925 10:08:30.643115 14597 rpc-test.cc:488] Connecting to 0.0.0.0:33185
[       OK ] Parameters/TestRpc.TestConnectionKeepalive/SSL_TCP (1071 ms)
[ RUN      ] Parameters/TestRpc.TestClientConnectionMetrics/SSL_TCP
I20260925 10:08:31.715703 14743 acceptor_pool.cc:254] collecting diagnostics on the listening RPC socket 0.0.0.0:43715 every 8 connection(s)
I20260925 10:08:31.716516 14744 acceptor_pool.cc:254] collecting diagnostics on the listening RPC socket 0.0.0.0:43715 every 8 connection(s)
I20260925 10:08:31.719661 14597 rpc-test.cc:569] Connecting to 0.0.0.0:43715
[       OK ] Parameters/TestRpc.TestClientConnectionMetrics/SSL_TCP (119526 ms)
[ RUN      ] Parameters/TestRpc.TestCredentialsPolicy/SSL_TCP
I20260925 10:10:31.245513 14778 acceptor_pool.cc:254] collecting diagnostics on the listening RPC socket 0.0.0.0:39085 every 8 connection(s)
I20260925 10:10:31.246377 14779 acceptor_pool.cc:254] collecting diagnostics on the listening RPC socket 0.0.0.0:39085 every 8 connection(s)
I20260925 10:10:31.249751 14597 rpc-test.cc:700] Connecting to 0.0.0.0:39085
[       OK ] Parameters/TestRpc.TestCredentialsPolicy/SSL_TCP (100 ms)
[ RUN      ] Parameters/TestRpc.TestCallLongerThanKeepalive/SSL_TCP
I20260925 10:10:31.330163 14804 acceptor_pool.cc:254] collecting diagnostics on the listening RPC socket 0.0.0.0:39739 every 8 connection(s)
I20260925 10:10:31.330862 14805 acceptor_pool.cc:254] collecting diagnostics on the listening RPC socket 0.0.0.0:39739 every 8 connection(s)
I20260925 10:10:31.357226 14808 rpc-test-base.h:222] got call: sleep_micros: 3000000 deferred: true
I20260925 10:10:34.361769 14808 rpcz_store.cc:275] Call kudu.rpc.GenericCalculatorService.Sleep from 127.0.0.1:35070 (request call id 0) took 3004 ms. Trace:
I20260925 10:10:34.362133 14808 rpcz_store.cc:276] 0925 10:10:31.356940 (+     0us) service_pool.cc:170] Inserting onto call queue
0925 10:10:31.357067 (+   127us) service_pool.cc:227] Handling call
0925 10:10:34.361708 (+3004641us) inbound_call.cc:173] Queueing success response
Metrics: {}
[       OK ] Parameters/TestRpc.TestCallLongerThanKeepalive/SSL_TCP (3064 ms)
[ RUN      ] Parameters/TestRpc.TestRpcSidecar/SSL_TCP
I20260925 10:10:34.394955 14829 acceptor_pool.cc:254] collecting diagnostics on the listening RPC socket 0.0.0.0:40413 every 8 connection(s)
I20260925 10:10:34.395695 14830 acceptor_pool.cc:254] collecting diagnostics on the listening RPC socket 0.0.0.0:40413 every 8 connection(s)
[       OK ] Parameters/TestRpc.TestRpcSidecar/SSL_TCP (535 ms)
[ RUN      ] Parameters/TestRpc.TestRpcSidecarLimits/SSL_TCP
I20260925 10:10:54.808063 14856 acceptor_pool.cc:254] collecting diagnostics on the listening RPC socket 0.0.0.0:42897 every 8 connection(s)
I20260925 10:10:54.808872 14857 acceptor_pool.cc:254] collecting diagnostics on the listening RPC socket 0.0.0.0:42897 every 8 connection(s)
W20260925 10:10:54.822650 14597 serialization.cc:72] Serialized kudu.rpc_test.PushStringsRequestPB (2147483654 bytes) is larger than the maximum configured RPC message size (52428800 bytes). Sending anyway, but peer may reject the data.
W20260925 10:10:54.833720 14855 connection.cc:535] server connection from 127.0.0.1:38530 recv error: Network error: RPC frame had a length of 2147483714, but we only support messages up to 52428800 bytes long.
W20260925 10:10:54.834080 14855 connection.cc:158] shutting down server connection from 127.0.0.1:38530 with pending inbound data: 4/2147483714 bytes received; last active 0 ns ago: status Network error: RPC frame had a length of 2147483714, but we only support messages up to 52428800 bytes long.
W20260925 10:10:54.834982 14869 connection.cc:698] client connection to 0.0.0.0:42897 send error: Network error: failed to write to TLS socket: Connection reset by peer
W20260925 10:10:54.835682 14869 connection.cc:196] Error closing socket: Network error: TlsSocket::Close: Success
[       OK ] Parameters/TestRpc.TestRpcSidecarLimits/SSL_TCP (20644 ms)
[ RUN      ] Parameters/TestRpc.TestCallTimeoutDoesntAffectNegotiation/SSL_TCP
I20260925 10:10:55.583213 14881 acceptor_pool.cc:254] collecting diagnostics on the listening RPC socket 0.0.0.0:39573 every 8 connection(s)
I20260925 10:10:55.583962 14882 acceptor_pool.cc:254] collecting diagnostics on the listening RPC socket 0.0.0.0:39573 every 8 connection(s)
W20260925 10:10:55.600999 14877 negotiation.cc:266] Injecting 500ms delay in negotiation
I20260925 10:10:55.650640 14597 rpc-test-base.h:595] status: Timed out: connection negotiation to 0.0.0.0:39573 for RPC Sleep timed out after 0.050s (ON_OUTBOUND_QUEUE), seconds elapsed: 0.0506417
[       OK ] Parameters/TestRpc.TestCallTimeoutDoesntAffectNegotiation/SSL_TCP (565 ms)
[ RUN      ] Parameters/TestRpc.TestRpcHandlerLatencyMetric/SSL_TCP
I20260925 10:10:56.139196 14907 acceptor_pool.cc:254] collecting diagnostics on the listening RPC socket 0.0.0.0:37759 every 8 connection(s)
I20260925 10:10:56.139897 14908 acceptor_pool.cc:254] collecting diagnostics on the listening RPC socket 0.0.0.0:37759 every 8 connection(s)
I20260925 10:10:56.226603 14597 rpc-test.cc:1236] Sleep() min lat: 21976
I20260925 10:10:56.226810 14597 rpc-test.cc:1237] Sleep() mean lat: 21976
I20260925 10:10:56.226940 14597 rpc-test.cc:1238] Sleep() max lat: 21976
I20260925 10:10:56.227056 14597 rpc-test.cc:1239] Sleep() #calls: 1
[       OK ] Parameters/TestRpc.TestRpcHandlerLatencyMetric/SSL_TCP (117 ms)
[ RUN      ] Parameters/TestRpc.TimedOutOnResponseMetricServiceQueue/SSL_TCP
I20260925 10:10:56.260983 14933 acceptor_pool.cc:254] collecting diagnostics on the listening RPC socket 0.0.0.0:46579 every 8 connection(s)
I20260925 10:10:56.261690 14934 acceptor_pool.cc:254] collecting diagnostics on the listening RPC socket 0.0.0.0:46579 every 8 connection(s)
W20260925 10:10:56.344158 14935 rpcz_store.cc:267] Call kudu.rpc_test.CalculatorService.Sleep from 127.0.0.1:47404 (request call id 2) took 20 ms (client timeout 20 ms). Trace:
W20260925 10:10:56.344547 14935 rpcz_store.cc:269] 0925 10:10:56.323703 (+     0us) service_pool.cc:170] Inserting onto call queue
0925 10:10:56.344023 (+ 20320us) service_pool.cc:214] Skipping call since client already timed out
0925 10:10:56.344111 (+    88us) inbound_call.cc:173] Queueing failure response
Metrics: {}
[       OK ] Parameters/TestRpc.TimedOutOnResponseMetricServiceQueue/SSL_TCP (115 ms)
[ RUN      ] Parameters/TestRpc.RpcPendingConnectionsMetric/SSL_TCP
I20260925 10:10:56.362810 14956 acceptor_pool.cc:254] collecting diagnostics on the listening RPC socket 0.0.0.0:40321 every 8 connection(s)
I20260925 10:10:56.363641 14957 acceptor_pool.cc:254] collecting diagnostics on the listening RPC socket 0.0.0.0:40321 every 8 connection(s)
W20260925 10:10:56.368927 14952 negotiation.cc:337] Failed RPC negotiation. Trace:
0925 10:10:56.367730 (+     0us) reactor.cc:625] Submitting negotiation task for server connection from 127.0.0.1:55916 (local address 127.0.0.1:40321)
0925 10:10:56.368126 (+   396us) server_negotiation.cc:206] Beginning negotiation
0925 10:10:56.368143 (+    17us) server_negotiation.cc:399] Waiting for connection header
0925 10:10:56.368384 (+   241us) negotiation.cc:327] Negotiation complete: Network error: Server connection negotiation failed: server connection from 127.0.0.1:55916: BlockingRecv error: recv got EOF from 127.0.0.1:55916 (error 108)
Metrics: {"server-negotiator.queue_time_us":107}
[       OK ] Parameters/TestRpc.RpcPendingConnectionsMetric/SSL_TCP (30 ms)
[ RUN      ] Parameters/TestRpc.TestRpcContextClientDeadline/SSL_TCP
I20260925 10:10:56.439344 14972 acceptor_pool.cc:254] collecting diagnostics on the listening RPC socket 0.0.0.0:45189 every 8 connection(s)
I20260925 10:10:56.440178 14973 acceptor_pool.cc:254] collecting diagnostics on the listening RPC socket 0.0.0.0:45189 every 8 connection(s)
[       OK ] Parameters/TestRpc.TestRpcContextClientDeadline/SSL_TCP (123 ms)
[ RUN      ] Parameters/TestRpc.TestApplicationFeatureFlagUnsupportedServer/SSL_TCP
I20260925 10:10:56.532148 14997 acceptor_pool.cc:254] collecting diagnostics on the listening RPC socket 0.0.0.0:40995 every 8 connection(s)
I20260925 10:10:56.532862 14998 acceptor_pool.cc:254] collecting diagnostics on the listening RPC socket 0.0.0.0:40995 every 8 connection(s)
[       OK ] Parameters/TestRpc.TestApplicationFeatureFlagUnsupportedServer/SSL_TCP (79 ms)
[ RUN      ] Parameters/TestRpc.TestCancellationAsync/SSL_TCP
I20260925 10:10:56.602100 15023 acceptor_pool.cc:254] collecting diagnostics on the listening RPC socket 0.0.0.0:41147 every 8 connection(s)
I20260925 10:10:56.602911 15024 acceptor_pool.cc:254] collecting diagnostics on the listening RPC socket 0.0.0.0:41147 every 8 connection(s)
I20260925 10:10:56.606199 14597 rpc-test.cc:1716] Connecting to 0.0.0.0:41147
I20260925 10:10:56.644541 14597 test_util.cc:268] Using random seed: -290889304
I20260925 10:10:56.894107 15027 rpc-test-base.h:240] got call: sleep_micros: 500 pattern: 4294967295 num_repetitions: 2097152 sidecar_idx: 0
I20260925 10:10:57.063422 15026 rpc-test-base.h:240] got call: sleep_micros: 500 pattern: 4294967295 num_repetitions: 2097152 sidecar_idx: 0
I20260925 10:10:57.258514 15027 rpc-test-base.h:240] got call: sleep_micros: 500 pattern: 4294967295 num_repetitions: 2097152 sidecar_idx: 0
I20260925 10:10:57.456300 15026 rpc-test-base.h:240] got call: sleep_micros: 500 pattern: 4294967295 num_repetitions: 2097152 sidecar_idx: 0
I20260925 10:10:57.644660 15027 rpc-test-base.h:240] got call: sleep_micros: 500 pattern: 4294967295 num_repetitions: 2097152 sidecar_idx: 0
I20260925 10:10:57.839217 15027 rpc-test-base.h:240] got call: sleep_micros: 500 pattern: 4294967295 num_repetitions: 2097152 sidecar_idx: 0
I20260925 10:10:58.009524 15026 rpc-test-base.h:240] got call: sleep_micros: 500 pattern: 4294967295 num_repetitions: 2097152 sidecar_idx: 0
I20260925 10:10:58.215271 15027 rpc-test-base.h:240] got call: sleep_micros: 500 pattern: 4294967295 num_repetitions: 2097152 sidecar_idx: 0
W20260925 10:10:58.394210 15019 connection.cc:196] Error closing socket: Network error: TlsSocket::Close: Broken pipe
W20260925 10:10:58.404274 15019 connection.cc:441] server connection from 127.0.0.1:48094 torn down before Call kudu.rpc.GenericCalculatorService.SleepWithSidecar from 127.0.0.1:48094 (request call id 8) could send its response
[       OK ] Parameters/TestRpc.TestCancellationAsync/SSL_TCP (1828 ms)
[ RUN      ] Parameters/TestRpc.TestPerformanceBySocketType/SSL_TCP
I20260925 10:10:58.509344 15048 acceptor_pool.cc:254] collecting diagnostics on the listening RPC socket 0.0.0.0:35097 every 8 connection(s)
I20260925 10:10:58.510170 15049 acceptor_pool.cc:254] collecting diagnostics on the listening RPC socket 0.0.0.0:35097 every 8 connection(s)
I20260925 10:10:58.514791 14597 rpc-test.cc:1846] Connecting to 0.0.0.0:35097
I20260925 10:11:18.165346 14597 rpc-test.cc:1859] Sending 1024MB via ssl-enabled tcp socket: real 19.618s	user 16.935s	sys 10.850s
I20260925 10:11:37.668856 14597 rpc-test.cc:1859] Sending 1024MB via ssl-enabled tcp socket: real 19.503s	user 16.341s	sys 11.248s
I20260925 10:11:57.182114 14597 rpc-test.cc:1859] Sending 1024MB via ssl-enabled tcp socket: real 19.513s	user 16.491s	sys 11.035s
I20260925 10:12:16.685583 14597 rpc-test.cc:1859] Sending 1024MB via ssl-enabled tcp socket: real 19.503s	user 16.413s	sys 11.183s
I20260925 10:12:36.421805 14597 rpc-test.cc:1859] Sending 1024MB via ssl-enabled tcp socket: real 19.736s	user 16.931s	sys 11.095s
[       OK ] Parameters/TestRpc.TestPerformanceBySocketType/SSL_TCP (98025 ms)
[----------] 20 tests from Parameters/TestRpc (247383 ms total)

[----------] 1 test from Parameters/TestRpcSocketTxRxQueue
[ RUN      ] Parameters/TestRpcSocketTxRxQueue.OverCapacity/0
W20260925 10:12:36.884143 15102 negotiation.cc:337] Failed RPC negotiation. Trace:
0925 10:12:36.478008 (+     0us) reactor.cc:625] Submitting negotiation task for client connection to 0.0.0.0:40445 (local address 127.0.0.1:46242)
0925 10:12:36.478806 (+   798us) negotiation.cc:107] Waiting for socket to connect
0925 10:12:36.478846 (+    40us) client_negotiation.cc:174] Beginning negotiation
0925 10:12:36.479184 (+   338us) client_negotiation.cc:252] Sending NEGOTIATE NegotiatePB request
0925 10:12:36.882952 (+403768us) negotiation.cc:327] Negotiation complete: Network error: Client connection negotiation failed: client connection to 0.0.0.0:40445: BlockingRecv error: recv error from unknown peer: Transport endpoint is not connected (error 107)
Metrics: {"client-negotiator.queue_time_us":199}
W20260925 10:12:36.884174 15084 negotiation.cc:337] Failed RPC negotiation. Trace:
0925 10:12:36.458050 (+     0us) reactor.cc:625] Submitting negotiation task for client connection to 0.0.0.0:40445 (local address 127.0.0.1:46230)
0925 10:12:36.458559 (+   509us) negotiation.cc:107] Waiting for socket to connect
0925 10:12:36.458587 (+    28us) client_negotiation.cc:174] Beginning negotiation
0925 10:12:36.458775 (+   188us) client_negotiation.cc:252] Sending NEGOTIATE NegotiatePB request
0925 10:12:36.882960 (+424185us) negotiation.cc:327] Negotiation complete: Network error: Client connection negotiation failed: client connection to 0.0.0.0:40445: BlockingRecv error: recv error from unknown peer: Transport endpoint is not connected (error 107)
Metrics: {"client-negotiator.queue_time_us":171}
W20260925 10:12:36.884500 15111 negotiation.cc:337] Failed RPC negotiation. Trace:
0925 10:12:36.492549 (+     0us) reactor.cc:625] Submitting negotiation task for client connection to 0.0.0.0:40445 (local address 127.0.0.1:46256)
0925 10:12:36.493182 (+   633us) negotiation.cc:107] Waiting for socket to connect
0925 10:12:36.493224 (+    42us) client_negotiation.cc:174] Beginning negotiation
0925 10:12:36.493517 (+   293us) client_negotiation.cc:252] Sending NEGOTIATE NegotiatePB request
0925 10:12:36.883488 (+389971us) negotiation.cc:327] Negotiation complete: Network error: Client connection negotiation failed: client connection to 0.0.0.0:40445: BlockingRecv error: recv error from unknown peer: Transport endpoint is not connected (error 107)
Metrics: {"client-negotiator.queue_time_us":161}
W20260925 10:12:36.887041 15075 negotiation.cc:337] Failed RPC negotiation. Trace:
0925 10:12:36.450881 (+     0us) reactor.cc:625] Submitting negotiation task for client connection to 0.0.0.0:40445 (local address 127.0.0.1:46226)
0925 10:12:36.451612 (+   731us) negotiation.cc:107] Waiting for socket to connect
0925 10:12:36.451663 (+    51us) client_negotiation.cc:174] Beginning negotiation
0925 10:12:36.452360 (+   697us) client_negotiation.cc:252] Sending NEGOTIATE NegotiatePB request
0925 10:12:36.882960 (+430600us) negotiation.cc:327] Negotiation complete: Network error: Client connection negotiation failed: client connection to 0.0.0.0:40445: BlockingRecv error: recv error from unknown peer: Transport endpoint is not connected (error 107)
Metrics: {"client-negotiator.queue_time_us":134}
W20260925 10:12:36.886998 15093 negotiation.cc:337] Failed RPC negotiation. Trace:
0925 10:12:36.465331 (+     0us) reactor.cc:625] Submitting negotiation task for client connection to 0.0.0.0:40445 (local address 127.0.0.1:46240)
0925 10:12:36.465905 (+   574us) negotiation.cc:107] Waiting for socket to connect
0925 10:12:36.465980 (+    75us) client_negotiation.cc:174] Beginning negotiation
0925 10:12:36.466226 (+   246us) client_negotiation.cc:252] Sending NEGOTIATE NegotiatePB request
0925 10:12:36.882952 (+416726us) negotiation.cc:327] Negotiation complete: Network error: Client connection negotiation failed: client connection to 0.0.0.0:40445: BlockingRecv error: recv error from unknown peer: Transport endpoint is not connected (error 107)
Metrics: {"client-negotiator.queue_time_us":147}
W20260925 10:12:36.887288 15120 negotiation.cc:337] Failed RPC negotiation. Trace:
0925 10:12:36.504745 (+     0us) reactor.cc:625] Submitting negotiation task for client connection to 0.0.0.0:40445 (local address 127.0.0.1:46270)
0925 10:12:36.505381 (+   636us) negotiation.cc:107] Waiting for socket to connect
0925 10:12:36.505432 (+    51us) client_negotiation.cc:174] Beginning negotiation
0925 10:12:36.505718 (+   286us) client_negotiation.cc:252] Sending NEGOTIATE NegotiatePB request
0925 10:12:36.886298 (+380580us) negotiation.cc:327] Negotiation complete: Network error: Client connection negotiation failed: client connection to 0.0.0.0:40445: BlockingRecv error: recv error from unknown peer: Transport endpoint is not connected (error 107)
Metrics: {"client-negotiator.queue_time_us":149}
[       OK ] Parameters/TestRpcSocketTxRxQueue.OverCapacity/0 (1248 ms)
[----------] 1 test from Parameters/TestRpcSocketTxRxQueue (1248 ms total)

[----------] Global test environment tear-down
[==========] 21 tests from 2 test suites ran. (248633 ms total)
[  PASSED  ] 20 tests.
[  FAILED  ] 1 test, listed below:
[  FAILED  ] Parameters/TestRpc.TestCallWithChainCertAndChainCA/SSL_TCP, where GetParam() = (true, false)

 1 FAILED TEST