Parameters/TestRpc.TestCallWithChainCertAndRootCA/SSL_UnixSocket: /data0/somelongdirectorytoavoidrpathissues/src/kudu/src/kudu/rpc/rpc-test.cc:303: Failure
Failed
Bad status: Runtime error: could not verify certificate chain (error with cert: subject=CN = localhost, ST = sadfjas, C = AS, emailAddress = sdflkdsajf, O = lskdfjlsad, OU = sldfkja, issuer=C = AS, ST = ASDfkjdhf, L = lskdjf, O = saldfja, OU = skdjf, CN = localhost, emailAddress = sadjflkadsj): : certificate has expired
Google Test trace:
/data0/somelongdirectorytoavoidrpathissues/src/kudu/src/kudu/rpc/rpc-test.cc:300: Connecting to unix:/tmp/dist-test-taskrw8VEY/test-tmp/rpc-test-f5ba5236aeb64b65ba7fa0a975a8e2e8.sock
I20260928 23:51:38.765413 8901 test_util.cc:175] -----------------------------------------------
I20260928 23:51:38.765575 8901 test_util.cc:176] Had fatal failures, leaving test files at /tmp/dist-test-taskrw8VEY/test-tmp/rpc-test.2.Parameters_TestRpc.TestCallWithChainCertAndRootCA_SSL_UnixSocket.1790639495366162-8901-0
Note: This is test shard 3 of 8.
[==========] Running 21 tests from 2 test suites.
[----------] Global test environment set-up.
[----------] 1 test from TestRpc
[ RUN ] TestRpc.TestNegotiationTimeout
WARNING: Logging before InitGoogleLogging() is written to STDERR
I20260928 23:51:35.550477 8901 rpc-test-base.h:595] status: Timed out: connection negotiation to 0.0.0.0:37793 for RPC Sleep timed out after 0.100s (ON_OUTBOUND_QUEUE), seconds elapsed: 0.101775
W20260928 23:51:38.469880 8911 negotiation.cc:337] Failed RPC negotiation. Trace:
0928 23:51:35.449485 (+ 0us) reactor.cc:625] Submitting negotiation task for client connection to 0.0.0.0:37793 (local address 127.0.0.1:39246)
0928 23:51:35.450242 (+ 757us) negotiation.cc:107] Waiting for socket to connect
0928 23:51:35.450290 (+ 48us) client_negotiation.cc:174] Beginning negotiation
0928 23:51:35.462120 (+ 11830us) client_negotiation.cc:252] Sending NEGOTIATE NegotiatePB request
0928 23:51:38.468820 (+3006700us) negotiation.cc:327] Negotiation complete: Timed out: Client connection negotiation failed: client connection to 0.0.0.0:37793: received 0 of 4 requested bytes
Metrics: {"client-negotiator.queue_time_us":210}
[ OK ] TestRpc.TestNegotiationTimeout (3059 ms)
[----------] 1 test from TestRpc (3059 ms total)
[----------] 20 tests from Parameters/TestRpc
[ RUN ] Parameters/TestRpc.TestAcceptorPoolStartStop/SSL_UnixSocket
I20260928 23:51:38.513301 8927 acceptor_pool.cc:254] collecting diagnostics on the listening RPC socket unix:/tmp/dist-test-taskrw8VEY/test-tmp/rpc-test-a46c8bc17c1b40b58905e6393fa2f6c0.sock every 8 connection(s)
I20260928 23:51:38.514706 8928 acceptor_pool.cc:254] collecting diagnostics on the listening RPC socket unix:/tmp/dist-test-taskrw8VEY/test-tmp/rpc-test-a46c8bc17c1b40b58905e6393fa2f6c0.sock every 8 connection(s)
I20260928 23:51:38.544422 8938 acceptor_pool.cc:254] collecting diagnostics on the listening RPC socket unix:/tmp/dist-test-taskrw8VEY/test-tmp/rpc-test-a46c8bc17c1b40b58905e6393fa2f6c0.sock every 8 connection(s)
I20260928 23:51:38.545655 8939 acceptor_pool.cc:254] collecting diagnostics on the listening RPC socket unix:/tmp/dist-test-taskrw8VEY/test-tmp/rpc-test-a46c8bc17c1b40b58905e6393fa2f6c0.sock every 8 connection(s)
I20260928 23:51:38.576853 8949 acceptor_pool.cc:254] collecting diagnostics on the listening RPC socket unix:/tmp/dist-test-taskrw8VEY/test-tmp/rpc-test-a46c8bc17c1b40b58905e6393fa2f6c0.sock every 8 connection(s)
I20260928 23:51:38.577533 8950 acceptor_pool.cc:254] collecting diagnostics on the listening RPC socket unix:/tmp/dist-test-taskrw8VEY/test-tmp/rpc-test-a46c8bc17c1b40b58905e6393fa2f6c0.sock every 8 connection(s)
I20260928 23:51:38.591734 8960 acceptor_pool.cc:254] collecting diagnostics on the listening RPC socket unix:/tmp/dist-test-taskrw8VEY/test-tmp/rpc-test-a46c8bc17c1b40b58905e6393fa2f6c0.sock every 8 connection(s)
I20260928 23:51:38.592415 8961 acceptor_pool.cc:254] collecting diagnostics on the listening RPC socket unix:/tmp/dist-test-taskrw8VEY/test-tmp/rpc-test-a46c8bc17c1b40b58905e6393fa2f6c0.sock every 8 connection(s)
I20260928 23:51:38.623200 8971 acceptor_pool.cc:254] collecting diagnostics on the listening RPC socket unix:/tmp/dist-test-taskrw8VEY/test-tmp/rpc-test-a46c8bc17c1b40b58905e6393fa2f6c0.sock every 8 connection(s)
I20260928 23:51:38.623873 8972 acceptor_pool.cc:254] collecting diagnostics on the listening RPC socket unix:/tmp/dist-test-taskrw8VEY/test-tmp/rpc-test-a46c8bc17c1b40b58905e6393fa2f6c0.sock every 8 connection(s)
[ OK ] Parameters/TestRpc.TestAcceptorPoolStartStop/SSL_UnixSocket (150 ms)
[ RUN ] Parameters/TestRpc.TestCall/SSL_UnixSocket
I20260928 23:51:38.667016 8984 acceptor_pool.cc:254] collecting diagnostics on the listening RPC socket unix:/tmp/dist-test-taskrw8VEY/test-tmp/rpc-test-d70f92ec220f4ac3912a5dcb8e8b36ef.sock every 8 connection(s)
I20260928 23:51:38.668957 8985 acceptor_pool.cc:254] collecting diagnostics on the listening RPC socket unix:/tmp/dist-test-taskrw8VEY/test-tmp/rpc-test-d70f92ec220f4ac3912a5dcb8e8b36ef.sock every 8 connection(s)
I20260928 23:51:38.673405 8901 rpc-test.cc:234] Connecting to unix:/tmp/dist-test-taskrw8VEY/test-tmp/rpc-test-d70f92ec220f4ac3912a5dcb8e8b36ef.sock
W20260928 23:51:38.717664 8981 connection.cc:196] Error closing socket: Network error: TlsSocket::Close: Broken pipe
[ OK ] Parameters/TestRpc.TestCall/SSL_UnixSocket (94 ms)
[ RUN ] Parameters/TestRpc.TestCallWithChainCertAndRootCA/SSL_UnixSocket
I20260928 23:51:38.746297 9009 acceptor_pool.cc:254] collecting diagnostics on the listening RPC socket unix:/tmp/dist-test-taskrw8VEY/test-tmp/rpc-test-f5ba5236aeb64b65ba7fa0a975a8e2e8.sock every 8 connection(s)
I20260928 23:51:38.746968 9010 acceptor_pool.cc:254] collecting diagnostics on the listening RPC socket unix:/tmp/dist-test-taskrw8VEY/test-tmp/rpc-test-f5ba5236aeb64b65ba7fa0a975a8e2e8.sock every 8 connection(s)
/data0/somelongdirectorytoavoidrpathissues/src/kudu/src/kudu/rpc/rpc-test.cc:303: Failure
Failed
Bad status: Runtime error: could not verify certificate chain (error with cert: subject=CN = localhost, ST = sadfjas, C = AS, emailAddress = sdflkdsajf, O = lskdfjlsad, OU = sldfkja, issuer=C = AS, ST = ASDfkjdhf, L = lskdjf, O = saldfja, OU = skdjf, CN = localhost, emailAddress = sadjflkadsj): : certificate has expired
Google Test trace:
/data0/somelongdirectorytoavoidrpathissues/src/kudu/src/kudu/rpc/rpc-test.cc:300: Connecting to unix:/tmp/dist-test-taskrw8VEY/test-tmp/rpc-test-f5ba5236aeb64b65ba7fa0a975a8e2e8.sock
I20260928 23:51:38.765413 8901 test_util.cc:175] -----------------------------------------------
I20260928 23:51:38.765575 8901 test_util.cc:176] Had fatal failures, leaving test files at /tmp/dist-test-taskrw8VEY/test-tmp/rpc-test.2.Parameters_TestRpc.TestCallWithChainCertAndRootCA_SSL_UnixSocket.1790639495366162-8901-0
[ FAILED ] Parameters/TestRpc.TestCallWithChainCertAndRootCA/SSL_UnixSocket, where GetParam() = (true, true) (43 ms)
[ RUN ] Parameters/TestRpc.TestCallWithBadPasswordProtectedKey/SSL_UnixSocket
[ OK ] Parameters/TestRpc.TestCallWithBadPasswordProtectedKey/SSL_UnixSocket (29 ms)
[ RUN ] Parameters/TestRpc.TestInvalidMethodCall/SSL_UnixSocket
I20260928 23:51:38.821628 9046 acceptor_pool.cc:254] collecting diagnostics on the listening RPC socket unix:/tmp/dist-test-taskrw8VEY/test-tmp/rpc-test-f98903f6f48a4ae58f0c8e5d8c44de70.sock every 8 connection(s)
I20260928 23:51:38.822382 9047 acceptor_pool.cc:254] collecting diagnostics on the listening RPC socket unix:/tmp/dist-test-taskrw8VEY/test-tmp/rpc-test-f98903f6f48a4ae58f0c8e5d8c44de70.sock every 8 connection(s)
I20260928 23:51:38.825552 8901 rpc-test.cc:406] Connecting to unix:/tmp/dist-test-taskrw8VEY/test-tmp/rpc-test-f98903f6f48a4ae58f0c8e5d8c44de70.sock
W20260928 23:51:38.851221 9043 connection.cc:196] Error closing socket: Network error: TlsSocket::Close: Broken pipe
[ OK ] Parameters/TestRpc.TestInvalidMethodCall/SSL_UnixSocket (60 ms)
[ RUN ] Parameters/TestRpc.TestHighFDs/SSL_UnixSocket
I20260928 23:51:39.071379 9071 acceptor_pool.cc:254] collecting diagnostics on the listening RPC socket unix:/tmp/dist-test-taskrw8VEY/test-tmp/rpc-test-d58ac6069d564dfcb5441f57bff80895.sock every 8 connection(s)
I20260928 23:51:39.072021 9072 acceptor_pool.cc:254] collecting diagnostics on the listening RPC socket unix:/tmp/dist-test-taskrw8VEY/test-tmp/rpc-test-d58ac6069d564dfcb5441f57bff80895.sock every 8 connection(s)
W20260928 23:51:39.107069 9068 connection.cc:196] Error closing socket: Network error: TlsSocket::Close: Broken pipe
[ OK ] Parameters/TestRpc.TestHighFDs/SSL_UnixSocket (262 ms)
[ RUN ] Parameters/TestRpc.TestConnectionAlwaysKeepalive/SSL_UnixSocket
I20260928 23:51:39.150889 9094 acceptor_pool.cc:254] collecting diagnostics on the listening RPC socket unix:/tmp/dist-test-taskrw8VEY/test-tmp/rpc-test-2664ef9459f346c9aeaeb1a43ca3b501.sock every 8 connection(s)
I20260928 23:51:39.151559 9095 acceptor_pool.cc:254] collecting diagnostics on the listening RPC socket unix:/tmp/dist-test-taskrw8VEY/test-tmp/rpc-test-2664ef9459f346c9aeaeb1a43ca3b501.sock every 8 connection(s)
I20260928 23:51:39.154455 8901 rpc-test.cc:532] Connecting to unix:/tmp/dist-test-taskrw8VEY/test-tmp/rpc-test-2664ef9459f346c9aeaeb1a43ca3b501.sock
[ OK ] Parameters/TestRpc.TestConnectionAlwaysKeepalive/SSL_UnixSocket (3070 ms)
[ RUN ] Parameters/TestRpc.TestReopenOutboundConnections/SSL_UnixSocket
I20260928 23:51:42.215292 9117 acceptor_pool.cc:254] collecting diagnostics on the listening RPC socket unix:/tmp/dist-test-taskrw8VEY/test-tmp/rpc-test-b7b470360b314da3b127ac19d5b654a9.sock every 8 connection(s)
I20260928 23:51:42.215940 9118 acceptor_pool.cc:254] collecting diagnostics on the listening RPC socket unix:/tmp/dist-test-taskrw8VEY/test-tmp/rpc-test-b7b470360b314da3b127ac19d5b654a9.sock every 8 connection(s)
I20260928 23:51:42.218971 8901 rpc-test.cc:658] Connecting to unix:/tmp/dist-test-taskrw8VEY/test-tmp/rpc-test-b7b470360b314da3b127ac19d5b654a9.sock
W20260928 23:51:42.268118 9116 connection.cc:196] Error closing socket: Network error: TlsSocket::Close: Broken pipe
W20260928 23:51:42.276494 9116 connection.cc:196] Error closing socket: Network error: TlsSocket::Close: Broken pipe
W20260928 23:51:42.284631 9116 connection.cc:196] Error closing socket: Network error: TlsSocket::Close: Broken pipe
W20260928 23:51:42.292955 9116 connection.cc:196] Error closing socket: Network error: TlsSocket::Close: Broken pipe
W20260928 23:51:42.301338 9116 connection.cc:196] Error closing socket: Network error: TlsSocket::Close: Broken pipe
W20260928 23:51:42.309623 9116 connection.cc:196] Error closing socket: Network error: TlsSocket::Close: Broken pipe
W20260928 23:51:42.317982 9116 connection.cc:196] Error closing socket: Network error: TlsSocket::Close: Broken pipe
W20260928 23:51:42.326331 9116 connection.cc:196] Error closing socket: Network error: TlsSocket::Close: Broken pipe
W20260928 23:51:42.334697 9116 connection.cc:196] Error closing socket: Network error: TlsSocket::Close: Broken pipe
W20260928 23:51:42.343362 9116 connection.cc:196] Error closing socket: Network error: TlsSocket::Close: Broken pipe
W20260928 23:51:42.351701 9116 connection.cc:196] Error closing socket: Network error: TlsSocket::Close: Broken pipe
W20260928 23:51:42.359985 9116 connection.cc:196] Error closing socket: Network error: TlsSocket::Close: Broken pipe
W20260928 23:51:42.369190 9116 connection.cc:196] Error closing socket: Network error: TlsSocket::Close: Broken pipe
W20260928 23:51:42.377835 9116 connection.cc:196] Error closing socket: Network error: TlsSocket::Close: Broken pipe
W20260928 23:51:42.377872 9117 acceptor_pool.cc:285] unable to collect diagnostics on RPC socket unix:/tmp/dist-test-taskrw8VEY/test-tmp/rpc-test-b7b470360b314da3b127ac19d5b654a9.sock: Not implemented: netlink diagnostics is currently supported only on IPv4 TCP sockets
W20260928 23:51:42.386588 9116 connection.cc:196] Error closing socket: Network error: TlsSocket::Close: Broken pipe
W20260928 23:51:42.394852 9116 connection.cc:196] Error closing socket: Network error: TlsSocket::Close: Broken pipe
W20260928 23:51:42.403160 9116 connection.cc:196] Error closing socket: Network error: TlsSocket::Close: Broken pipe
W20260928 23:51:42.411619 9116 connection.cc:196] Error closing socket: Network error: TlsSocket::Close: Broken pipe
W20260928 23:51:42.420359 9116 connection.cc:196] Error closing socket: Network error: TlsSocket::Close: Broken pipe
W20260928 23:51:42.429266 9116 connection.cc:196] Error closing socket: Network error: TlsSocket::Close: Broken pipe
W20260928 23:51:42.438558 9116 connection.cc:196] Error closing socket: Network error: TlsSocket::Close: Broken pipe
W20260928 23:51:42.447751 9116 connection.cc:196] Error closing socket: Network error: TlsSocket::Close: Broken pipe
W20260928 23:51:42.457026 9116 connection.cc:196] Error closing socket: Network error: TlsSocket::Close: Broken pipe
W20260928 23:51:42.465991 9116 connection.cc:196] Error closing socket: Network error: TlsSocket::Close: Broken pipe
W20260928 23:51:42.475004 9116 connection.cc:196] Error closing socket: Network error: TlsSocket::Close: Broken pipe
W20260928 23:51:42.483417 9116 connection.cc:196] Error closing socket: Network error: TlsSocket::Close: Broken pipe
W20260928 23:51:42.491613 9116 connection.cc:196] Error closing socket: Network error: TlsSocket::Close: Broken pipe
W20260928 23:51:42.500392 9116 connection.cc:196] Error closing socket: Network error: TlsSocket::Close: Broken pipe
W20260928 23:51:42.508857 9116 connection.cc:196] Error closing socket: Network error: TlsSocket::Close: Broken pipe
W20260928 23:51:42.517632 9116 connection.cc:196] Error closing socket: Network error: TlsSocket::Close: Broken pipe
W20260928 23:51:42.526081 9116 connection.cc:196] Error closing socket: Network error: TlsSocket::Close: Broken pipe
W20260928 23:51:42.535575 9116 connection.cc:196] Error closing socket: Network error: TlsSocket::Close: Broken pipe
[ OK ] Parameters/TestRpc.TestReopenOutboundConnections/SSL_UnixSocket (351 ms)
[ RUN ] Parameters/TestRpc.TestConnectionNetworkPlane/SSL_UnixSocket
I20260928 23:51:42.560817 9140 acceptor_pool.cc:254] collecting diagnostics on the listening RPC socket unix:/tmp/dist-test-taskrw8VEY/test-tmp/rpc-test-21c23c502b024236ac0000c5b21f0ef6.sock every 8 connection(s)
I20260928 23:51:42.561473 9141 acceptor_pool.cc:254] collecting diagnostics on the listening RPC socket unix:/tmp/dist-test-taskrw8VEY/test-tmp/rpc-test-21c23c502b024236ac0000c5b21f0ef6.sock every 8 connection(s)
I20260928 23:51:42.564357 8901 rpc-test.cc:772] Connecting to unix:/tmp/dist-test-taskrw8VEY/test-tmp/rpc-test-21c23c502b024236ac0000c5b21f0ef6.sock
W20260928 23:51:42.598781 9139 connection.cc:196] Error closing socket: Network error: TlsSocket::Close: Broken pipe
W20260928 23:51:42.599586 9139 connection.cc:196] Error closing socket: Network error: TlsSocket::Close: Broken pipe
[ OK ] Parameters/TestRpc.TestConnectionNetworkPlane/SSL_UnixSocket (63 ms)
[ RUN ] Parameters/TestRpc.TestTCPKeepalive/SSL_UnixSocket
I20260928 23:51:42.618539 9165 acceptor_pool.cc:254] collecting diagnostics on the listening RPC socket unix:/tmp/dist-test-taskrw8VEY/test-tmp/rpc-test-48411db9ce5148a9b62e76dbbb8926a4.sock every 8 connection(s)
I20260928 23:51:42.619275 9166 acceptor_pool.cc:254] collecting diagnostics on the listening RPC socket unix:/tmp/dist-test-taskrw8VEY/test-tmp/rpc-test-48411db9ce5148a9b62e76dbbb8926a4.sock every 8 connection(s)
I20260928 23:51:42.642808 9169 rpc-test-base.h:222] got call: sleep_micros: 8000000 deferred: true
I20260928 23:51:50.646637 9169 rpcz_store.cc:275] Call kudu.rpc.GenericCalculatorService.Sleep from unix:<unnamed> (request call id 0) took 8003 ms. Trace:
I20260928 23:51:50.647061 9169 rpcz_store.cc:276] 0928 23:51:42.642669 (+ 0us) service_pool.cc:170] Inserting onto call queue
0928 23:51:42.642758 (+ 89us) service_pool.cc:227] Handling call
0928 23:51:50.646459 (+8003701us) inbound_call.cc:173] Queueing success response
Metrics: {}
W20260928 23:51:50.652877 9162 connection.cc:196] Error closing socket: Network error: TlsSocket::Close: Broken pipe
[ OK ] Parameters/TestRpc.TestTCPKeepalive/SSL_UnixSocket (8056 ms)
[ RUN ] Parameters/TestRpc.TestMaxSmallSidecars/SSL_UnixSocket
I20260928 23:51:50.692565 9191 acceptor_pool.cc:254] collecting diagnostics on the listening RPC socket unix:/tmp/dist-test-taskrw8VEY/test-tmp/rpc-test-ca05e4da5d774a638fb7a5fe8be10ae8.sock every 8 connection(s)
I20260928 23:51:50.693374 9192 acceptor_pool.cc:254] collecting diagnostics on the listening RPC socket unix:/tmp/dist-test-taskrw8VEY/test-tmp/rpc-test-ca05e4da5d774a638fb7a5fe8be10ae8.sock every 8 connection(s)
W20260928 23:51:50.853288 9188 connection.cc:196] Error closing socket: Network error: TlsSocket::Close: Broken pipe
[ OK ] Parameters/TestRpc.TestMaxSmallSidecars/SSL_UnixSocket (197 ms)
[ RUN ] Parameters/TestRpc.TestCallTimeout/SSL_UnixSocket
I20260928 23:51:50.891399 9216 acceptor_pool.cc:254] collecting diagnostics on the listening RPC socket unix:/tmp/dist-test-taskrw8VEY/test-tmp/rpc-test-576bb87e31224d47847bf8aaea91bde5.sock every 8 connection(s)
I20260928 23:51:50.892066 9217 acceptor_pool.cc:254] collecting diagnostics on the listening RPC socket unix:/tmp/dist-test-taskrw8VEY/test-tmp/rpc-test-576bb87e31224d47847bf8aaea91bde5.sock every 8 connection(s)
I20260928 23:51:50.913522 8901 rpc-test-base.h:595] status: Timed out: connection negotiation to unix:/tmp/dist-test-taskrw8VEY/test-tmp/rpc-test-576bb87e31224d47847bf8aaea91bde5.sock for RPC Sleep timed out after 0.000s (ON_OUTBOUND_QUEUE), seconds elapsed: 0.00225633
I20260928 23:51:50.920518 9220 rpc-test-base.h:222] got call: sleep_micros: 700000
I20260928 23:51:51.115201 8901 rpc-test-base.h:595] status: Timed out: Sleep RPC to unix:/tmp/dist-test-taskrw8VEY/test-tmp/rpc-test-576bb87e31224d47847bf8aaea91bde5.sock timed out after 0.200s (SENT), seconds elapsed: 0.20135
I20260928 23:51:51.116444 9219 rpc-test-base.h:222] got call: sleep_micros: 2000000
W20260928 23:51:51.621116 9220 rpcz_store.cc:267] Call kudu.rpc.GenericCalculatorService.Sleep from unix:<unnamed> (request call id 1) took 700 ms (client timeout 200 ms). Trace:
W20260928 23:51:51.621433 9220 rpcz_store.cc:269] 0928 23:51:50.920376 (+ 0us) service_pool.cc:170] Inserting onto call queue
0928 23:51:50.920472 (+ 96us) service_pool.cc:227] Handling call
0928 23:51:51.621062 (+700590us) inbound_call.cc:173] Queueing success response
Metrics: {}
I20260928 23:51:52.617355 8901 rpc-test-base.h:595] status: Timed out: Sleep RPC to unix:/tmp/dist-test-taskrw8VEY/test-tmp/rpc-test-576bb87e31224d47847bf8aaea91bde5.sock timed out after 1.500s (SENT), seconds elapsed: 1.50184
W20260928 23:51:53.116927 9219 rpcz_store.cc:267] Call kudu.rpc.GenericCalculatorService.Sleep from unix:<unnamed> (request call id 2) took 2000 ms (client timeout 1500 ms). Trace:
W20260928 23:51:53.117287 9219 rpcz_store.cc:269] 0928 23:51:51.116262 (+ 0us) service_pool.cc:170] Inserting onto call queue
0928 23:51:51.116382 (+ 120us) service_pool.cc:227] Handling call
0928 23:51:53.116866 (+2000484us) inbound_call.cc:173] Queueing success response
Metrics: {}
W20260928 23:51:53.117914 9213 connection.cc:441] server connection from unix:<unnamed> torn down before Call kudu.rpc.GenericCalculatorService.Sleep from unix:<unnamed> (request call id 2) could send its response
[ OK ] Parameters/TestRpc.TestCallTimeout/SSL_UnixSocket (2266 ms)
[ RUN ] Parameters/TestRpc.TestServerShutsDown/SSL_UnixSocket
I20260928 23:51:53.126356 8901 rpc-test.cc:1125] Connecting to 0.0.0.0:43433
W20260928 23:51:53.137591 9233 negotiation.cc:337] Failed RPC negotiation. Trace:
0928 23:51:53.136052 (+ 0us) reactor.cc:625] Submitting negotiation task for client connection to 0.0.0.0:43433 (local address 127.0.0.1:37922)
0928 23:51:53.136567 (+ 515us) negotiation.cc:107] Waiting for socket to connect
0928 23:51:53.136606 (+ 39us) client_negotiation.cc:174] Beginning negotiation
0928 23:51:53.136869 (+ 263us) client_negotiation.cc:252] Sending NEGOTIATE NegotiatePB request
0928 23:51:53.137089 (+ 220us) negotiation.cc:327] Negotiation complete: Network error: Client connection negotiation failed: client connection to 0.0.0.0:43433: BlockingWrite error: write error: Broken pipe (error 32)
Metrics: {"client-negotiator.queue_time_us":96}
[ OK ] Parameters/TestRpc.TestServerShutsDown/SSL_UnixSocket (15 ms)
[ RUN ] Parameters/TestRpc.TimedOutOnResponseMetric/SSL_UnixSocket
I20260928 23:51:53.155488 9250 acceptor_pool.cc:254] collecting diagnostics on the listening RPC socket unix:/tmp/dist-test-taskrw8VEY/test-tmp/rpc-test-ed52bae3342c4b7eb51290bf5fab275c.sock every 8 connection(s)
I20260928 23:51:53.156136 9251 acceptor_pool.cc:254] collecting diagnostics on the listening RPC socket unix:/tmp/dist-test-taskrw8VEY/test-tmp/rpc-test-ed52bae3342c4b7eb51290bf5fab275c.sock every 8 connection(s)
W20260928 23:51:53.406014 9254 rpcz_store.cc:267] Call kudu.rpc_test.CalculatorService.Sleep from unix:<unnamed> (request call id 3) took 50 ms (client timeout 25 ms). Trace:
W20260928 23:51:53.406354 9254 rpcz_store.cc:269] 0928 23:51:53.355449 (+ 0us) service_pool.cc:170] Inserting onto call queue
0928 23:51:53.355553 (+ 104us) service_pool.cc:227] Handling call
0928 23:51:53.405942 (+ 50389us) inbound_call.cc:173] Queueing success response
Related trace 'test_child':
Metrics: {"test_sleep_us":50000,"child_traces":[["test_child",{"related_trace_metric":1}]]}
W20260928 23:51:53.465184 9254 rpcz_store.cc:267] Call kudu.rpc_test.CalculatorService.Sleep from unix:<unnamed> (request call id 4) took 50 ms (client timeout 50 ms). Trace:
W20260928 23:51:53.465477 9254 rpcz_store.cc:269] 0928 23:51:53.414660 (+ 0us) service_pool.cc:170] Inserting onto call queue
0928 23:51:53.414774 (+ 114us) service_pool.cc:227] Handling call
0928 23:51:53.465117 (+ 50343us) inbound_call.cc:173] Queueing success response
Related trace 'test_child':
Metrics: {"test_sleep_us":50000,"child_traces":[["test_child",{"related_trace_metric":1}]]}
W20260928 23:51:53.467345 9247 connection.cc:196] Error closing socket: Network error: TlsSocket::Close: Broken pipe
W20260928 23:51:53.467685 9247 connection.cc:441] server connection from unix:<unnamed> torn down before Call kudu.rpc_test.CalculatorService.Sleep from unix:<unnamed> (request call id 4) could send its response
[ OK ] Parameters/TestRpc.TimedOutOnResponseMetric/SSL_UnixSocket (332 ms)
[ RUN ] Parameters/TestRpc.AcceptorDispatchingTimesMetric/SSL_UnixSocket
I20260928 23:51:53.483254 9275 acceptor_pool.cc:254] collecting diagnostics on the listening RPC socket 0.0.0.0:39833 every 8 connection(s)
I20260928 23:51:53.483807 9276 acceptor_pool.cc:254] collecting diagnostics on the listening RPC socket 0.0.0.0:39833 every 8 connection(s)
W20260928 23:51:53.489319 9271 negotiation.cc:337] Failed RPC negotiation. Trace:
0928 23:51:53.487132 (+ 0us) reactor.cc:625] Submitting negotiation task for server connection from 127.0.0.1:51920 (local address 127.0.0.1:39833)
0928 23:51:53.487688 (+ 556us) server_negotiation.cc:206] Beginning negotiation
0928 23:51:53.487720 (+ 32us) server_negotiation.cc:399] Waiting for connection header
0928 23:51:53.488128 (+ 408us) negotiation.cc:327] Negotiation complete: Network error: Server connection negotiation failed: server connection from 127.0.0.1:51920: BlockingRecv error: recv got EOF from 127.0.0.1:51920 (error 108)
Metrics: {"server-negotiator.queue_time_us":129}
[ OK ] Parameters/TestRpc.AcceptorDispatchingTimesMetric/SSL_UnixSocket (19 ms)
[ RUN ] Parameters/TestRpc.TestRpcCallbackDestroysMessenger/SSL_UnixSocket
[ OK ] Parameters/TestRpc.TestRpcCallbackDestroysMessenger/SSL_UnixSocket (18 ms)
[ RUN ] Parameters/TestRpc.TestApplicationFeatureFlag/SSL_UnixSocket
I20260928 23:51:53.537230 9300 acceptor_pool.cc:254] collecting diagnostics on the listening RPC socket unix:/tmp/dist-test-taskrw8VEY/test-tmp/rpc-test-87ccf64edd174f48a313ecf9e4996754.sock every 8 connection(s)
I20260928 23:51:53.537883 9301 acceptor_pool.cc:254] collecting diagnostics on the listening RPC socket unix:/tmp/dist-test-taskrw8VEY/test-tmp/rpc-test-87ccf64edd174f48a313ecf9e4996754.sock every 8 connection(s)
W20260928 23:51:53.566089 9297 messenger.cc:357] Unable to handle RPC call: Not implemented: call requires unsupported application feature flags: 99
W20260928 23:51:53.568867 9297 connection.cc:196] Error closing socket: Network error: TlsSocket::Close: Broken pipe
[ OK ] Parameters/TestRpc.TestApplicationFeatureFlag/SSL_UnixSocket (62 ms)
[ RUN ] Parameters/TestRpc.TestCancellation/SSL_UnixSocket
I20260928 23:51:53.600364 9325 acceptor_pool.cc:254] collecting diagnostics on the listening RPC socket unix:/tmp/dist-test-taskrw8VEY/test-tmp/rpc-test-993d320328f14c14a3d7422e3fde99f2.sock every 8 connection(s)
I20260928 23:51:53.601114 9326 acceptor_pool.cc:254] collecting diagnostics on the listening RPC socket unix:/tmp/dist-test-taskrw8VEY/test-tmp/rpc-test-993d320328f14c14a3d7422e3fde99f2.sock every 8 connection(s)
I20260928 23:51:53.604094 8901 rpc-test.cc:1648] Connecting to unix:/tmp/dist-test-taskrw8VEY/test-tmp/rpc-test-993d320328f14c14a3d7422e3fde99f2.sock
I20260928 23:51:53.708456 8901 rpc-test-base.h:595] status: Aborted: Sleep RPC to unix:/tmp/dist-test-taskrw8VEY/test-tmp/rpc-test-993d320328f14c14a3d7422e3fde99f2.sock is cancelled in state READY, seconds elapsed: 0.000339985
I20260928 23:51:53.868782 8901 rpc-test-base.h:595] status: Aborted: Sleep RPC to unix:/tmp/dist-test-taskrw8VEY/test-tmp/rpc-test-993d320328f14c14a3d7422e3fde99f2.sock is cancelled in state SENT, seconds elapsed: 0.000662688
I20260928 23:51:53.869117 9328 rpc-test-base.h:222] got call: sleep_micros: 510000
I20260928 23:51:54.029938 8901 rpc-test-base.h:595] status: Aborted: Sleep RPC to unix:/tmp/dist-test-taskrw8VEY/test-tmp/rpc-test-993d320328f14c14a3d7422e3fde99f2.sock is cancelled in state SENT, seconds elapsed: 0.000613872
I20260928 23:51:54.030292 9327 rpc-test-base.h:222] got call: sleep_micros: 510000
I20260928 23:51:54.192420 8901 rpc-test-base.h:595] status: Aborted: Sleep RPC to unix:/tmp/dist-test-taskrw8VEY/test-tmp/rpc-test-993d320328f14c14a3d7422e3fde99f2.sock is cancelled in state SENT, seconds elapsed: 0.000798378
W20260928 23:51:54.203038 9329 rpcz_store.cc:267] Call kudu.rpc.GenericCalculatorService.Sleep from unix:<unnamed> (request call id 11) took 10 ms (client timeout 10 ms). Trace:
W20260928 23:51:54.203326 9329 rpcz_store.cc:269] 0928 23:51:54.192407 (+ 0us) service_pool.cc:170] Inserting onto call queue
0928 23:51:54.202799 (+ 10392us) service_pool.cc:214] Skipping call since client already timed out
0928 23:51:54.202878 (+ 79us) inbound_call.cc:173] Queueing failure response
Metrics: {}
I20260928 23:51:54.203789 9329 rpc-test-base.h:222] got call: sleep_micros: 1500000
W20260928 23:51:54.379551 9328 rpcz_store.cc:267] Call kudu.rpc.GenericCalculatorService.Sleep from unix:<unnamed> (request call id 3) took 510 ms (client timeout 10 ms). Trace:
W20260928 23:51:54.379858 9328 rpcz_store.cc:269] 0928 23:51:53.868961 (+ 0us) service_pool.cc:170] Inserting onto call queue
0928 23:51:53.869069 (+ 108us) service_pool.cc:227] Handling call
0928 23:51:54.379500 (+510431us) inbound_call.cc:173] Queueing success response
Metrics: {}
W20260928 23:51:54.540803 9327 rpcz_store.cc:267] Call kudu.rpc.GenericCalculatorService.Sleep from unix:<unnamed> (request call id 7) took 510 ms (client timeout 10 ms). Trace:
W20260928 23:51:54.541083 9327 rpcz_store.cc:269] 0928 23:51:54.030105 (+ 0us) service_pool.cc:170] Inserting onto call queue
0928 23:51:54.030244 (+ 139us) service_pool.cc:227] Handling call
0928 23:51:54.540748 (+510504us) inbound_call.cc:173] Queueing success response
Metrics: {}
I20260928 23:51:55.194659 8901 rpc-test-base.h:595] status: Timed out: Sleep RPC to unix:/tmp/dist-test-taskrw8VEY/test-tmp/rpc-test-993d320328f14c14a3d7422e3fde99f2.sock timed out after 1.000s (SENT), seconds elapsed: 1.00192
I20260928 23:51:55.195830 9327 rpc-test-base.h:222] got call: sleep_micros: 1500000
W20260928 23:51:55.704540 9329 rpcz_store.cc:267] Call kudu.rpc.GenericCalculatorService.Sleep from unix:<unnamed> (request call id 12) took 1511 ms (client timeout 1000 ms). Trace:
W20260928 23:51:55.704944 9329 rpcz_store.cc:269] 0928 23:51:54.193391 (+ 0us) service_pool.cc:170] Inserting onto call queue
0928 23:51:54.203762 (+ 10371us) service_pool.cc:227] Handling call
0928 23:51:55.704367 (+1500605us) inbound_call.cc:173] Queueing success response
Metrics: {}
I20260928 23:51:56.196560 8901 rpc-test-base.h:595] status: Timed out: Sleep RPC to unix:/tmp/dist-test-taskrw8VEY/test-tmp/rpc-test-993d320328f14c14a3d7422e3fde99f2.sock timed out after 1.000s (SENT), seconds elapsed: 1.00148
W20260928 23:51:56.198158 9322 messenger.cc:357] Unable to handle RPC call: Not implemented: call requires unsupported application feature flags: 99, 1
W20260928 23:51:56.199636 9322 messenger.cc:357] Unable to handle RPC call: Not implemented: call requires unsupported application feature flags: 99, 1
W20260928 23:51:56.406476 9322 connection.cc:196] Error closing socket: Network error: TlsSocket::Close: Broken pipe
W20260928 23:51:56.696429 9327 rpcz_store.cc:267] Call kudu.rpc.GenericCalculatorService.Sleep from unix:<unnamed> (request call id 13) took 1500 ms (client timeout 1000 ms). Trace:
W20260928 23:51:56.696760 9327 rpcz_store.cc:269] 0928 23:51:55.195682 (+ 0us) service_pool.cc:170] Inserting onto call queue
0928 23:51:55.195786 (+ 104us) service_pool.cc:227] Handling call
0928 23:51:56.696294 (+1500508us) inbound_call.cc:173] Queueing success response
Metrics: {}
W20260928 23:51:56.697337 9322 connection.cc:441] server connection from unix:<unnamed> torn down before Call kudu.rpc.GenericCalculatorService.Sleep from unix:<unnamed> (request call id 13) could send its response
[ OK ] Parameters/TestRpc.TestCancellation/SSL_UnixSocket (3130 ms)
[ RUN ] Parameters/TestRpc.TestCancellationMultiThreads/SSL_UnixSocket
I20260928 23:51:56.729449 9351 acceptor_pool.cc:254] collecting diagnostics on the listening RPC socket unix:/tmp/dist-test-taskrw8VEY/test-tmp/rpc-test-cd7d101540394dca9b08fa44fd3a813f.sock every 8 connection(s)
I20260928 23:51:56.730252 9352 acceptor_pool.cc:254] collecting diagnostics on the listening RPC socket unix:/tmp/dist-test-taskrw8VEY/test-tmp/rpc-test-cd7d101540394dca9b08fa44fd3a813f.sock every 8 connection(s)
I20260928 23:51:56.733132 8901 rpc-test.cc:1808] Connecting to unix:/tmp/dist-test-taskrw8VEY/test-tmp/rpc-test-cd7d101540394dca9b08fa44fd3a813f.sock
I20260928 23:51:56.874318 9365 test_util.cc:268] Using random seed: -1068304920
I20260928 23:51:56.875346 9366 test_util.cc:268] Using random seed: -1068303816
I20260928 23:51:56.876853 9367 test_util.cc:268] Using random seed: -1068302383
I20260928 23:51:56.878153 9368 test_util.cc:268] Using random seed: -1068301028
I20260928 23:51:56.879704 9369 test_util.cc:268] Using random seed: -1068299598
I20260928 23:51:56.881032 9370 test_util.cc:268] Using random seed: -1068298260
I20260928 23:51:56.882660 9371 test_util.cc:268] Using random seed: -1068296662
I20260928 23:51:56.883921 9372 test_util.cc:268] Using random seed: -1068295336
I20260928 23:51:56.885525 9373 test_util.cc:268] Using random seed: -1068293769
I20260928 23:51:56.886758 9374 test_util.cc:268] Using random seed: -1068292521
I20260928 23:51:56.888060 9375 test_util.cc:268] Using random seed: -1068291259
I20260928 23:51:56.889405 9376 test_util.cc:268] Using random seed: -1068289870
I20260928 23:51:56.890633 9377 test_util.cc:268] Using random seed: -1068288655
I20260928 23:51:56.892071 9378 test_util.cc:268] Using random seed: -1068287227
I20260928 23:51:56.893617 9379 test_util.cc:268] Using random seed: -1068285681
I20260928 23:51:56.894984 9380 test_util.cc:268] Using random seed: -1068284279
I20260928 23:51:56.896536 9381 test_util.cc:268] Using random seed: -1068282725
I20260928 23:51:56.898123 9382 test_util.cc:268] Using random seed: -1068281163
I20260928 23:51:56.899845 9383 test_util.cc:268] Using random seed: -1068279571
I20260928 23:51:56.901341 9384 test_util.cc:268] Using random seed: -1068277948
I20260928 23:51:56.903062 9385 test_util.cc:268] Using random seed: -1068276449
I20260928 23:51:56.904394 9386 test_util.cc:268] Using random seed: -1068274889
I20260928 23:51:56.906467 9387 test_util.cc:268] Using random seed: -1068272867
I20260928 23:51:56.908043 9388 test_util.cc:268] Using random seed: -1068271307
I20260928 23:51:56.909188 9389 test_util.cc:268] Using random seed: -1068270063
I20260928 23:51:56.911286 9390 test_util.cc:268] Using random seed: -1068268124
I20260928 23:51:56.912797 9391 test_util.cc:268] Using random seed: -1068266454
I20260928 23:51:56.916853 9392 test_util.cc:268] Using random seed: -1068262427
I20260928 23:51:56.918234 9393 test_util.cc:268] Using random seed: -1068261018
I20260928 23:51:56.919484 9394 test_util.cc:268] Using random seed: -1068259774
W20260928 23:52:15.946676 9348 connection.cc:196] Error closing socket: Network error: TlsSocket::Close: Broken pipe
[ OK ] Parameters/TestRpc.TestCancellationMultiThreads/SSL_UnixSocket (19257 ms)
[ RUN ] Parameters/TestRpc.TestCallId/SSL_UnixSocket
I20260928 23:52:15.990999 9408 acceptor_pool.cc:254] collecting diagnostics on the listening RPC socket unix:/tmp/dist-test-taskrw8VEY/test-tmp/rpc-test-d7b4ac086362408c93526c84955c0311.sock every 8 connection(s)
I20260928 23:52:15.991829 9409 acceptor_pool.cc:254] collecting diagnostics on the listening RPC socket unix:/tmp/dist-test-taskrw8VEY/test-tmp/rpc-test-d7b4ac086362408c93526c84955c0311.sock every 8 connection(s)
W20260928 23:52:16.046701 9405 connection.cc:196] Error closing socket: Network error: TlsSocket::Close: Broken pipe
[ OK ] Parameters/TestRpc.TestCallId/SSL_UnixSocket (89 ms)
[----------] 20 tests from Parameters/TestRpc (37575 ms total)
[----------] Global test environment tear-down
[==========] 21 tests from 2 test suites ran. (40636 ms total)
[ PASSED ] 20 tests.
[ FAILED ] 1 test, listed below:
[ FAILED ] Parameters/TestRpc.TestCallWithChainCertAndRootCA/SSL_UnixSocket, where GetParam() = (true, true)
1 FAILED TEST
I20260928 23:52:16.069075 8901 logging.cc:424] LogThrottler /data0/somelongdirectorytoavoidrpathissues/src/kudu/src/kudu/rpc/acceptor_pool.cc:285: suppressed but not reported on 3 messages since previous log ~33 seconds ago