Diagnosed failure

Parameters/TestRpc.TestCallWithChainCertAndChainCA/SSL_UnixSocket: /data0/somelongdirectorytoavoidrpathissues/src/kudu/src/kudu/rpc/rpc-test.cc:270: Failure
Failed
Bad status: Runtime error: could not verify certificate chain (error with cert: subject=CN = localhost, ST = sadfjas, C = AS, emailAddress = sdflkdsajf, O = lskdfjlsad, OU = sldfkja, issuer=C = AS, ST = ASDfkjdhf, L = lskdjf, O = saldfja, OU = skdjf, CN = localhost, emailAddress = sadjflkadsj): : certificate has expired
Google Test trace:
/data0/somelongdirectorytoavoidrpathissues/src/kudu/src/kudu/rpc/rpc-test.cc:267: Connecting to unix:/tmp/dist-test-taskXETQdB/test-tmp/rpc-test-a63c385d152a46ea8953beee7d69b981.sock
I20260928 14:54:57.649132 27737 test_util.cc:175] -----------------------------------------------
I20260928 14:54:57.649175 27737 test_util.cc:176] Had fatal failures, leaving test files at /tmp/dist-test-taskXETQdB/test-tmp/rpc-test.6.Parameters_TestRpc.TestCallWithChainCertAndChainCA_SSL_UnixSocket.1790607297554594-27737-0

Full log

Note: This is test shard 7 of 8.
[==========] Running 21 tests from 2 test suites.
[----------] Global test environment set-up.
[----------] 20 tests from Parameters/TestRpc
[ RUN      ] Parameters/TestRpc.TestMessengerCreateDestroy/SSL_UnixSocket
WARNING: Logging before InitGoogleLogging() is written to STDERR
I20260928 14:54:57.583606 27737 rpc-test.cc:169] started messenger TestCreateDestroy
[       OK ] Parameters/TestRpc.TestMessengerCreateDestroy/SSL_UnixSocket (27 ms)
[ RUN      ] Parameters/TestRpc.TestNegotiationDeadlock/SSL_UnixSocket
I20260928 14:54:57.608448 27757 acceptor_pool.cc:254] collecting diagnostics on the listening RPC socket unix:/tmp/dist-test-taskXETQdB/test-tmp/rpc-test-4ee2558836b64dd9b10856ab05f8fd71.sock every 8 connection(s)
I20260928 14:54:57.608456 27758 acceptor_pool.cc:254] collecting diagnostics on the listening RPC socket unix:/tmp/dist-test-taskXETQdB/test-tmp/rpc-test-4ee2558836b64dd9b10856ab05f8fd71.sock every 8 connection(s)
[       OK ] Parameters/TestRpc.TestNegotiationDeadlock/SSL_UnixSocket (30 ms)
[ RUN      ] Parameters/TestRpc.TestCallWithChainCertAndChainCA/SSL_UnixSocket
I20260928 14:54:57.645397 27773 acceptor_pool.cc:254] collecting diagnostics on the listening RPC socket unix:/tmp/dist-test-taskXETQdB/test-tmp/rpc-test-a63c385d152a46ea8953beee7d69b981.sock every 8 connection(s)
I20260928 14:54:57.645452 27774 acceptor_pool.cc:254] collecting diagnostics on the listening RPC socket unix:/tmp/dist-test-taskXETQdB/test-tmp/rpc-test-a63c385d152a46ea8953beee7d69b981.sock every 8 connection(s)
/data0/somelongdirectorytoavoidrpathissues/src/kudu/src/kudu/rpc/rpc-test.cc:270: Failure
Failed
Bad status: Runtime error: could not verify certificate chain (error with cert: subject=CN = localhost, ST = sadfjas, C = AS, emailAddress = sdflkdsajf, O = lskdfjlsad, OU = sldfkja, issuer=C = AS, ST = ASDfkjdhf, L = lskdjf, O = saldfja, OU = skdjf, CN = localhost, emailAddress = sadjflkadsj): : certificate has expired
Google Test trace:
/data0/somelongdirectorytoavoidrpathissues/src/kudu/src/kudu/rpc/rpc-test.cc:267: Connecting to unix:/tmp/dist-test-taskXETQdB/test-tmp/rpc-test-a63c385d152a46ea8953beee7d69b981.sock
I20260928 14:54:57.649132 27737 test_util.cc:175] -----------------------------------------------
I20260928 14:54:57.649175 27737 test_util.cc:176] Had fatal failures, leaving test files at /tmp/dist-test-taskXETQdB/test-tmp/rpc-test.6.Parameters_TestRpc.TestCallWithChainCertAndChainCA_SSL_UnixSocket.1790607297554594-27737-0
[  FAILED  ] Parameters/TestRpc.TestCallWithChainCertAndChainCA/SSL_UnixSocket, where GetParam() = (true, true) (34 ms)
[ RUN      ] Parameters/TestRpc.TestCallWithPasswordProtectedKey/SSL_UnixSocket
I20260928 14:54:57.669605 27798 acceptor_pool.cc:254] collecting diagnostics on the listening RPC socket unix:/tmp/dist-test-taskXETQdB/test-tmp/rpc-test-a61de3f254424af3ad3cfc7c24a06319.sock every 8 connection(s)
I20260928 14:54:57.669643 27799 acceptor_pool.cc:254] collecting diagnostics on the listening RPC socket unix:/tmp/dist-test-taskXETQdB/test-tmp/rpc-test-a61de3f254424af3ad3cfc7c24a06319.sock every 8 connection(s)
W20260928 14:54:57.685542 27795 connection.cc:196] Error closing socket: Network error: TlsSocket::Close: Broken pipe
[       OK ] Parameters/TestRpc.TestCallWithPasswordProtectedKey/SSL_UnixSocket (37 ms)
[ RUN      ] Parameters/TestRpc.TestCallToBadServer/SSL_UnixSocket
I20260928 14:54:57.699280 27737 rpc-test.cc:394] Status: Network error: Client connection negotiation failed: client connection to 0.0.0.0:0: connect: Connection refused (error 111)
I20260928 14:54:57.699553 27737 rpc-test.cc:394] Status: Network error: Client connection negotiation failed: client connection to 0.0.0.0:0: connect: Connection refused (error 111)
I20260928 14:54:57.699776 27737 rpc-test.cc:394] Status: Network error: Client connection negotiation failed: client connection to 0.0.0.0:0: connect: Connection refused (error 111)
I20260928 14:54:57.700006 27737 rpc-test.cc:394] Status: Network error: Client connection negotiation failed: client connection to 0.0.0.0:0: connect: Connection refused (error 111)
I20260928 14:54:57.700189 27737 rpc-test.cc:394] Status: Network error: Client connection negotiation failed: client connection to 0.0.0.0:0: connect: Connection refused (error 111)
[       OK ] Parameters/TestRpc.TestCallToBadServer/SSL_UnixSocket (13 ms)
[ RUN      ] Parameters/TestRpc.TestWrongService/SSL_UnixSocket
I20260928 14:54:57.707839 27833 acceptor_pool.cc:254] collecting diagnostics on the listening RPC socket unix:/tmp/dist-test-taskXETQdB/test-tmp/rpc-test-09a1aae10eb94497820bddabfb2370b3.sock every 8 connection(s)
I20260928 14:54:57.707858 27834 acceptor_pool.cc:254] collecting diagnostics on the listening RPC socket unix:/tmp/dist-test-taskXETQdB/test-tmp/rpc-test-09a1aae10eb94497820bddabfb2370b3.sock every 8 connection(s)
I20260928 14:54:57.720536 27830 messenger.cc:345] service WrongServiceName not registered on TestServer
W20260928 14:54:57.721174 27830 connection.cc:196] Error closing socket: Network error: TlsSocket::Close: Broken pipe
[       OK ] Parameters/TestRpc.TestWrongService/SSL_UnixSocket (21 ms)
[ RUN      ] Parameters/TestRpc.TestConnectionKeepalive/SSL_UnixSocket
I20260928 14:54:57.732888 27856 acceptor_pool.cc:254] collecting diagnostics on the listening RPC socket unix:/tmp/dist-test-taskXETQdB/test-tmp/rpc-test-2cad0be4943842ccad604a67efb62587.sock every 8 connection(s)
I20260928 14:54:57.732954 27857 acceptor_pool.cc:254] collecting diagnostics on the listening RPC socket unix:/tmp/dist-test-taskXETQdB/test-tmp/rpc-test-2cad0be4943842ccad604a67efb62587.sock every 8 connection(s)
I20260928 14:54:57.733115 27737 rpc-test.cc:488] Connecting to unix:/tmp/dist-test-taskXETQdB/test-tmp/rpc-test-2cad0be4943842ccad604a67efb62587.sock
W20260928 14:54:58.223450 27869 connection.cc:196] Error closing socket: Network error: TlsSocket::Close: Broken pipe
[       OK ] Parameters/TestRpc.TestConnectionKeepalive/SSL_UnixSocket (1030 ms)
[ RUN      ] Parameters/TestRpc.TestClientConnectionMetrics/SSL_UnixSocket
I20260928 14:54:58.779083 27881 acceptor_pool.cc:254] collecting diagnostics on the listening RPC socket unix:/tmp/dist-test-taskXETQdB/test-tmp/rpc-test-bb6ff776dc454ced9d7a342f368ae02b.sock every 8 connection(s)
I20260928 14:54:58.779153 27882 acceptor_pool.cc:254] collecting diagnostics on the listening RPC socket unix:/tmp/dist-test-taskXETQdB/test-tmp/rpc-test-bb6ff776dc454ced9d7a342f368ae02b.sock every 8 connection(s)
I20260928 14:54:58.779335 27737 rpc-test.cc:569] Connecting to unix:/tmp/dist-test-taskXETQdB/test-tmp/rpc-test-bb6ff776dc454ced9d7a342f368ae02b.sock
W20260928 14:55:06.624636 27878 connection.cc:196] Error closing socket: Network error: TlsSocket::Close: Broken pipe
[       OK ] Parameters/TestRpc.TestClientConnectionMetrics/SSL_UnixSocket (7872 ms)
[ RUN      ] Parameters/TestRpc.TestCredentialsPolicy/SSL_UnixSocket
I20260928 14:55:06.640638 27904 acceptor_pool.cc:254] collecting diagnostics on the listening RPC socket unix:/tmp/dist-test-taskXETQdB/test-tmp/rpc-test-45c969cb682d430cad6a05e803d1026f.sock every 8 connection(s)
I20260928 14:55:06.640722 27905 acceptor_pool.cc:254] collecting diagnostics on the listening RPC socket unix:/tmp/dist-test-taskXETQdB/test-tmp/rpc-test-45c969cb682d430cad6a05e803d1026f.sock every 8 connection(s)
I20260928 14:55:06.640892 27737 rpc-test.cc:700] Connecting to unix:/tmp/dist-test-taskXETQdB/test-tmp/rpc-test-45c969cb682d430cad6a05e803d1026f.sock
W20260928 14:55:06.655887 27903 connection.cc:196] Error closing socket: Network error: TlsSocket::Close: Broken pipe
[       OK ] Parameters/TestRpc.TestCredentialsPolicy/SSL_UnixSocket (34 ms)
[ RUN      ] Parameters/TestRpc.TestCallLongerThanKeepalive/SSL_UnixSocket
I20260928 14:55:06.677050 27929 acceptor_pool.cc:254] collecting diagnostics on the listening RPC socket unix:/tmp/dist-test-taskXETQdB/test-tmp/rpc-test-9a259557567f44318d1996d679dad795.sock every 8 connection(s)
I20260928 14:55:06.677103 27930 acceptor_pool.cc:254] collecting diagnostics on the listening RPC socket unix:/tmp/dist-test-taskXETQdB/test-tmp/rpc-test-9a259557567f44318d1996d679dad795.sock every 8 connection(s)
I20260928 14:55:06.694235 27933 rpc-test-base.h:222] got call: sleep_micros: 3000000 deferred: true
I20260928 14:55:09.694870 27933 rpcz_store.cc:275] Call kudu.rpc.GenericCalculatorService.Sleep from unix:<unnamed> (request call id 0) took 3000 ms. Trace:
I20260928 14:55:09.694975 27933 rpcz_store.cc:276] 0928 14:55:06.694174 (+     0us) service_pool.cc:170] Inserting onto call queue
0928 14:55:06.694217 (+    43us) service_pool.cc:227] Handling call
0928 14:55:09.694846 (+3000629us) inbound_call.cc:173] Queueing success response
Metrics: {}
[       OK ] Parameters/TestRpc.TestCallLongerThanKeepalive/SSL_UnixSocket (3037 ms)
[ RUN      ] Parameters/TestRpc.TestRpcSidecar/SSL_UnixSocket
I20260928 14:55:09.732604 27954 acceptor_pool.cc:254] collecting diagnostics on the listening RPC socket unix:/tmp/dist-test-taskXETQdB/test-tmp/rpc-test-abc624b24127474a98b19542c599d730.sock every 8 connection(s)
I20260928 14:55:09.732657 27955 acceptor_pool.cc:254] collecting diagnostics on the listening RPC socket unix:/tmp/dist-test-taskXETQdB/test-tmp/rpc-test-abc624b24127474a98b19542c599d730.sock every 8 connection(s)
W20260928 14:55:09.764958 27951 connection.cc:196] Error closing socket: Network error: TlsSocket::Close: Broken pipe
[       OK ] Parameters/TestRpc.TestRpcSidecar/SSL_UnixSocket (68 ms)
[ RUN      ] Parameters/TestRpc.TestRpcSidecarLimits/SSL_UnixSocket
I20260928 14:55:11.436088 27980 acceptor_pool.cc:254] collecting diagnostics on the listening RPC socket unix:/tmp/dist-test-taskXETQdB/test-tmp/rpc-test-05c4c1dcb5d3499784775ce8144b3a2c.sock every 8 connection(s)
I20260928 14:55:11.436105 27979 acceptor_pool.cc:254] collecting diagnostics on the listening RPC socket unix:/tmp/dist-test-taskXETQdB/test-tmp/rpc-test-05c4c1dcb5d3499784775ce8144b3a2c.sock every 8 connection(s)
W20260928 14:55:11.441843 27737 serialization.cc:72] Serialized kudu.rpc_test.PushStringsRequestPB (2147483654 bytes) is larger than the maximum configured RPC message size (52428800 bytes). Sending anyway, but peer may reject the data.
W20260928 14:55:11.444882 27976 connection.cc:535] server connection from unix:<unnamed> recv error: Network error: RPC frame had a length of 2147483714, but we only support messages up to 52428800 bytes long.
W20260928 14:55:11.444942 27976 connection.cc:158] shutting down server connection from unix:<unnamed> with pending inbound data: 4/2147483714 bytes received; last active 0 ns ago: status Network error: RPC frame had a length of 2147483714, but we only support messages up to 52428800 bytes long.
W20260928 14:55:11.445118 27992 connection.cc:196] Error closing socket: Network error: TlsSocket::Close: Broken pipe
I20260928 14:55:11.459043 28005 acceptor_pool.cc:254] collecting diagnostics on the listening RPC socket unix:/tmp/dist-test-taskXETQdB/test-tmp/rpc-test-05c4c1dcb5d3499784775ce8144b3a2c.sock every 8 connection(s)
I20260928 14:55:11.459054 28004 acceptor_pool.cc:254] collecting diagnostics on the listening RPC socket unix:/tmp/dist-test-taskXETQdB/test-tmp/rpc-test-05c4c1dcb5d3499784775ce8144b3a2c.sock every 8 connection(s)
W20260928 14:55:15.613569 28001 connection.cc:577] server connection from unix:<unnamed>: received bad data: 'Corruption: Invalid packet: message had a length of 2147483710, but we only support messages up to 2147483647 bytes
'
W20260928 14:55:15.613873 28017 connection.cc:196] Error closing socket: Network error: TlsSocket::Close: Broken pipe
[       OK ] Parameters/TestRpc.TestRpcSidecarLimits/SSL_UnixSocket (5849 ms)
[ RUN      ] Parameters/TestRpc.TestCallTimeoutDoesntAffectNegotiation/SSL_UnixSocket
I20260928 14:55:15.627717 28029 acceptor_pool.cc:254] collecting diagnostics on the listening RPC socket unix:/tmp/dist-test-taskXETQdB/test-tmp/rpc-test-eaa51369671e4066a520322b263afe7f.sock every 8 connection(s)
I20260928 14:55:15.627772 28030 acceptor_pool.cc:254] collecting diagnostics on the listening RPC socket unix:/tmp/dist-test-taskXETQdB/test-tmp/rpc-test-eaa51369671e4066a520322b263afe7f.sock every 8 connection(s)
W20260928 14:55:15.641127 28025 negotiation.cc:266] Injecting 500ms delay in negotiation
I20260928 14:55:15.691452 27737 rpc-test-base.h:595] status: Timed out: connection negotiation to unix:/tmp/dist-test-taskXETQdB/test-tmp/rpc-test-eaa51369671e4066a520322b263afe7f.sock for RPC Sleep timed out after 0.050s (ON_OUTBOUND_QUEUE), seconds elapsed: 0.0505816
[       OK ] Parameters/TestRpc.TestCallTimeoutDoesntAffectNegotiation/SSL_UnixSocket (530 ms)
[ RUN      ] Parameters/TestRpc.TestRpcHandlerLatencyMetric/SSL_UnixSocket
I20260928 14:55:16.153326 28054 acceptor_pool.cc:254] collecting diagnostics on the listening RPC socket unix:/tmp/dist-test-taskXETQdB/test-tmp/rpc-test-dafe4fda36e04f1fa9454d223d6f5b4a.sock every 8 connection(s)
I20260928 14:55:16.153370 28055 acceptor_pool.cc:254] collecting diagnostics on the listening RPC socket unix:/tmp/dist-test-taskXETQdB/test-tmp/rpc-test-dafe4fda36e04f1fa9454d223d6f5b4a.sock every 8 connection(s)
I20260928 14:55:16.196022 27737 rpc-test.cc:1236] Sleep() min lat: 20212
I20260928 14:55:16.196102 27737 rpc-test.cc:1237] Sleep() mean lat: 20212
I20260928 14:55:16.196126 27737 rpc-test.cc:1238] Sleep() max lat: 20212
I20260928 14:55:16.196139 27737 rpc-test.cc:1239] Sleep() #calls: 1
W20260928 14:55:16.196879 28051 connection.cc:196] Error closing socket: Network error: TlsSocket::Close: Broken pipe
[       OK ] Parameters/TestRpc.TestRpcHandlerLatencyMetric/SSL_UnixSocket (51 ms)
[ RUN      ] Parameters/TestRpc.TimedOutOnResponseMetricServiceQueue/SSL_UnixSocket
I20260928 14:55:16.221935 28080 acceptor_pool.cc:254] collecting diagnostics on the listening RPC socket unix:/tmp/dist-test-taskXETQdB/test-tmp/rpc-test-7457942116e24fc99d282d04f2c9ba9d.sock every 8 connection(s)
I20260928 14:55:16.221974 28081 acceptor_pool.cc:254] collecting diagnostics on the listening RPC socket unix:/tmp/dist-test-taskXETQdB/test-tmp/rpc-test-7457942116e24fc99d282d04f2c9ba9d.sock every 8 connection(s)
W20260928 14:55:16.292852 28082 rpcz_store.cc:267] Call kudu.rpc_test.CalculatorService.Sleep from unix:<unnamed> (request call id 2) took 20 ms (client timeout 20 ms). Trace:
W20260928 14:55:16.292932 28082 rpcz_store.cc:269] 0928 14:55:16.272664 (+     0us) service_pool.cc:170] Inserting onto call queue
0928 14:55:16.292831 (+ 20167us) service_pool.cc:214] Skipping call since client already timed out
0928 14:55:16.292842 (+    11us) inbound_call.cc:173] Queueing failure response
Metrics: {}
W20260928 14:55:16.293421 28077 connection.cc:196] Error closing socket: Network error: TlsSocket::Close: Broken pipe
[       OK ] Parameters/TestRpc.TimedOutOnResponseMetricServiceQueue/SSL_UnixSocket (96 ms)
[ RUN      ] Parameters/TestRpc.RpcPendingConnectionsMetric/SSL_UnixSocket
I20260928 14:55:16.295861 28103 acceptor_pool.cc:254] collecting diagnostics on the listening RPC socket 0.0.0.0:40501 every 8 connection(s)
I20260928 14:55:16.295931 28104 acceptor_pool.cc:254] collecting diagnostics on the listening RPC socket 0.0.0.0:40501 every 8 connection(s)
W20260928 14:55:16.296525 28099 negotiation.cc:337] Failed RPC negotiation. Trace:
0928 14:55:16.296363 (+     0us) reactor.cc:625] Submitting negotiation task for server connection from 127.0.0.1:33732 (local address 127.0.0.1:40501)
0928 14:55:16.296412 (+    49us) server_negotiation.cc:206] Beginning negotiation
0928 14:55:16.296413 (+     1us) server_negotiation.cc:399] Waiting for connection header
0928 14:55:16.296480 (+    67us) negotiation.cc:327] Negotiation complete: Network error: Server connection negotiation failed: server connection from 127.0.0.1:33732: BlockingRecv error: recv got EOF from 127.0.0.1:33732 (error 108)
Metrics: {"server-negotiator.queue_time_us":25}
[       OK ] Parameters/TestRpc.RpcPendingConnectionsMetric/SSL_UnixSocket (13 ms)
[ RUN      ] Parameters/TestRpc.TestRpcContextClientDeadline/SSL_UnixSocket
I20260928 14:55:16.318786 28119 acceptor_pool.cc:254] collecting diagnostics on the listening RPC socket unix:/tmp/dist-test-taskXETQdB/test-tmp/rpc-test-1e9859df58cb45bc86fca86ec113d558.sock every 8 connection(s)
I20260928 14:55:16.318823 28120 acceptor_pool.cc:254] collecting diagnostics on the listening RPC socket unix:/tmp/dist-test-taskXETQdB/test-tmp/rpc-test-1e9859df58cb45bc86fca86ec113d558.sock every 8 connection(s)
W20260928 14:55:16.354398 28116 connection.cc:196] Error closing socket: Network error: TlsSocket::Close: Broken pipe
[       OK ] Parameters/TestRpc.TestRpcContextClientDeadline/SSL_UnixSocket (47 ms)
[ RUN      ] Parameters/TestRpc.TestApplicationFeatureFlagUnsupportedServer/SSL_UnixSocket
I20260928 14:55:16.363276 28144 acceptor_pool.cc:254] collecting diagnostics on the listening RPC socket unix:/tmp/dist-test-taskXETQdB/test-tmp/rpc-test-88b84bb087ec41b1bc404850a3ac25e9.sock every 8 connection(s)
I20260928 14:55:16.363327 28145 acceptor_pool.cc:254] collecting diagnostics on the listening RPC socket unix:/tmp/dist-test-taskXETQdB/test-tmp/rpc-test-88b84bb087ec41b1bc404850a3ac25e9.sock every 8 connection(s)
[       OK ] Parameters/TestRpc.TestApplicationFeatureFlagUnsupportedServer/SSL_UnixSocket (24 ms)
[ RUN      ] Parameters/TestRpc.TestCancellationAsync/SSL_UnixSocket
I20260928 14:55:16.390584 28169 acceptor_pool.cc:254] collecting diagnostics on the listening RPC socket unix:/tmp/dist-test-taskXETQdB/test-tmp/rpc-test-653d269663f346c49d5e3db01e16a253.sock every 8 connection(s)
I20260928 14:55:16.390653 28170 acceptor_pool.cc:254] collecting diagnostics on the listening RPC socket unix:/tmp/dist-test-taskXETQdB/test-tmp/rpc-test-653d269663f346c49d5e3db01e16a253.sock every 8 connection(s)
I20260928 14:55:16.390807 27737 rpc-test.cc:1716] Connecting to unix:/tmp/dist-test-taskXETQdB/test-tmp/rpc-test-653d269663f346c49d5e3db01e16a253.sock
I20260928 14:55:16.402782 27737 test_util.cc:268] Using random seed: 1090962013
I20260928 14:55:16.415711 28173 rpc-test-base.h:240] got call: sleep_micros: 500 pattern: 4294967295 num_repetitions: 2097152 sidecar_idx: 0
I20260928 14:55:16.426040 28173 rpc-test-base.h:240] got call: sleep_micros: 500 pattern: 4294967295 num_repetitions: 2097152 sidecar_idx: 0
I20260928 14:55:16.435199 28173 rpc-test-base.h:240] got call: sleep_micros: 500 pattern: 4294967295 num_repetitions: 2097152 sidecar_idx: 0
I20260928 14:55:16.444468 28173 rpc-test-base.h:240] got call: sleep_micros: 500 pattern: 4294967295 num_repetitions: 2097152 sidecar_idx: 0
I20260928 14:55:16.461397 28173 rpc-test-base.h:240] got call: sleep_micros: 500 pattern: 4294967295 num_repetitions: 2097152 sidecar_idx: 0
I20260928 14:55:16.471175 28173 rpc-test-base.h:240] got call: sleep_micros: 500 pattern: 4294967295 num_repetitions: 2097152 sidecar_idx: 0
I20260928 14:55:16.481104 28173 rpc-test-base.h:240] got call: sleep_micros: 500 pattern: 4294967295 num_repetitions: 2097152 sidecar_idx: 0
I20260928 14:55:16.490594 28173 rpc-test-base.h:240] got call: sleep_micros: 500 pattern: 4294967295 num_repetitions: 2097152 sidecar_idx: 0
W20260928 14:55:16.491722 28166 connection.cc:196] Error closing socket: Network error: TlsSocket::Close: Broken pipe
W20260928 14:55:16.493527 28166 connection.cc:441] server connection from unix:<unnamed> torn down before Call kudu.rpc.GenericCalculatorService.SleepWithSidecar from unix:<unnamed> (request call id 9) could send its response
[       OK ] Parameters/TestRpc.TestCancellationAsync/SSL_UnixSocket (115 ms)
[ RUN      ] Parameters/TestRpc.TestPerformanceBySocketType/SSL_UnixSocket
I20260928 14:55:16.515573 28194 acceptor_pool.cc:254] collecting diagnostics on the listening RPC socket unix:/tmp/dist-test-taskXETQdB/test-tmp/rpc-test-bd29eb5f89a44c2bbfcce7bfd080ebca.sock every 8 connection(s)
I20260928 14:55:16.515621 28195 acceptor_pool.cc:254] collecting diagnostics on the listening RPC socket unix:/tmp/dist-test-taskXETQdB/test-tmp/rpc-test-bd29eb5f89a44c2bbfcce7bfd080ebca.sock every 8 connection(s)
I20260928 14:55:16.515753 27737 rpc-test.cc:1846] Connecting to unix:/tmp/dist-test-taskXETQdB/test-tmp/rpc-test-bd29eb5f89a44c2bbfcce7bfd080ebca.sock
I20260928 14:55:17.738611 27737 rpc-test.cc:1859] Sending 1024MB via ssl-enabled unix socket: real 1.210s	user 1.276s	sys 0.908s
I20260928 14:55:18.891990 27737 rpc-test.cc:1859] Sending 1024MB via ssl-enabled unix socket: real 1.153s	user 1.265s	sys 0.825s
I20260928 14:55:20.033773 27737 rpc-test.cc:1859] Sending 1024MB via ssl-enabled unix socket: real 1.142s	user 1.159s	sys 0.909s
I20260928 14:55:21.212052 27737 rpc-test.cc:1859] Sending 1024MB via ssl-enabled unix socket: real 1.178s	user 1.279s	sys 0.864s
I20260928 14:55:22.395874 27737 rpc-test.cc:1859] Sending 1024MB via ssl-enabled unix socket: real 1.184s	user 1.236s	sys 0.902s
[       OK ] Parameters/TestRpc.TestPerformanceBySocketType/SSL_UnixSocket (5902 ms)
[----------] 20 tests from Parameters/TestRpc (24840 ms total)

[----------] 1 test from Parameters/TestRpcSocketTxRxQueue
[ RUN      ] Parameters/TestRpcSocketTxRxQueue.AcceptorRxQueueSizeMetric/0
I20260928 14:55:22.408049 28219 acceptor_pool.cc:254] collecting diagnostics on the listening RPC socket 0.0.0.0:37511 every 1 connection(s)
I20260928 14:55:22.408058 28220 acceptor_pool.cc:254] collecting diagnostics on the listening RPC socket 0.0.0.0:37511 every 1 connection(s)
W20260928 14:55:22.408645 28215 negotiation.cc:337] Failed RPC negotiation. Trace:
0928 14:55:22.408497 (+     0us) reactor.cc:625] Submitting negotiation task for server connection from 127.0.0.1:49842 (local address 127.0.0.1:37511)
0928 14:55:22.408541 (+    44us) server_negotiation.cc:206] Beginning negotiation
0928 14:55:22.408544 (+     3us) server_negotiation.cc:399] Waiting for connection header
0928 14:55:22.408617 (+    73us) negotiation.cc:327] Negotiation complete: Network error: Server connection negotiation failed: server connection from 127.0.0.1:49842: BlockingRecv error: recv got EOF from 127.0.0.1:49842 (error 108)
Metrics: {"server-negotiator.queue_time_us":18}
[       OK ] Parameters/TestRpcSocketTxRxQueue.AcceptorRxQueueSizeMetric/0 (11 ms)
[----------] 1 test from Parameters/TestRpcSocketTxRxQueue (11 ms total)

[----------] Global test environment tear-down
[==========] 21 tests from 2 test suites ran. (24852 ms total)
[  PASSED  ] 20 tests.
[  FAILED  ] 1 test, listed below:
[  FAILED  ] Parameters/TestRpc.TestCallWithChainCertAndChainCA/SSL_UnixSocket, where GetParam() = (true, true)

 1 FAILED TEST