Diagnosed failure

Parameters/TestRpc.TestCallWithChainCertAndChainCA/SSL_TCP: /data0/somelongdirectorytoavoidrpathissues/src/kudu/src/kudu/rpc/rpc-test.cc:270: Failure
Failed
Bad status: Runtime error: could not verify certificate chain (error with cert: subject=CN = localhost, ST = sadfjas, C = AS, emailAddress = sdflkdsajf, O = lskdfjlsad, OU = sldfkja, issuer=C = AS, ST = ASDfkjdhf, L = lskdjf, O = saldfja, OU = skdjf, CN = localhost, emailAddress = sadjflkadsj): : certificate has expired
Google Test trace:
/data0/somelongdirectorytoavoidrpathissues/src/kudu/src/kudu/rpc/rpc-test.cc:267: Connecting to 0.0.0.0:42425
I20260923 19:39:51.121450  4140 test_util.cc:175] -----------------------------------------------
I20260923 19:39:51.121522  4140 test_util.cc:176] Had fatal failures, leaving test files at /tmp/dist-test-task2Yu0ki/test-tmp/rpc-test.5.Parameters_TestRpc.TestCallWithChainCertAndChainCA_SSL_TCP.1790192391047059-4140-0

Full log

Note: This is test shard 6 of 8.
[==========] Running 21 tests from 2 test suites.
[----------] Global test environment set-up.
[----------] 20 tests from Parameters/TestRpc
[ RUN      ] Parameters/TestRpc.TestMessengerCreateDestroy/SSL_TCP
WARNING: Logging before InitGoogleLogging() is written to STDERR
I20260923 19:39:51.084123  4140 rpc-test.cc:169] started messenger TestCreateDestroy
[       OK ] Parameters/TestRpc.TestMessengerCreateDestroy/SSL_TCP (32 ms)
[ RUN      ] Parameters/TestRpc.TestNegotiationDeadlock/SSL_TCP
I20260923 19:39:51.099097  4160 acceptor_pool.cc:254] collecting diagnostics on the listening RPC socket 0.0.0.0:37105 every 8 connection(s)
I20260923 19:39:51.099120  4161 acceptor_pool.cc:254] collecting diagnostics on the listening RPC socket 0.0.0.0:37105 every 8 connection(s)
[       OK ] Parameters/TestRpc.TestNegotiationDeadlock/SSL_TCP (24 ms)
[ RUN      ] Parameters/TestRpc.TestCallWithChainCertAndChainCA/SSL_TCP
I20260923 19:39:51.116221  4176 acceptor_pool.cc:254] collecting diagnostics on the listening RPC socket 0.0.0.0:42425 every 8 connection(s)
I20260923 19:39:51.116235  4177 acceptor_pool.cc:254] collecting diagnostics on the listening RPC socket 0.0.0.0:42425 every 8 connection(s)
/data0/somelongdirectorytoavoidrpathissues/src/kudu/src/kudu/rpc/rpc-test.cc:270: Failure
Failed
Bad status: Runtime error: could not verify certificate chain (error with cert: subject=CN = localhost, ST = sadfjas, C = AS, emailAddress = sdflkdsajf, O = lskdfjlsad, OU = sldfkja, issuer=C = AS, ST = ASDfkjdhf, L = lskdjf, O = saldfja, OU = skdjf, CN = localhost, emailAddress = sadjflkadsj): : certificate has expired
Google Test trace:
/data0/somelongdirectorytoavoidrpathissues/src/kudu/src/kudu/rpc/rpc-test.cc:267: Connecting to 0.0.0.0:42425
I20260923 19:39:51.121450  4140 test_util.cc:175] -----------------------------------------------
I20260923 19:39:51.121522  4140 test_util.cc:176] Had fatal failures, leaving test files at /tmp/dist-test-task2Yu0ki/test-tmp/rpc-test.5.Parameters_TestRpc.TestCallWithChainCertAndChainCA_SSL_TCP.1790192391047059-4140-0
[  FAILED  ] Parameters/TestRpc.TestCallWithChainCertAndChainCA/SSL_TCP, where GetParam() = (true, false) (10 ms)
[ RUN      ] Parameters/TestRpc.TestCallWithPasswordProtectedKey/SSL_TCP
I20260923 19:39:51.148391  4201 acceptor_pool.cc:254] collecting diagnostics on the listening RPC socket 0.0.0.0:35703 every 8 connection(s)
I20260923 19:39:51.148415  4202 acceptor_pool.cc:254] collecting diagnostics on the listening RPC socket 0.0.0.0:35703 every 8 connection(s)
[       OK ] Parameters/TestRpc.TestCallWithPasswordProtectedKey/SSL_TCP (41 ms)
[ RUN      ] Parameters/TestRpc.TestCallToBadServer/SSL_TCP
I20260923 19:39:51.185787  4140 rpc-test.cc:394] Status: Network error: Client connection negotiation failed: client connection to 0.0.0.0:0: connect: Connection refused (error 111)
I20260923 19:39:51.186280  4140 rpc-test.cc:394] Status: Network error: Client connection negotiation failed: client connection to 0.0.0.0:0: connect: Connection refused (error 111)
I20260923 19:39:51.186688  4140 rpc-test.cc:394] Status: Network error: Client connection negotiation failed: client connection to 0.0.0.0:0: connect: Connection refused (error 111)
I20260923 19:39:51.187054  4140 rpc-test.cc:394] Status: Network error: Client connection negotiation failed: client connection to 0.0.0.0:0: connect: Connection refused (error 111)
I20260923 19:39:51.187410  4140 rpc-test.cc:394] Status: Network error: Client connection negotiation failed: client connection to 0.0.0.0:0: connect: Connection refused (error 111)
[       OK ] Parameters/TestRpc.TestCallToBadServer/SSL_TCP (24 ms)
[ RUN      ] Parameters/TestRpc.TestWrongService/SSL_TCP
I20260923 19:39:51.198712  4236 acceptor_pool.cc:254] collecting diagnostics on the listening RPC socket 0.0.0.0:38311 every 8 connection(s)
I20260923 19:39:51.198746  4237 acceptor_pool.cc:254] collecting diagnostics on the listening RPC socket 0.0.0.0:38311 every 8 connection(s)
I20260923 19:39:51.224264  4234 messenger.cc:345] service WrongServiceName not registered on TestServer
[       OK ] Parameters/TestRpc.TestWrongService/SSL_TCP (38 ms)
[ RUN      ] Parameters/TestRpc.TestConnectionKeepalive/SSL_TCP
I20260923 19:39:51.240360  4260 acceptor_pool.cc:254] collecting diagnostics on the listening RPC socket 0.0.0.0:39773 every 8 connection(s)
I20260923 19:39:51.240381  4259 acceptor_pool.cc:254] collecting diagnostics on the listening RPC socket 0.0.0.0:39773 every 8 connection(s)
I20260923 19:39:51.240584  4140 rpc-test.cc:488] Connecting to 0.0.0.0:39773
[       OK ] Parameters/TestRpc.TestConnectionKeepalive/SSL_TCP (1036 ms)
[ RUN      ] Parameters/TestRpc.TestClientConnectionMetrics/SSL_TCP
I20260923 19:39:52.272015  4284 acceptor_pool.cc:254] collecting diagnostics on the listening RPC socket 0.0.0.0:36377 every 8 connection(s)
I20260923 19:39:52.272044  4285 acceptor_pool.cc:254] collecting diagnostics on the listening RPC socket 0.0.0.0:36377 every 8 connection(s)
I20260923 19:39:52.272264  4140 rpc-test.cc:569] Connecting to 0.0.0.0:36377
[       OK ] Parameters/TestRpc.TestClientConnectionMetrics/SSL_TCP (13195 ms)
[ RUN      ] Parameters/TestRpc.TestCredentialsPolicy/SSL_TCP
I20260923 19:40:05.467857  4307 acceptor_pool.cc:254] collecting diagnostics on the listening RPC socket 0.0.0.0:39391 every 8 connection(s)
I20260923 19:40:05.467978  4308 acceptor_pool.cc:254] collecting diagnostics on the listening RPC socket 0.0.0.0:39391 every 8 connection(s)
I20260923 19:40:05.468173  4140 rpc-test.cc:700] Connecting to 0.0.0.0:39391
[       OK ] Parameters/TestRpc.TestCredentialsPolicy/SSL_TCP (37 ms)
[ RUN      ] Parameters/TestRpc.TestCallLongerThanKeepalive/SSL_TCP
I20260923 19:40:05.510501  4332 acceptor_pool.cc:254] collecting diagnostics on the listening RPC socket 0.0.0.0:33479 every 8 connection(s)
I20260923 19:40:05.510512  4333 acceptor_pool.cc:254] collecting diagnostics on the listening RPC socket 0.0.0.0:33479 every 8 connection(s)
I20260923 19:40:05.538352  4336 rpc-test-base.h:222] got call: sleep_micros: 3000000 deferred: true
I20260923 19:40:08.539244  4336 rpcz_store.cc:275] Call kudu.rpc.GenericCalculatorService.Sleep from 127.0.0.1:59760 (request call id 0) took 3001 ms. Trace:
I20260923 19:40:08.539371  4336 rpcz_store.cc:276] 0923 19:40:05.538264 (+     0us) service_pool.cc:170] Inserting onto call queue
0923 19:40:05.538316 (+    52us) service_pool.cc:227] Handling call
0923 19:40:08.539224 (+3000908us) inbound_call.cc:173] Queueing success response
Metrics: {}
[       OK ] Parameters/TestRpc.TestCallLongerThanKeepalive/SSL_TCP (3045 ms)
[ RUN      ] Parameters/TestRpc.TestRpcSidecar/SSL_TCP
I20260923 19:40:08.560868  4357 acceptor_pool.cc:254] collecting diagnostics on the listening RPC socket 0.0.0.0:45495 every 8 connection(s)
I20260923 19:40:08.560875  4358 acceptor_pool.cc:254] collecting diagnostics on the listening RPC socket 0.0.0.0:45495 every 8 connection(s)
[       OK ] Parameters/TestRpc.TestRpcSidecar/SSL_TCP (96 ms)
[ RUN      ] Parameters/TestRpc.TestRpcSidecarLimits/SSL_TCP
I20260923 19:40:10.169010  4382 acceptor_pool.cc:254] collecting diagnostics on the listening RPC socket 0.0.0.0:33565 every 8 connection(s)
I20260923 19:40:10.169019  4383 acceptor_pool.cc:254] collecting diagnostics on the listening RPC socket 0.0.0.0:33565 every 8 connection(s)
W20260923 19:40:10.221040  4140 serialization.cc:72] Serialized kudu.rpc_test.PushStringsRequestPB (2147483654 bytes) is larger than the maximum configured RPC message size (52428800 bytes). Sending anyway, but peer may reject the data.
W20260923 19:40:10.224938  4379 connection.cc:535] server connection from 127.0.0.1:56194 recv error: Network error: RPC frame had a length of 2147483714, but we only support messages up to 52428800 bytes long.
W20260923 19:40:10.225046  4379 connection.cc:158] shutting down server connection from 127.0.0.1:56194 with pending inbound data: 4/2147483714 bytes received; last active 0 ns ago: status Network error: RPC frame had a length of 2147483714, but we only support messages up to 52428800 bytes long.
W20260923 19:40:10.225348  4395 connection.cc:196] Error closing socket: Network error: TlsSocket::Close: Connection reset by peer
I20260923 19:40:10.233297  4407 acceptor_pool.cc:254] collecting diagnostics on the listening RPC socket 0.0.0.0:35045 every 8 connection(s)
I20260923 19:40:10.233317  4408 acceptor_pool.cc:254] collecting diagnostics on the listening RPC socket 0.0.0.0:35045 every 8 connection(s)
W20260923 19:40:14.308858  4405 connection.cc:577] server connection from 127.0.0.1:53740: received bad data: 'Corruption: Invalid packet: message had a length of 2147483710, but we only support messages up to 2147483647 bytes
'
[       OK ] Parameters/TestRpc.TestRpcSidecarLimits/SSL_TCP (5672 ms)
[ RUN      ] Parameters/TestRpc.TestCallTimeoutDoesntAffectNegotiation/SSL_TCP
I20260923 19:40:14.321321  4432 acceptor_pool.cc:254] collecting diagnostics on the listening RPC socket 0.0.0.0:33967 every 8 connection(s)
I20260923 19:40:14.321375  4433 acceptor_pool.cc:254] collecting diagnostics on the listening RPC socket 0.0.0.0:33967 every 8 connection(s)
W20260923 19:40:14.334087  4428 negotiation.cc:266] Injecting 500ms delay in negotiation
I20260923 19:40:14.384464  4140 rpc-test-base.h:595] status: Timed out: connection negotiation to 0.0.0.0:33967 for RPC Sleep timed out after 0.050s (ON_OUTBOUND_QUEUE), seconds elapsed: 0.0508689
[       OK ] Parameters/TestRpc.TestCallTimeoutDoesntAffectNegotiation/SSL_TCP (528 ms)
[ RUN      ] Parameters/TestRpc.TestRpcHandlerLatencyMetric/SSL_TCP
I20260923 19:40:14.854031  4457 acceptor_pool.cc:254] collecting diagnostics on the listening RPC socket 0.0.0.0:42303 every 8 connection(s)
I20260923 19:40:14.854058  4458 acceptor_pool.cc:254] collecting diagnostics on the listening RPC socket 0.0.0.0:42303 every 8 connection(s)
I20260923 19:40:14.904438  4140 rpc-test.cc:1236] Sleep() min lat: 20441
I20260923 19:40:14.904510  4140 rpc-test.cc:1237] Sleep() mean lat: 20441
I20260923 19:40:14.904538  4140 rpc-test.cc:1238] Sleep() max lat: 20441
I20260923 19:40:14.904549  4140 rpc-test.cc:1239] Sleep() #calls: 1
[       OK ] Parameters/TestRpc.TestRpcHandlerLatencyMetric/SSL_TCP (66 ms)
[ RUN      ] Parameters/TestRpc.TimedOutOnResponseMetricServiceQueue/SSL_TCP
I20260923 19:40:14.913691  4483 acceptor_pool.cc:254] collecting diagnostics on the listening RPC socket 0.0.0.0:34695 every 8 connection(s)
I20260923 19:40:14.913707  4484 acceptor_pool.cc:254] collecting diagnostics on the listening RPC socket 0.0.0.0:34695 every 8 connection(s)
W20260923 19:40:14.978031  4485 rpcz_store.cc:267] Call kudu.rpc_test.CalculatorService.Sleep from 127.0.0.1:42140 (request call id 2) took 20 ms (client timeout 20 ms). Trace:
W20260923 19:40:14.978140  4485 rpcz_store.cc:269] 0923 19:40:14.957595 (+     0us) service_pool.cc:170] Inserting onto call queue
0923 19:40:14.977978 (+ 20383us) service_pool.cc:214] Skipping call since client already timed out
0923 19:40:14.978013 (+    35us) inbound_call.cc:173] Queueing failure response
Metrics: {}
[       OK ] Parameters/TestRpc.TimedOutOnResponseMetricServiceQueue/SSL_TCP (72 ms)
[ RUN      ] Parameters/TestRpc.RpcPendingConnectionsMetric/SSL_TCP
I20260923 19:40:14.982273  4506 acceptor_pool.cc:254] collecting diagnostics on the listening RPC socket 0.0.0.0:43367 every 8 connection(s)
I20260923 19:40:14.982535  4507 acceptor_pool.cc:254] collecting diagnostics on the listening RPC socket 0.0.0.0:43367 every 8 connection(s)
W20260923 19:40:14.983570  4502 negotiation.cc:337] Failed RPC negotiation. Trace:
0923 19:40:14.983141 (+     0us) reactor.cc:625] Submitting negotiation task for server connection from 127.0.0.1:53132 (local address 127.0.0.1:43367)
0923 19:40:14.983247 (+   106us) server_negotiation.cc:206] Beginning negotiation
0923 19:40:14.983251 (+     4us) server_negotiation.cc:399] Waiting for connection header
0923 19:40:14.983350 (+    99us) negotiation.cc:327] Negotiation complete: Network error: Server connection negotiation failed: server connection from 127.0.0.1:53132: BlockingRecv error: recv got EOF from 127.0.0.1:53132 (error 108)
Metrics: {"server-negotiator.queue_time_us":37}
[       OK ] Parameters/TestRpc.RpcPendingConnectionsMetric/SSL_TCP (14 ms)
[ RUN      ] Parameters/TestRpc.TestRpcContextClientDeadline/SSL_TCP
I20260923 19:40:15.006680  4522 acceptor_pool.cc:254] collecting diagnostics on the listening RPC socket 0.0.0.0:44345 every 8 connection(s)
I20260923 19:40:15.006697  4523 acceptor_pool.cc:254] collecting diagnostics on the listening RPC socket 0.0.0.0:44345 every 8 connection(s)
[       OK ] Parameters/TestRpc.TestRpcContextClientDeadline/SSL_TCP (51 ms)
[ RUN      ] Parameters/TestRpc.TestApplicationFeatureFlagUnsupportedServer/SSL_TCP
I20260923 19:40:15.065359  4548 acceptor_pool.cc:254] collecting diagnostics on the listening RPC socket 0.0.0.0:35055 every 8 connection(s)
I20260923 19:40:15.065330  4547 acceptor_pool.cc:254] collecting diagnostics on the listening RPC socket 0.0.0.0:35055 every 8 connection(s)
[       OK ] Parameters/TestRpc.TestApplicationFeatureFlagUnsupportedServer/SSL_TCP (37 ms)
[ RUN      ] Parameters/TestRpc.TestCancellationAsync/SSL_TCP
I20260923 19:40:15.105921  4140 rpc-test.cc:1716] Connecting to 0.0.0.0:37055
I20260923 19:40:15.107667  4573 acceptor_pool.cc:254] collecting diagnostics on the listening RPC socket 0.0.0.0:37055 every 8 connection(s)
I20260923 19:40:15.108965  4572 acceptor_pool.cc:254] collecting diagnostics on the listening RPC socket 0.0.0.0:37055 every 8 connection(s)
I20260923 19:40:15.118839  4140 test_util.cc:268] Using random seed: -1493461517
I20260923 19:40:15.142831  4576 rpc-test-base.h:240] got call: sleep_micros: 500 pattern: 4294967295 num_repetitions: 2097152 sidecar_idx: 0
I20260923 19:40:15.163972  4574 rpc-test-base.h:240] got call: sleep_micros: 500 pattern: 4294967295 num_repetitions: 2097152 sidecar_idx: 0
I20260923 19:40:15.184903  4574 rpc-test-base.h:240] got call: sleep_micros: 500 pattern: 4294967295 num_repetitions: 2097152 sidecar_idx: 0
I20260923 19:40:15.206661  4574 rpc-test-base.h:240] got call: sleep_micros: 500 pattern: 4294967295 num_repetitions: 2097152 sidecar_idx: 0
I20260923 19:40:15.229281  4574 rpc-test-base.h:240] got call: sleep_micros: 500 pattern: 4294967295 num_repetitions: 2097152 sidecar_idx: 0
I20260923 19:40:15.252415  4574 rpc-test-base.h:240] got call: sleep_micros: 500 pattern: 4294967295 num_repetitions: 2097152 sidecar_idx: 0
I20260923 19:40:15.275559  4574 rpc-test-base.h:240] got call: sleep_micros: 500 pattern: 4294967295 num_repetitions: 2097152 sidecar_idx: 0
I20260923 19:40:15.298561  4574 rpc-test-base.h:240] got call: sleep_micros: 500 pattern: 4294967295 num_repetitions: 2097152 sidecar_idx: 0
W20260923 19:40:15.316443  4570 connection.cc:441] server connection from 127.0.0.1:49756 torn down before Call kudu.rpc.GenericCalculatorService.SleepWithSidecar from 127.0.0.1:49756 (request call id 9) could send its response
[       OK ] Parameters/TestRpc.TestCancellationAsync/SSL_TCP (234 ms)
[ RUN      ] Parameters/TestRpc.TestPerformanceBySocketType/SSL_TCP
I20260923 19:40:15.351263  4597 acceptor_pool.cc:254] collecting diagnostics on the listening RPC socket 0.0.0.0:39507 every 8 connection(s)
I20260923 19:40:15.351263  4598 acceptor_pool.cc:254] collecting diagnostics on the listening RPC socket 0.0.0.0:39507 every 8 connection(s)
I20260923 19:40:15.351502  4140 rpc-test.cc:1846] Connecting to 0.0.0.0:39507
I20260923 19:40:17.616508  4140 rpc-test.cc:1859] Sending 1024MB via ssl-enabled tcp socket: real 2.255s	user 2.398s	sys 1.569s
I20260923 19:40:19.958495  4140 rpc-test.cc:1859] Sending 1024MB via ssl-enabled tcp socket: real 2.342s	user 2.675s	sys 1.447s
I20260923 19:40:22.180112  4140 rpc-test.cc:1859] Sending 1024MB via ssl-enabled tcp socket: real 2.222s	user 2.400s	sys 1.479s
I20260923 19:40:24.398399  4140 rpc-test.cc:1859] Sending 1024MB via ssl-enabled tcp socket: real 2.218s	user 2.428s	sys 1.460s
I20260923 19:40:26.586432  4140 rpc-test.cc:1859] Sending 1024MB via ssl-enabled tcp socket: real 2.188s	user 2.489s	sys 1.336s
[       OK ] Parameters/TestRpc.TestPerformanceBySocketType/SSL_TCP (11270 ms)
[----------] 20 tests from Parameters/TestRpc (35534 ms total)

[----------] 1 test from Parameters/TestRpcSocketTxRxQueue
[ RUN      ] Parameters/TestRpcSocketTxRxQueue.OverCapacity/0
W20260923 19:40:26.856351  4613 negotiation.cc:337] Failed RPC negotiation. Trace:
0923 19:40:26.590366 (+     0us) reactor.cc:625] Submitting negotiation task for client connection to 0.0.0.0:36617 (local address 127.0.0.1:36156)
0923 19:40:26.590450 (+    84us) negotiation.cc:107] Waiting for socket to connect
0923 19:40:26.590464 (+    14us) client_negotiation.cc:174] Beginning negotiation
0923 19:40:26.590559 (+    95us) client_negotiation.cc:252] Sending NEGOTIATE NegotiatePB request
0923 19:40:26.856156 (+265597us) negotiation.cc:327] Negotiation complete: Network error: Client connection negotiation failed: client connection to 0.0.0.0:36617: BlockingRecv error: recv error from unknown peer: Transport endpoint is not connected (error 107)
Metrics: {"client-negotiator.queue_time_us":25}
W20260923 19:40:26.856351  4641 negotiation.cc:337] Failed RPC negotiation. Trace:
0923 19:40:26.593846 (+     0us) reactor.cc:625] Submitting negotiation task for client connection to 0.0.0.0:36617 (local address 127.0.0.1:36186)
0923 19:40:26.593950 (+   104us) negotiation.cc:107] Waiting for socket to connect
0923 19:40:26.593961 (+    11us) client_negotiation.cc:174] Beginning negotiation
0923 19:40:26.594044 (+    83us) client_negotiation.cc:252] Sending NEGOTIATE NegotiatePB request
0923 19:40:26.856156 (+262112us) negotiation.cc:327] Negotiation complete: Network error: Client connection negotiation failed: client connection to 0.0.0.0:36617: BlockingRecv error: recv error from unknown peer: Transport endpoint is not connected (error 107)
Metrics: {"client-negotiator.queue_time_us":45}
W20260923 19:40:26.856359  4632 negotiation.cc:337] Failed RPC negotiation. Trace:
0923 19:40:26.592615 (+     0us) reactor.cc:625] Submitting negotiation task for client connection to 0.0.0.0:36617 (local address 127.0.0.1:36180)
0923 19:40:26.592764 (+   149us) negotiation.cc:107] Waiting for socket to connect
0923 19:40:26.592775 (+    11us) client_negotiation.cc:174] Beginning negotiation
0923 19:40:26.592852 (+    77us) client_negotiation.cc:252] Sending NEGOTIATE NegotiatePB request
0923 19:40:26.856187 (+263335us) negotiation.cc:327] Negotiation complete: Network error: Client connection negotiation failed: client connection to 0.0.0.0:36617: BlockingRecv error: recv error from unknown peer: Transport endpoint is not connected (error 107)
Metrics: {"client-negotiator.queue_time_us":81}
W20260923 19:40:26.856359  4623 negotiation.cc:337] Failed RPC negotiation. Trace:
0923 19:40:26.591525 (+     0us) reactor.cc:625] Submitting negotiation task for client connection to 0.0.0.0:36617 (local address 127.0.0.1:36170)
0923 19:40:26.591626 (+   101us) negotiation.cc:107] Waiting for socket to connect
0923 19:40:26.591638 (+    12us) client_negotiation.cc:174] Beginning negotiation
0923 19:40:26.591718 (+    80us) client_negotiation.cc:252] Sending NEGOTIATE NegotiatePB request
0923 19:40:26.856176 (+264458us) negotiation.cc:327] Negotiation complete: Network error: Client connection negotiation failed: client connection to 0.0.0.0:36617: BlockingRecv error: recv error from unknown peer: Transport endpoint is not connected (error 107)
Metrics: {"client-negotiator.queue_time_us":39}
W20260923 19:40:26.856851  4650 negotiation.cc:337] Failed RPC negotiation. Trace:
0923 19:40:26.594849 (+     0us) reactor.cc:625] Submitting negotiation task for client connection to 0.0.0.0:36617 (local address 127.0.0.1:36194)
0923 19:40:26.594926 (+    77us) negotiation.cc:107] Waiting for socket to connect
0923 19:40:26.594936 (+    10us) client_negotiation.cc:174] Beginning negotiation
0923 19:40:26.595008 (+    72us) client_negotiation.cc:252] Sending NEGOTIATE NegotiatePB request
0923 19:40:26.856456 (+261448us) negotiation.cc:327] Negotiation complete: Network error: Client connection negotiation failed: client connection to 0.0.0.0:36617: BlockingRecv error: recv error from unknown peer: Transport endpoint is not connected (error 107)
Metrics: {"client-negotiator.queue_time_us":25}
W20260923 19:40:26.856987  4659 negotiation.cc:337] Failed RPC negotiation. Trace:
0923 19:40:26.595887 (+     0us) reactor.cc:625] Submitting negotiation task for client connection to 0.0.0.0:36617 (local address 127.0.0.1:36210)
0923 19:40:26.595968 (+    81us) negotiation.cc:107] Waiting for socket to connect
0923 19:40:26.595977 (+     9us) client_negotiation.cc:174] Beginning negotiation
0923 19:40:26.596049 (+    72us) client_negotiation.cc:252] Sending NEGOTIATE NegotiatePB request
0923 19:40:26.856461 (+260412us) negotiation.cc:327] Negotiation complete: Network error: Client connection negotiation failed: client connection to 0.0.0.0:36617: BlockingRecv error: recv error from unknown peer: Transport endpoint is not connected (error 107)
Metrics: {"client-negotiator.queue_time_us":25}
[       OK ] Parameters/TestRpcSocketTxRxQueue.OverCapacity/0 (1033 ms)
[----------] 1 test from Parameters/TestRpcSocketTxRxQueue (1033 ms total)

[----------] Global test environment tear-down
[==========] 21 tests from 2 test suites ran. (36568 ms total)
[  PASSED  ] 20 tests.
[  FAILED  ] 1 test, listed below:
[  FAILED  ] Parameters/TestRpc.TestCallWithChainCertAndChainCA/SSL_TCP, where GetParam() = (true, false)

 1 FAILED TEST