Parameters/TestRpc.TestCallWithChainCertAndRootCA/SSL_TCP: /data0/somelongdirectorytoavoidrpathissues/src/kudu/src/kudu/rpc/rpc-test.cc:303: Failure
Failed
Bad status: Runtime error: could not verify certificate chain (error with cert: subject=CN = localhost, ST = sadfjas, C = AS, emailAddress = sdflkdsajf, O = lskdfjlsad, OU = sldfkja, issuer=C = AS, ST = ASDfkjdhf, L = lskdjf, O = saldfja, OU = skdjf, CN = localhost, emailAddress = sadjflkadsj): : certificate has expired
Google Test trace:
/data0/somelongdirectorytoavoidrpathissues/src/kudu/src/kudu/rpc/rpc-test.cc:300: Connecting to 0.0.0.0:36697
I20260927 23:31:19.370795 8699 test_util.cc:175] -----------------------------------------------
I20260927 23:31:19.370967 8699 test_util.cc:176] Had fatal failures, leaving test files at /tmp/dist-test-taskConU9q/test-tmp/rpc-test.1.Parameters_TestRpc.TestCallWithChainCertAndRootCA_SSL_TCP.1790551877822383-8699-0
Note: This is test shard 2 of 8.
[==========] Running 21 tests from 2 test suites.
[----------] Global test environment set-up.
[----------] 1 test from TestRpc
[ RUN ] TestRpc.TestMethodsByName
[ OK ] TestRpc.TestMethodsByName (6 ms)
[----------] 1 test from TestRpc (6 ms total)
[----------] 20 tests from Parameters/TestRpc
[ RUN ] Parameters/TestRpc.TestAcceptorPoolStartStop/SSL_TCP
WARNING: Logging before InitGoogleLogging() is written to STDERR
I20260927 23:31:17.951887 8714 acceptor_pool.cc:254] collecting diagnostics on the listening RPC socket 0.0.0.0:39353 every 8 connection(s)
I20260927 23:31:17.953712 8715 acceptor_pool.cc:254] collecting diagnostics on the listening RPC socket 0.0.0.0:39353 every 8 connection(s)
W20260927 23:31:18.954352 8699 thread.cc:536] Waited for 1000ms trying to join with acceptor (tid 8715)
I20260927 23:31:19.105917 8726 acceptor_pool.cc:254] collecting diagnostics on the listening RPC socket 0.0.0.0:33203 every 8 connection(s)
I20260927 23:31:19.107470 8727 acceptor_pool.cc:254] collecting diagnostics on the listening RPC socket 0.0.0.0:33203 every 8 connection(s)
I20260927 23:31:19.138653 8737 acceptor_pool.cc:254] collecting diagnostics on the listening RPC socket 0.0.0.0:39569 every 8 connection(s)
I20260927 23:31:19.140096 8738 acceptor_pool.cc:254] collecting diagnostics on the listening RPC socket 0.0.0.0:39569 every 8 connection(s)
I20260927 23:31:19.163076 8748 acceptor_pool.cc:254] collecting diagnostics on the listening RPC socket 0.0.0.0:43569 every 8 connection(s)
I20260927 23:31:19.163805 8749 acceptor_pool.cc:254] collecting diagnostics on the listening RPC socket 0.0.0.0:43569 every 8 connection(s)
I20260927 23:31:19.203679 8759 acceptor_pool.cc:254] collecting diagnostics on the listening RPC socket 0.0.0.0:38175 every 8 connection(s)
I20260927 23:31:19.204401 8760 acceptor_pool.cc:254] collecting diagnostics on the listening RPC socket 0.0.0.0:38175 every 8 connection(s)
[ OK ] Parameters/TestRpc.TestAcceptorPoolStartStop/SSL_TCP (1320 ms)
[ RUN ] Parameters/TestRpc.TestCall/SSL_TCP
I20260927 23:31:19.223860 8772 acceptor_pool.cc:254] collecting diagnostics on the listening RPC socket 0.0.0.0:34951 every 8 connection(s)
I20260927 23:31:19.226123 8773 acceptor_pool.cc:254] collecting diagnostics on the listening RPC socket 0.0.0.0:34951 every 8 connection(s)
I20260927 23:31:19.231115 8699 rpc-test.cc:234] Connecting to 0.0.0.0:34951
[ OK ] Parameters/TestRpc.TestCall/SSL_TCP (125 ms)
[ RUN ] Parameters/TestRpc.TestCallWithChainCertAndRootCA/SSL_TCP
I20260927 23:31:19.350237 8797 acceptor_pool.cc:254] collecting diagnostics on the listening RPC socket 0.0.0.0:36697 every 8 connection(s)
I20260927 23:31:19.350996 8798 acceptor_pool.cc:254] collecting diagnostics on the listening RPC socket 0.0.0.0:36697 every 8 connection(s)
/data0/somelongdirectorytoavoidrpathissues/src/kudu/src/kudu/rpc/rpc-test.cc:303: Failure
Failed
Bad status: Runtime error: could not verify certificate chain (error with cert: subject=CN = localhost, ST = sadfjas, C = AS, emailAddress = sdflkdsajf, O = lskdfjlsad, OU = sldfkja, issuer=C = AS, ST = ASDfkjdhf, L = lskdjf, O = saldfja, OU = skdjf, CN = localhost, emailAddress = sadjflkadsj): : certificate has expired
Google Test trace:
/data0/somelongdirectorytoavoidrpathissues/src/kudu/src/kudu/rpc/rpc-test.cc:300: Connecting to 0.0.0.0:36697
I20260927 23:31:19.370795 8699 test_util.cc:175] -----------------------------------------------
I20260927 23:31:19.370967 8699 test_util.cc:176] Had fatal failures, leaving test files at /tmp/dist-test-taskConU9q/test-tmp/rpc-test.1.Parameters_TestRpc.TestCallWithChainCertAndRootCA_SSL_TCP.1790551877822383-8699-0
[ FAILED ] Parameters/TestRpc.TestCallWithChainCertAndRootCA/SSL_TCP, where GetParam() = (true, false) (36 ms)
[ RUN ] Parameters/TestRpc.TestCallWithBadPasswordProtectedKey/SSL_TCP
[ OK ] Parameters/TestRpc.TestCallWithBadPasswordProtectedKey/SSL_TCP (30 ms)
[ RUN ] Parameters/TestRpc.TestInvalidMethodCall/SSL_TCP
I20260927 23:31:19.442231 8834 acceptor_pool.cc:254] collecting diagnostics on the listening RPC socket 0.0.0.0:39933 every 8 connection(s)
I20260927 23:31:19.443059 8835 acceptor_pool.cc:254] collecting diagnostics on the listening RPC socket 0.0.0.0:39933 every 8 connection(s)
I20260927 23:31:19.447393 8699 rpc-test.cc:406] Connecting to 0.0.0.0:39933
[ OK ] Parameters/TestRpc.TestInvalidMethodCall/SSL_TCP (83 ms)
[ RUN ] Parameters/TestRpc.TestHighFDs/SSL_TCP
I20260927 23:31:19.745189 8859 acceptor_pool.cc:254] collecting diagnostics on the listening RPC socket 0.0.0.0:42379 every 8 connection(s)
I20260927 23:31:19.745944 8860 acceptor_pool.cc:254] collecting diagnostics on the listening RPC socket 0.0.0.0:42379 every 8 connection(s)
[ OK ] Parameters/TestRpc.TestHighFDs/SSL_TCP (330 ms)
[ RUN ] Parameters/TestRpc.TestConnectionAlwaysKeepalive/SSL_TCP
I20260927 23:31:19.834769 8882 acceptor_pool.cc:254] collecting diagnostics on the listening RPC socket 0.0.0.0:40559 every 8 connection(s)
I20260927 23:31:19.835506 8883 acceptor_pool.cc:254] collecting diagnostics on the listening RPC socket 0.0.0.0:40559 every 8 connection(s)
I20260927 23:31:19.838639 8699 rpc-test.cc:532] Connecting to 0.0.0.0:40559
[ OK ] Parameters/TestRpc.TestConnectionAlwaysKeepalive/SSL_TCP (3091 ms)
[ RUN ] Parameters/TestRpc.TestReopenOutboundConnections/SSL_TCP
I20260927 23:31:22.949812 8905 acceptor_pool.cc:254] collecting diagnostics on the listening RPC socket 0.0.0.0:43235 every 8 connection(s)
I20260927 23:31:22.950673 8906 acceptor_pool.cc:254] collecting diagnostics on the listening RPC socket 0.0.0.0:43235 every 8 connection(s)
I20260927 23:31:22.953670 8699 rpc-test.cc:658] Connecting to 0.0.0.0:43235
[ OK ] Parameters/TestRpc.TestReopenOutboundConnections/SSL_TCP (394 ms)
[ RUN ] Parameters/TestRpc.TestConnectionNetworkPlane/SSL_TCP
I20260927 23:31:23.323203 8928 acceptor_pool.cc:254] collecting diagnostics on the listening RPC socket 0.0.0.0:36273 every 8 connection(s)
I20260927 23:31:23.323932 8929 acceptor_pool.cc:254] collecting diagnostics on the listening RPC socket 0.0.0.0:36273 every 8 connection(s)
I20260927 23:31:23.327077 8699 rpc-test.cc:772] Connecting to 0.0.0.0:36273
[ OK ] Parameters/TestRpc.TestConnectionNetworkPlane/SSL_TCP (82 ms)
[ RUN ] Parameters/TestRpc.TestTCPKeepalive/SSL_TCP
I20260927 23:31:23.413511 8953 acceptor_pool.cc:254] collecting diagnostics on the listening RPC socket 0.0.0.0:34205 every 8 connection(s)
I20260927 23:31:23.414280 8954 acceptor_pool.cc:254] collecting diagnostics on the listening RPC socket 0.0.0.0:34205 every 8 connection(s)
I20260927 23:31:23.452764 8957 rpc-test-base.h:222] got call: sleep_micros: 8000000 deferred: true
I20260927 23:31:31.456872 8957 rpcz_store.cc:275] Call kudu.rpc.GenericCalculatorService.Sleep from 127.0.0.1:43074 (request call id 0) took 8004 ms. Trace:
I20260927 23:31:31.457337 8957 rpcz_store.cc:276] 0927 23:31:23.452461 (+ 0us) service_pool.cc:170] Inserting onto call queue
0927 23:31:23.452602 (+ 141us) service_pool.cc:227] Handling call
0927 23:31:31.456706 (+8004104us) inbound_call.cc:173] Queueing success response
Metrics: {}
[ OK ] Parameters/TestRpc.TestTCPKeepalive/SSL_TCP (8085 ms)
[ RUN ] Parameters/TestRpc.TestMaxSmallSidecars/SSL_TCP
I20260927 23:31:31.498945 8979 acceptor_pool.cc:254] collecting diagnostics on the listening RPC socket 0.0.0.0:38111 every 8 connection(s)
I20260927 23:31:31.499738 8980 acceptor_pool.cc:254] collecting diagnostics on the listening RPC socket 0.0.0.0:38111 every 8 connection(s)
[ OK ] Parameters/TestRpc.TestMaxSmallSidecars/SSL_TCP (201 ms)
[ RUN ] Parameters/TestRpc.TestCallTimeout/SSL_TCP
I20260927 23:31:31.691577 9004 acceptor_pool.cc:254] collecting diagnostics on the listening RPC socket 0.0.0.0:45695 every 8 connection(s)
I20260927 23:31:31.692234 9005 acceptor_pool.cc:254] collecting diagnostics on the listening RPC socket 0.0.0.0:45695 every 8 connection(s)
I20260927 23:31:31.716920 8699 rpc-test-base.h:595] status: Timed out: connection negotiation to 0.0.0.0:45695 for RPC Sleep timed out after 0.000s (ON_OUTBOUND_QUEUE), seconds elapsed: 0.00249195
I20260927 23:31:31.724382 9008 rpc-test-base.h:222] got call: sleep_micros: 700000
I20260927 23:31:31.918188 8699 rpc-test-base.h:595] status: Timed out: Sleep RPC to 0.0.0.0:45695 timed out after 0.200s (SENT), seconds elapsed: 0.200807
I20260927 23:31:31.919701 9007 rpc-test-base.h:222] got call: sleep_micros: 2000000
W20260927 23:31:32.425053 9008 rpcz_store.cc:267] Call kudu.rpc.GenericCalculatorService.Sleep from 127.0.0.1:33164 (request call id 1) took 700 ms (client timeout 200 ms). Trace:
W20260927 23:31:32.425433 9008 rpcz_store.cc:269] 0927 23:31:31.724222 (+ 0us) service_pool.cc:170] Inserting onto call queue
0927 23:31:31.724325 (+ 103us) service_pool.cc:227] Handling call
0927 23:31:32.424987 (+700662us) inbound_call.cc:173] Queueing success response
Metrics: {}
I20260927 23:31:33.420845 8699 rpc-test-base.h:595] status: Timed out: Sleep RPC to 0.0.0.0:45695 timed out after 1.500s (SENT), seconds elapsed: 1.50234
W20260927 23:31:33.920307 9007 rpcz_store.cc:267] Call kudu.rpc.GenericCalculatorService.Sleep from 127.0.0.1:33164 (request call id 2) took 2000 ms (client timeout 1500 ms). Trace:
W20260927 23:31:33.920612 9007 rpcz_store.cc:269] 0927 23:31:31.919393 (+ 0us) service_pool.cc:170] Inserting onto call queue
0927 23:31:31.919535 (+ 142us) service_pool.cc:227] Handling call
0927 23:31:33.920240 (+2000705us) inbound_call.cc:173] Queueing success response
Metrics: {}
W20260927 23:31:33.921137 9001 connection.cc:441] server connection from 127.0.0.1:33164 torn down before Call kudu.rpc.GenericCalculatorService.Sleep from 127.0.0.1:33164 (request call id 2) could send its response
[ OK ] Parameters/TestRpc.TestCallTimeout/SSL_TCP (2255 ms)
[ RUN ] Parameters/TestRpc.TestServerShutsDown/SSL_TCP
I20260927 23:31:33.929704 8699 rpc-test.cc:1125] Connecting to 0.0.0.0:36477
W20260927 23:31:33.939260 9021 negotiation.cc:337] Failed RPC negotiation. Trace:
0927 23:31:33.937654 (+ 0us) reactor.cc:625] Submitting negotiation task for client connection to 0.0.0.0:36477 (local address 127.0.0.1:54936)
0927 23:31:33.938167 (+ 513us) negotiation.cc:107] Waiting for socket to connect
0927 23:31:33.938198 (+ 31us) client_negotiation.cc:174] Beginning negotiation
0927 23:31:33.938422 (+ 224us) client_negotiation.cc:252] Sending NEGOTIATE NegotiatePB request
0927 23:31:33.938647 (+ 225us) negotiation.cc:327] Negotiation complete: Network error: Client connection negotiation failed: client connection to 0.0.0.0:36477: BlockingWrite error: write error: Broken pipe (error 32)
Metrics: {"client-negotiator.queue_time_us":120}
[ OK ] Parameters/TestRpc.TestServerShutsDown/SSL_TCP (14 ms)
[ RUN ] Parameters/TestRpc.TimedOutOnResponseMetric/SSL_TCP
I20260927 23:31:33.974314 9038 acceptor_pool.cc:254] collecting diagnostics on the listening RPC socket 0.0.0.0:37505 every 8 connection(s)
I20260927 23:31:33.975018 9039 acceptor_pool.cc:254] collecting diagnostics on the listening RPC socket 0.0.0.0:37505 every 8 connection(s)
W20260927 23:31:34.218791 9042 rpcz_store.cc:267] Call kudu.rpc_test.CalculatorService.Sleep from 127.0.0.1:55812 (request call id 3) took 50 ms (client timeout 25 ms). Trace:
W20260927 23:31:34.219105 9042 rpcz_store.cc:269] 0927 23:31:34.168187 (+ 0us) service_pool.cc:170] Inserting onto call queue
0927 23:31:34.168290 (+ 103us) service_pool.cc:227] Handling call
0927 23:31:34.218707 (+ 50417us) inbound_call.cc:173] Queueing success response
Related trace 'test_child':
Metrics: {"test_sleep_us":50000,"child_traces":[["test_child",{"related_trace_metric":1}]]}
W20260927 23:31:34.278347 9042 rpcz_store.cc:267] Call kudu.rpc_test.CalculatorService.Sleep from 127.0.0.1:55812 (request call id 4) took 50 ms (client timeout 50 ms). Trace:
W20260927 23:31:34.278635 9042 rpcz_store.cc:269] 0927 23:31:34.227808 (+ 0us) service_pool.cc:170] Inserting onto call queue
0927 23:31:34.227919 (+ 111us) service_pool.cc:227] Handling call
0927 23:31:34.278282 (+ 50363us) inbound_call.cc:173] Queueing success response
Related trace 'test_child':
Metrics: {"test_sleep_us":50000,"child_traces":[["test_child",{"related_trace_metric":1}]]}
[ OK ] Parameters/TestRpc.TimedOutOnResponseMetric/SSL_TCP (344 ms)
[ RUN ] Parameters/TestRpc.AcceptorDispatchingTimesMetric/SSL_TCP
I20260927 23:31:34.297940 9063 acceptor_pool.cc:254] collecting diagnostics on the listening RPC socket 0.0.0.0:42421 every 8 connection(s)
I20260927 23:31:34.298593 9064 acceptor_pool.cc:254] collecting diagnostics on the listening RPC socket 0.0.0.0:42421 every 8 connection(s)
W20260927 23:31:34.303403 9059 negotiation.cc:337] Failed RPC negotiation. Trace:
0927 23:31:34.302212 (+ 0us) reactor.cc:625] Submitting negotiation task for server connection from 127.0.0.1:59466 (local address 127.0.0.1:42421)
0927 23:31:34.302643 (+ 431us) server_negotiation.cc:206] Beginning negotiation
0927 23:31:34.302704 (+ 61us) server_negotiation.cc:399] Waiting for connection header
0927 23:31:34.302955 (+ 251us) negotiation.cc:327] Negotiation complete: Network error: Server connection negotiation failed: server connection from 127.0.0.1:59466: BlockingRecv error: recv got EOF from 127.0.0.1:59466 (error 108)
Metrics: {"server-negotiator.queue_time_us":133}
[ OK ] Parameters/TestRpc.AcceptorDispatchingTimesMetric/SSL_TCP (21 ms)
[ RUN ] Parameters/TestRpc.TestRpcCallbackDestroysMessenger/SSL_TCP
[ OK ] Parameters/TestRpc.TestRpcCallbackDestroysMessenger/SSL_TCP (30 ms)
[ RUN ] Parameters/TestRpc.TestApplicationFeatureFlag/SSL_TCP
I20260927 23:31:34.378618 9088 acceptor_pool.cc:254] collecting diagnostics on the listening RPC socket 0.0.0.0:35053 every 8 connection(s)
I20260927 23:31:34.379390 9089 acceptor_pool.cc:254] collecting diagnostics on the listening RPC socket 0.0.0.0:35053 every 8 connection(s)
W20260927 23:31:34.410560 9085 messenger.cc:357] Unable to handle RPC call: Not implemented: call requires unsupported application feature flags: 99
[ OK ] Parameters/TestRpc.TestApplicationFeatureFlag/SSL_TCP (79 ms)
[ RUN ] Parameters/TestRpc.TestCancellation/SSL_TCP
I20260927 23:31:34.455040 9113 acceptor_pool.cc:254] collecting diagnostics on the listening RPC socket 0.0.0.0:36751 every 8 connection(s)
I20260927 23:31:34.455791 9114 acceptor_pool.cc:254] collecting diagnostics on the listening RPC socket 0.0.0.0:36751 every 8 connection(s)
I20260927 23:31:34.459126 8699 rpc-test.cc:1648] Connecting to 0.0.0.0:36751
I20260927 23:31:34.570910 8699 rpc-test-base.h:595] status: Aborted: Sleep RPC to 0.0.0.0:36751 is cancelled in state READY, seconds elapsed: 0.000432663
I20260927 23:31:34.708659 8699 rpc-test-base.h:595] status: Aborted: Sleep RPC to 0.0.0.0:36751 is cancelled in state SENT, seconds elapsed: 0.000834105
I20260927 23:31:34.750983 9116 rpc-test-base.h:222] got call: sleep_micros: 510000
I20260927 23:31:34.877081 8699 rpc-test-base.h:595] status: Aborted: Sleep RPC to 0.0.0.0:36751 is cancelled in state SENT, seconds elapsed: 0.000807276
I20260927 23:31:34.918099 9115 rpc-test-base.h:222] got call: sleep_micros: 510000
I20260927 23:31:35.044298 8699 rpc-test-base.h:595] status: Aborted: Sleep RPC to 0.0.0.0:36751 is cancelled in state SENT, seconds elapsed: 0.000873625
W20260927 23:31:35.085085 9117 rpcz_store.cc:267] Call kudu.rpc.GenericCalculatorService.Sleep from 127.0.0.1:52576 (request call id 11) took 14 ms (client timeout 10 ms). Trace:
W20260927 23:31:35.085441 9117 rpcz_store.cc:269] 0927 23:31:35.070050 (+ 0us) service_pool.cc:170] Inserting onto call queue
0927 23:31:35.084777 (+ 14727us) service_pool.cc:214] Skipping call since client already timed out
0927 23:31:35.084906 (+ 129us) inbound_call.cc:173] Queueing failure response
Metrics: {}
I20260927 23:31:35.086030 9117 rpc-test-base.h:222] got call: sleep_micros: 1500000
W20260927 23:31:35.261719 9116 rpcz_store.cc:267] Call kudu.rpc.GenericCalculatorService.Sleep from 127.0.0.1:52576 (request call id 3) took 511 ms (client timeout 10 ms). Trace:
W20260927 23:31:35.262100 9116 rpcz_store.cc:269] 0927 23:31:34.750770 (+ 0us) service_pool.cc:170] Inserting onto call queue
0927 23:31:34.750907 (+ 137us) service_pool.cc:227] Handling call
0927 23:31:35.261661 (+510754us) inbound_call.cc:173] Queueing success response
Metrics: {}
W20260927 23:31:35.428696 9115 rpcz_store.cc:267] Call kudu.rpc.GenericCalculatorService.Sleep from 127.0.0.1:52576 (request call id 7) took 512 ms (client timeout 10 ms). Trace:
W20260927 23:31:35.429014 9115 rpcz_store.cc:269] 0927 23:31:34.916477 (+ 0us) service_pool.cc:170] Inserting onto call queue
0927 23:31:34.918046 (+ 1569us) service_pool.cc:227] Handling call
0927 23:31:35.428640 (+510594us) inbound_call.cc:173] Queueing success response
Metrics: {}
I20260927 23:31:36.046111 8699 rpc-test-base.h:595] status: Timed out: Sleep RPC to 0.0.0.0:36751 timed out after 1.000s (SENT), seconds elapsed: 1.0014
I20260927 23:31:36.047397 9115 rpc-test-base.h:222] got call: sleep_micros: 1500000
W20260927 23:31:36.586566 9117 rpcz_store.cc:267] Call kudu.rpc.GenericCalculatorService.Sleep from 127.0.0.1:52576 (request call id 12) took 1516 ms (client timeout 1000 ms). Trace:
W20260927 23:31:36.586894 9117 rpcz_store.cc:269] 0927 23:31:35.070406 (+ 0us) service_pool.cc:170] Inserting onto call queue
0927 23:31:35.085990 (+ 15584us) service_pool.cc:227] Handling call
0927 23:31:36.586514 (+1500524us) inbound_call.cc:173] Queueing success response
Metrics: {}
I20260927 23:31:37.048123 8699 rpc-test-base.h:595] status: Timed out: Sleep RPC to 0.0.0.0:36751 timed out after 1.000s (SENT), seconds elapsed: 1.00171
W20260927 23:31:37.049575 9112 messenger.cc:357] Unable to handle RPC call: Not implemented: call requires unsupported application feature flags: 99, 1
W20260927 23:31:37.051096 9112 messenger.cc:357] Unable to handle RPC call: Not implemented: call requires unsupported application feature flags: 99, 1
W20260927 23:31:37.547881 9115 rpcz_store.cc:267] Call kudu.rpc.GenericCalculatorService.Sleep from 127.0.0.1:52576 (request call id 13) took 1500 ms (client timeout 1000 ms). Trace:
W20260927 23:31:37.548197 9115 rpcz_store.cc:269] 0927 23:31:36.047199 (+ 0us) service_pool.cc:170] Inserting onto call queue
0927 23:31:36.047340 (+ 141us) service_pool.cc:227] Handling call
0927 23:31:37.547822 (+1500482us) inbound_call.cc:173] Queueing success response
Metrics: {}
W20260927 23:31:37.548729 9112 connection.cc:441] server connection from 127.0.0.1:52576 torn down before Call kudu.rpc.GenericCalculatorService.Sleep from 127.0.0.1:52576 (request call id 13) could send its response
[ OK ] Parameters/TestRpc.TestCancellation/SSL_TCP (3136 ms)
[ RUN ] Parameters/TestRpc.TestCancellationMultiThreads/SSL_TCP
I20260927 23:31:37.585299 9138 acceptor_pool.cc:254] collecting diagnostics on the listening RPC socket 0.0.0.0:37729 every 8 connection(s)
I20260927 23:31:37.586019 9139 acceptor_pool.cc:254] collecting diagnostics on the listening RPC socket 0.0.0.0:37729 every 8 connection(s)
I20260927 23:31:37.589237 8699 rpc-test.cc:1808] Connecting to 0.0.0.0:37729
I20260927 23:31:37.739390 9152 test_util.cc:268] Using random seed: 1506873438
I20260927 23:31:37.740490 9153 test_util.cc:268] Using random seed: 1506874545
I20260927 23:31:37.741878 9154 test_util.cc:268] Using random seed: 1506875931
I20260927 23:31:37.743245 9155 test_util.cc:268] Using random seed: 1506877278
I20260927 23:31:37.744980 9156 test_util.cc:268] Using random seed: 1506878875
I20260927 23:31:37.746397 9157 test_util.cc:268] Using random seed: 1506880323
I20260927 23:31:37.748025 9158 test_util.cc:268] Using random seed: 1506881936
I20260927 23:31:37.750000 9159 test_util.cc:268] Using random seed: 1506883894
I20260927 23:31:37.751682 9160 test_util.cc:268] Using random seed: 1506885574
I20260927 23:31:37.753014 9161 test_util.cc:268] Using random seed: 1506886927
I20260927 23:31:37.754678 9162 test_util.cc:268] Using random seed: 1506888554
I20260927 23:31:37.756464 9163 test_util.cc:268] Using random seed: 1506890325
I20260927 23:31:37.758425 9164 test_util.cc:268] Using random seed: 1506892266
I20260927 23:31:37.760224 9165 test_util.cc:268] Using random seed: 1506894066
I20260927 23:31:37.762411 9166 test_util.cc:268] Using random seed: 1506896276
I20260927 23:31:37.764458 9167 test_util.cc:268] Using random seed: 1506898294
I20260927 23:31:37.766402 9168 test_util.cc:268] Using random seed: 1506900293
I20260927 23:31:37.770856 9169 test_util.cc:268] Using random seed: 1506904681
I20260927 23:31:37.772675 9170 test_util.cc:268] Using random seed: 1506906562
I20260927 23:31:37.774609 9171 test_util.cc:268] Using random seed: 1506908466
I20260927 23:31:37.777137 9172 test_util.cc:268] Using random seed: 1506911024
I20260927 23:31:37.779202 9173 test_util.cc:268] Using random seed: 1506913033
I20260927 23:31:37.780818 9174 test_util.cc:268] Using random seed: 1506914718
I20260927 23:31:37.783152 9175 test_util.cc:268] Using random seed: 1506917036
I20260927 23:31:37.784904 9176 test_util.cc:268] Using random seed: 1506918803
I20260927 23:31:37.786820 9177 test_util.cc:268] Using random seed: 1506920661
I20260927 23:31:37.788597 9178 test_util.cc:268] Using random seed: 1506922489
I20260927 23:31:37.790592 9179 test_util.cc:268] Using random seed: 1506924509
I20260927 23:31:37.792469 9180 test_util.cc:268] Using random seed: 1506926380
I20260927 23:31:37.794162 9181 test_util.cc:268] Using random seed: 1506928075
[ OK ] Parameters/TestRpc.TestCancellationMultiThreads/SSL_TCP (17772 ms)
[ RUN ] Parameters/TestRpc.TestCallId/SSL_TCP
I20260927 23:31:55.356683 9195 acceptor_pool.cc:254] collecting diagnostics on the listening RPC socket 0.0.0.0:42411 every 8 connection(s)
I20260927 23:31:55.357440 9196 acceptor_pool.cc:254] collecting diagnostics on the listening RPC socket 0.0.0.0:42411 every 8 connection(s)
[ OK ] Parameters/TestRpc.TestCallId/SSL_TCP (95 ms)
[----------] 20 tests from Parameters/TestRpc (37535 ms total)
[----------] Global test environment tear-down
[==========] 21 tests from 2 test suites ran. (37543 ms total)
[ PASSED ] 20 tests.
[ FAILED ] 1 test, listed below:
[ FAILED ] Parameters/TestRpc.TestCallWithChainCertAndRootCA/SSL_TCP, where GetParam() = (true, false)
1 FAILED TEST