Diagnosed failure
Parameters/TestRpc.TestCallWithChainCertAndChainCA/SSL_UnixSocket: /data0/somelongdirectorytoavoidrpathissues/src/kudu/src/kudu/rpc/rpc-test.cc:270: Failure
Failed
Bad status: Runtime error: could not verify certificate chain (error with cert: subject=CN = localhost, ST = sadfjas, C = AS, emailAddress = sdflkdsajf, O = lskdfjlsad, OU = sldfkja, issuer=C = AS, ST = ASDfkjdhf, L = lskdjf, O = saldfja, OU = skdjf, CN = localhost, emailAddress = sadjflkadsj): : certificate has expired
Google Test trace:
/data0/somelongdirectorytoavoidrpathissues/src/kudu/src/kudu/rpc/rpc-test.cc:267: Connecting to unix:/tmp/dist-test-taskSSMwbW/test-tmp/rpc-test-d894a23737964552841bd1cbc44a6af9.sock
I20260924 21:11:52.841776 23586 test_util.cc:175] -----------------------------------------------
I20260924 21:11:52.841830 23586 test_util.cc:176] Had fatal failures, leaving test files at /tmp/dist-test-taskSSMwbW/test-tmp/rpc-test.6.Parameters_TestRpc.TestCallWithChainCertAndChainCA_SSL_UnixSocket.1790284312754303-23586-0
Full log
Note: This is test shard 7 of 8.
[==========] Running 21 tests from 2 test suites.
[----------] Global test environment set-up.
[----------] 20 tests from Parameters/TestRpc
[ RUN ] Parameters/TestRpc.TestMessengerCreateDestroy/SSL_UnixSocket
WARNING: Logging before InitGoogleLogging() is written to STDERR
I20260924 21:11:52.780838 23586 rpc-test.cc:169] started messenger TestCreateDestroy
[ OK ] Parameters/TestRpc.TestMessengerCreateDestroy/SSL_UnixSocket (25 ms)
[ RUN ] Parameters/TestRpc.TestNegotiationDeadlock/SSL_UnixSocket
I20260924 21:11:52.816437 23606 acceptor_pool.cc:254] collecting diagnostics on the listening RPC socket unix:/tmp/dist-test-taskSSMwbW/test-tmp/rpc-test-3fbaddd715084c3a90f642ff6d1952c8.sock every 8 connection(s)
I20260924 21:11:52.816437 23607 acceptor_pool.cc:254] collecting diagnostics on the listening RPC socket unix:/tmp/dist-test-taskSSMwbW/test-tmp/rpc-test-3fbaddd715084c3a90f642ff6d1952c8.sock every 8 connection(s)
[ OK ] Parameters/TestRpc.TestNegotiationDeadlock/SSL_UnixSocket (41 ms)
[ RUN ] Parameters/TestRpc.TestCallWithChainCertAndChainCA/SSL_UnixSocket
I20260924 21:11:52.837461 23622 acceptor_pool.cc:254] collecting diagnostics on the listening RPC socket unix:/tmp/dist-test-taskSSMwbW/test-tmp/rpc-test-d894a23737964552841bd1cbc44a6af9.sock every 8 connection(s)
I20260924 21:11:52.837522 23623 acceptor_pool.cc:254] collecting diagnostics on the listening RPC socket unix:/tmp/dist-test-taskSSMwbW/test-tmp/rpc-test-d894a23737964552841bd1cbc44a6af9.sock every 8 connection(s)
/data0/somelongdirectorytoavoidrpathissues/src/kudu/src/kudu/rpc/rpc-test.cc:270: Failure
Failed
Bad status: Runtime error: could not verify certificate chain (error with cert: subject=CN = localhost, ST = sadfjas, C = AS, emailAddress = sdflkdsajf, O = lskdfjlsad, OU = sldfkja, issuer=C = AS, ST = ASDfkjdhf, L = lskdjf, O = saldfja, OU = skdjf, CN = localhost, emailAddress = sadjflkadsj): : certificate has expired
Google Test trace:
/data0/somelongdirectorytoavoidrpathissues/src/kudu/src/kudu/rpc/rpc-test.cc:267: Connecting to unix:/tmp/dist-test-taskSSMwbW/test-tmp/rpc-test-d894a23737964552841bd1cbc44a6af9.sock
I20260924 21:11:52.841776 23586 test_util.cc:175] -----------------------------------------------
I20260924 21:11:52.841830 23586 test_util.cc:176] Had fatal failures, leaving test files at /tmp/dist-test-taskSSMwbW/test-tmp/rpc-test.6.Parameters_TestRpc.TestCallWithChainCertAndChainCA_SSL_UnixSocket.1790284312754303-23586-0
[ FAILED ] Parameters/TestRpc.TestCallWithChainCertAndChainCA/SSL_UnixSocket, where GetParam() = (true, true) (18 ms)
[ RUN ] Parameters/TestRpc.TestCallWithPasswordProtectedKey/SSL_UnixSocket
I20260924 21:11:52.856703 23647 acceptor_pool.cc:254] collecting diagnostics on the listening RPC socket unix:/tmp/dist-test-taskSSMwbW/test-tmp/rpc-test-14891496378f4d0f9d2e4785759e2a9b.sock every 8 connection(s)
I20260924 21:11:52.856751 23648 acceptor_pool.cc:254] collecting diagnostics on the listening RPC socket unix:/tmp/dist-test-taskSSMwbW/test-tmp/rpc-test-14891496378f4d0f9d2e4785759e2a9b.sock every 8 connection(s)
W20260924 21:11:52.869168 23644 connection.cc:196] Error closing socket: Network error: TlsSocket::Close: Broken pipe
[ OK ] Parameters/TestRpc.TestCallWithPasswordProtectedKey/SSL_UnixSocket (28 ms)
[ RUN ] Parameters/TestRpc.TestCallToBadServer/SSL_UnixSocket
I20260924 21:11:52.881086 23586 rpc-test.cc:394] Status: Network error: Client connection negotiation failed: client connection to 0.0.0.0:0: connect: Connection refused (error 111)
I20260924 21:11:52.881382 23586 rpc-test.cc:394] Status: Network error: Client connection negotiation failed: client connection to 0.0.0.0:0: connect: Connection refused (error 111)
I20260924 21:11:52.881595 23586 rpc-test.cc:394] Status: Network error: Client connection negotiation failed: client connection to 0.0.0.0:0: connect: Connection refused (error 111)
I20260924 21:11:52.881821 23586 rpc-test.cc:394] Status: Network error: Client connection negotiation failed: client connection to 0.0.0.0:0: connect: Connection refused (error 111)
I20260924 21:11:52.882020 23586 rpc-test.cc:394] Status: Network error: Client connection negotiation failed: client connection to 0.0.0.0:0: connect: Connection refused (error 111)
[ OK ] Parameters/TestRpc.TestCallToBadServer/SSL_UnixSocket (12 ms)
[ RUN ] Parameters/TestRpc.TestWrongService/SSL_UnixSocket
I20260924 21:11:52.890044 23682 acceptor_pool.cc:254] collecting diagnostics on the listening RPC socket unix:/tmp/dist-test-taskSSMwbW/test-tmp/rpc-test-f22a08ccfe4b4c03a596c3c651780f9e.sock every 8 connection(s)
I20260924 21:11:52.890067 23683 acceptor_pool.cc:254] collecting diagnostics on the listening RPC socket unix:/tmp/dist-test-taskSSMwbW/test-tmp/rpc-test-f22a08ccfe4b4c03a596c3c651780f9e.sock every 8 connection(s)
I20260924 21:11:52.901530 23679 messenger.cc:345] service WrongServiceName not registered on TestServer
[ OK ] Parameters/TestRpc.TestWrongService/SSL_UnixSocket (20 ms)
[ RUN ] Parameters/TestRpc.TestConnectionKeepalive/SSL_UnixSocket
I20260924 21:11:52.920162 23705 acceptor_pool.cc:254] collecting diagnostics on the listening RPC socket unix:/tmp/dist-test-taskSSMwbW/test-tmp/rpc-test-2032e83b657845d7be34c2c7abe1b5dc.sock every 8 connection(s)
I20260924 21:11:52.920213 23706 acceptor_pool.cc:254] collecting diagnostics on the listening RPC socket unix:/tmp/dist-test-taskSSMwbW/test-tmp/rpc-test-2032e83b657845d7be34c2c7abe1b5dc.sock every 8 connection(s)
I20260924 21:11:52.920379 23586 rpc-test.cc:488] Connecting to unix:/tmp/dist-test-taskSSMwbW/test-tmp/rpc-test-2032e83b657845d7be34c2c7abe1b5dc.sock
W20260924 21:11:53.405180 23718 connection.cc:196] Error closing socket: Network error: TlsSocket::Close: Broken pipe
[ OK ] Parameters/TestRpc.TestConnectionKeepalive/SSL_UnixSocket (1053 ms)
[ RUN ] Parameters/TestRpc.TestClientConnectionMetrics/SSL_UnixSocket
I20260924 21:11:53.978742 23730 acceptor_pool.cc:254] collecting diagnostics on the listening RPC socket unix:/tmp/dist-test-taskSSMwbW/test-tmp/rpc-test-69e6ab9d0de04399919d45c436e0e7db.sock every 8 connection(s)
I20260924 21:11:53.978785 23731 acceptor_pool.cc:254] collecting diagnostics on the listening RPC socket unix:/tmp/dist-test-taskSSMwbW/test-tmp/rpc-test-69e6ab9d0de04399919d45c436e0e7db.sock every 8 connection(s)
I20260924 21:11:53.978962 23586 rpc-test.cc:569] Connecting to unix:/tmp/dist-test-taskSSMwbW/test-tmp/rpc-test-69e6ab9d0de04399919d45c436e0e7db.sock
W20260924 21:12:02.431195 23727 connection.cc:196] Error closing socket: Network error: TlsSocket::Close: Broken pipe
[ OK ] Parameters/TestRpc.TestClientConnectionMetrics/SSL_UnixSocket (8475 ms)
[ RUN ] Parameters/TestRpc.TestCredentialsPolicy/SSL_UnixSocket
I20260924 21:12:02.438383 23753 acceptor_pool.cc:254] collecting diagnostics on the listening RPC socket unix:/tmp/dist-test-taskSSMwbW/test-tmp/rpc-test-e2825f49674b429f8b6c5e7cde795c56.sock every 8 connection(s)
I20260924 21:12:02.438439 23754 acceptor_pool.cc:254] collecting diagnostics on the listening RPC socket unix:/tmp/dist-test-taskSSMwbW/test-tmp/rpc-test-e2825f49674b429f8b6c5e7cde795c56.sock every 8 connection(s)
I20260924 21:12:02.438609 23586 rpc-test.cc:700] Connecting to unix:/tmp/dist-test-taskSSMwbW/test-tmp/rpc-test-e2825f49674b429f8b6c5e7cde795c56.sock
W20260924 21:12:02.467310 23752 connection.cc:196] Error closing socket: Network error: TlsSocket::Close: Broken pipe
[ OK ] Parameters/TestRpc.TestCredentialsPolicy/SSL_UnixSocket (39 ms)
[ RUN ] Parameters/TestRpc.TestCallLongerThanKeepalive/SSL_UnixSocket
I20260924 21:12:02.481750 23778 acceptor_pool.cc:254] collecting diagnostics on the listening RPC socket unix:/tmp/dist-test-taskSSMwbW/test-tmp/rpc-test-d93cef708288486596eb00535d39ef1b.sock every 8 connection(s)
I20260924 21:12:02.481794 23779 acceptor_pool.cc:254] collecting diagnostics on the listening RPC socket unix:/tmp/dist-test-taskSSMwbW/test-tmp/rpc-test-d93cef708288486596eb00535d39ef1b.sock every 8 connection(s)
I20260924 21:12:02.501390 23782 rpc-test-base.h:222] got call: sleep_micros: 3000000 deferred: true
I20260924 21:12:05.502075 23782 rpcz_store.cc:275] Call kudu.rpc.GenericCalculatorService.Sleep from unix:<unnamed> (request call id 0) took 3000 ms. Trace:
I20260924 21:12:05.502190 23782 rpcz_store.cc:276] 0924 21:12:02.501331 (+ 0us) service_pool.cc:170] Inserting onto call queue
0924 21:12:02.501376 (+ 45us) service_pool.cc:227] Handling call
0924 21:12:05.502057 (+3000681us) inbound_call.cc:173] Queueing success response
Metrics: {}
[ OK ] Parameters/TestRpc.TestCallLongerThanKeepalive/SSL_UnixSocket (3032 ms)
[ RUN ] Parameters/TestRpc.TestRpcSidecar/SSL_UnixSocket
I20260924 21:12:05.515336 23803 acceptor_pool.cc:254] collecting diagnostics on the listening RPC socket unix:/tmp/dist-test-taskSSMwbW/test-tmp/rpc-test-e405050ce84044c7b818e0ab9dc0b700.sock every 8 connection(s)
I20260924 21:12:05.515403 23804 acceptor_pool.cc:254] collecting diagnostics on the listening RPC socket unix:/tmp/dist-test-taskSSMwbW/test-tmp/rpc-test-e405050ce84044c7b818e0ab9dc0b700.sock every 8 connection(s)
W20260924 21:12:05.568182 23800 connection.cc:196] Error closing socket: Network error: TlsSocket::Close: Broken pipe
[ OK ] Parameters/TestRpc.TestRpcSidecar/SSL_UnixSocket (64 ms)
[ RUN ] Parameters/TestRpc.TestRpcSidecarLimits/SSL_UnixSocket
I20260924 21:12:07.288637 23828 acceptor_pool.cc:254] collecting diagnostics on the listening RPC socket unix:/tmp/dist-test-taskSSMwbW/test-tmp/rpc-test-9d6ae74201754417b2558ed256efb835.sock every 8 connection(s)
I20260924 21:12:07.288662 23829 acceptor_pool.cc:254] collecting diagnostics on the listening RPC socket unix:/tmp/dist-test-taskSSMwbW/test-tmp/rpc-test-9d6ae74201754417b2558ed256efb835.sock every 8 connection(s)
W20260924 21:12:07.297176 23586 serialization.cc:72] Serialized kudu.rpc_test.PushStringsRequestPB (2147483654 bytes) is larger than the maximum configured RPC message size (52428800 bytes). Sending anyway, but peer may reject the data.
W20260924 21:12:07.300520 23825 connection.cc:535] server connection from unix:<unnamed> recv error: Network error: RPC frame had a length of 2147483714, but we only support messages up to 52428800 bytes long.
W20260924 21:12:07.300589 23825 connection.cc:158] shutting down server connection from unix:<unnamed> with pending inbound data: 4/2147483714 bytes received; last active 0 ns ago: status Network error: RPC frame had a length of 2147483714, but we only support messages up to 52428800 bytes long.
W20260924 21:12:07.300714 23841 connection.cc:698] client connection to unix:/tmp/dist-test-taskSSMwbW/test-tmp/rpc-test-9d6ae74201754417b2558ed256efb835.sock send error: Network error: failed to write to TLS socket: Broken pipe
W20260924 21:12:07.300866 23841 connection.cc:196] Error closing socket: Network error: TlsSocket::Close: Success
I20260924 21:12:07.309824 23853 acceptor_pool.cc:254] collecting diagnostics on the listening RPC socket unix:/tmp/dist-test-taskSSMwbW/test-tmp/rpc-test-9d6ae74201754417b2558ed256efb835.sock every 8 connection(s)
I20260924 21:12:07.309849 23854 acceptor_pool.cc:254] collecting diagnostics on the listening RPC socket unix:/tmp/dist-test-taskSSMwbW/test-tmp/rpc-test-9d6ae74201754417b2558ed256efb835.sock every 8 connection(s)
W20260924 21:12:11.802434 23850 connection.cc:577] server connection from unix:<unnamed>: received bad data: 'Corruption: Invalid packet: message had a length of 2147483710, but we only support messages up to 2147483647 bytes
'
W20260924 21:12:11.802708 23866 connection.cc:196] Error closing socket: Network error: TlsSocket::Close: Broken pipe
[ OK ] Parameters/TestRpc.TestRpcSidecarLimits/SSL_UnixSocket (6235 ms)
[ RUN ] Parameters/TestRpc.TestCallTimeoutDoesntAffectNegotiation/SSL_UnixSocket
I20260924 21:12:11.821000 23878 acceptor_pool.cc:254] collecting diagnostics on the listening RPC socket unix:/tmp/dist-test-taskSSMwbW/test-tmp/rpc-test-0ddcb50373c64816953c360e6856acc1.sock every 8 connection(s)
I20260924 21:12:11.821033 23879 acceptor_pool.cc:254] collecting diagnostics on the listening RPC socket unix:/tmp/dist-test-taskSSMwbW/test-tmp/rpc-test-0ddcb50373c64816953c360e6856acc1.sock every 8 connection(s)
W20260924 21:12:11.846264 23871 negotiation.cc:266] Injecting 500ms delay in negotiation
I20260924 21:12:11.896549 23586 rpc-test-base.h:595] status: Timed out: connection negotiation to unix:/tmp/dist-test-taskSSMwbW/test-tmp/rpc-test-0ddcb50373c64816953c360e6856acc1.sock for RPC Sleep timed out after 0.050s (ON_OUTBOUND_QUEUE), seconds elapsed: 0.0506461
W20260924 21:12:12.356462 23875 connection.cc:196] Error closing socket: Network error: TlsSocket::Close: Broken pipe
[ OK ] Parameters/TestRpc.TestCallTimeoutDoesntAffectNegotiation/SSL_UnixSocket (553 ms)
[ RUN ] Parameters/TestRpc.TestRpcHandlerLatencyMetric/SSL_UnixSocket
I20260924 21:12:12.365252 23903 acceptor_pool.cc:254] collecting diagnostics on the listening RPC socket unix:/tmp/dist-test-taskSSMwbW/test-tmp/rpc-test-e157aae37150425e9049f09734de4fc5.sock every 8 connection(s)
I20260924 21:12:12.365387 23904 acceptor_pool.cc:254] collecting diagnostics on the listening RPC socket unix:/tmp/dist-test-taskSSMwbW/test-tmp/rpc-test-e157aae37150425e9049f09734de4fc5.sock every 8 connection(s)
I20260924 21:12:12.413753 23586 rpc-test.cc:1236] Sleep() min lat: 20338
I20260924 21:12:12.413839 23586 rpc-test.cc:1237] Sleep() mean lat: 20338
I20260924 21:12:12.413865 23586 rpc-test.cc:1238] Sleep() max lat: 20338
I20260924 21:12:12.413878 23586 rpc-test.cc:1239] Sleep() #calls: 1
[ OK ] Parameters/TestRpc.TestRpcHandlerLatencyMetric/SSL_UnixSocket (57 ms)
[ RUN ] Parameters/TestRpc.TimedOutOnResponseMetricServiceQueue/SSL_UnixSocket
I20260924 21:12:12.427403 23929 acceptor_pool.cc:254] collecting diagnostics on the listening RPC socket unix:/tmp/dist-test-taskSSMwbW/test-tmp/rpc-test-92dc3f4afa9143c59ef02ec5a324c861.sock every 8 connection(s)
I20260924 21:12:12.427445 23930 acceptor_pool.cc:254] collecting diagnostics on the listening RPC socket unix:/tmp/dist-test-taskSSMwbW/test-tmp/rpc-test-92dc3f4afa9143c59ef02ec5a324c861.sock every 8 connection(s)
W20260924 21:12:12.483712 23931 rpcz_store.cc:267] Call kudu.rpc_test.CalculatorService.Sleep from unix:<unnamed> (request call id 2) took 20 ms (client timeout 20 ms). Trace:
W20260924 21:12:12.483825 23931 rpcz_store.cc:269] 0924 21:12:12.463472 (+ 0us) service_pool.cc:170] Inserting onto call queue
0924 21:12:12.483680 (+ 20208us) service_pool.cc:214] Skipping call since client already timed out
0924 21:12:12.483692 (+ 12us) inbound_call.cc:173] Queueing failure response
Metrics: {}
[ OK ] Parameters/TestRpc.TimedOutOnResponseMetricServiceQueue/SSL_UnixSocket (69 ms)
[ RUN ] Parameters/TestRpc.RpcPendingConnectionsMetric/SSL_UnixSocket
I20260924 21:12:12.487112 23952 acceptor_pool.cc:254] collecting diagnostics on the listening RPC socket 0.0.0.0:45257 every 8 connection(s)
I20260924 21:12:12.487154 23953 acceptor_pool.cc:254] collecting diagnostics on the listening RPC socket 0.0.0.0:45257 every 8 connection(s)
W20260924 21:12:12.487744 23948 negotiation.cc:337] Failed RPC negotiation. Trace:
0924 21:12:12.487561 (+ 0us) reactor.cc:625] Submitting negotiation task for server connection from 127.0.0.1:41274 (local address 127.0.0.1:45257)
0924 21:12:12.487603 (+ 42us) server_negotiation.cc:206] Beginning negotiation
0924 21:12:12.487605 (+ 2us) server_negotiation.cc:399] Waiting for connection header
0924 21:12:12.487684 (+ 79us) negotiation.cc:327] Negotiation complete: Network error: Server connection negotiation failed: server connection from 127.0.0.1:41274: BlockingRecv error: recv got EOF from 127.0.0.1:41274 (error 108)
Metrics: {"server-negotiator.queue_time_us":15}
[ OK ] Parameters/TestRpc.RpcPendingConnectionsMetric/SSL_UnixSocket (13 ms)
[ RUN ] Parameters/TestRpc.TestRpcContextClientDeadline/SSL_UnixSocket
I20260924 21:12:12.516508 23968 acceptor_pool.cc:254] collecting diagnostics on the listening RPC socket unix:/tmp/dist-test-taskSSMwbW/test-tmp/rpc-test-579e5eaff8484db6a51ea5fea815b514.sock every 8 connection(s)
I20260924 21:12:12.516548 23969 acceptor_pool.cc:254] collecting diagnostics on the listening RPC socket unix:/tmp/dist-test-taskSSMwbW/test-tmp/rpc-test-579e5eaff8484db6a51ea5fea815b514.sock every 8 connection(s)
[ OK ] Parameters/TestRpc.TestRpcContextClientDeadline/SSL_UnixSocket (53 ms)
[ RUN ] Parameters/TestRpc.TestApplicationFeatureFlagUnsupportedServer/SSL_UnixSocket
I20260924 21:12:12.563177 23993 acceptor_pool.cc:254] collecting diagnostics on the listening RPC socket unix:/tmp/dist-test-taskSSMwbW/test-tmp/rpc-test-8438258e028e4d8397ba9d383b63634a.sock every 8 connection(s)
I20260924 21:12:12.563203 23994 acceptor_pool.cc:254] collecting diagnostics on the listening RPC socket unix:/tmp/dist-test-taskSSMwbW/test-tmp/rpc-test-8438258e028e4d8397ba9d383b63634a.sock every 8 connection(s)
W20260924 21:12:12.586066 23990 connection.cc:196] Error closing socket: Network error: TlsSocket::Close: Broken pipe
[ OK ] Parameters/TestRpc.TestApplicationFeatureFlagUnsupportedServer/SSL_UnixSocket (34 ms)
[ RUN ] Parameters/TestRpc.TestCancellationAsync/SSL_UnixSocket
I20260924 21:12:12.601521 24018 acceptor_pool.cc:254] collecting diagnostics on the listening RPC socket unix:/tmp/dist-test-taskSSMwbW/test-tmp/rpc-test-5c79cd9d082a4dc3b28087f9c1dacdba.sock every 8 connection(s)
I20260924 21:12:12.601554 24019 acceptor_pool.cc:254] collecting diagnostics on the listening RPC socket unix:/tmp/dist-test-taskSSMwbW/test-tmp/rpc-test-5c79cd9d082a4dc3b28087f9c1dacdba.sock every 8 connection(s)
I20260924 21:12:12.601756 23586 rpc-test.cc:1716] Connecting to unix:/tmp/dist-test-taskSSMwbW/test-tmp/rpc-test-5c79cd9d082a4dc3b28087f9c1dacdba.sock
I20260924 21:12:12.608856 23586 test_util.cc:268] Using random seed: 229715287
I20260924 21:12:12.626077 24021 rpc-test-base.h:240] got call: sleep_micros: 500 pattern: 4294967295 num_repetitions: 2097152 sidecar_idx: 0
I20260924 21:12:12.639396 24021 rpc-test-base.h:240] got call: sleep_micros: 500 pattern: 4294967295 num_repetitions: 2097152 sidecar_idx: 0
I20260924 21:12:12.652501 24021 rpc-test-base.h:240] got call: sleep_micros: 500 pattern: 4294967295 num_repetitions: 2097152 sidecar_idx: 0
I20260924 21:12:12.666041 24021 rpc-test-base.h:240] got call: sleep_micros: 500 pattern: 4294967295 num_repetitions: 2097152 sidecar_idx: 0
I20260924 21:12:12.679342 24021 rpc-test-base.h:240] got call: sleep_micros: 500 pattern: 4294967295 num_repetitions: 2097152 sidecar_idx: 0
I20260924 21:12:12.692711 24021 rpc-test-base.h:240] got call: sleep_micros: 500 pattern: 4294967295 num_repetitions: 2097152 sidecar_idx: 0
I20260924 21:12:12.705072 24021 rpc-test-base.h:240] got call: sleep_micros: 500 pattern: 4294967295 num_repetitions: 2097152 sidecar_idx: 0
W20260924 21:12:12.706817 24015 connection.cc:196] Error closing socket: Network error: TlsSocket::Close: Broken pipe
W20260924 21:12:12.708117 24015 connection.cc:441] server connection from unix:<unnamed> torn down before Call kudu.rpc.GenericCalculatorService.SleepWithSidecar from unix:<unnamed> (request call id 9) could send its response
[ OK ] Parameters/TestRpc.TestCancellationAsync/SSL_UnixSocket (122 ms)
[ RUN ] Parameters/TestRpc.TestPerformanceBySocketType/SSL_UnixSocket
I20260924 21:12:12.738456 24043 acceptor_pool.cc:254] collecting diagnostics on the listening RPC socket unix:/tmp/dist-test-taskSSMwbW/test-tmp/rpc-test-29acb9c6a2ce4fb0b85b9c3179628f62.sock every 8 connection(s)
I20260924 21:12:12.738492 24044 acceptor_pool.cc:254] collecting diagnostics on the listening RPC socket unix:/tmp/dist-test-taskSSMwbW/test-tmp/rpc-test-29acb9c6a2ce4fb0b85b9c3179628f62.sock every 8 connection(s)
I20260924 21:12:12.738649 23586 rpc-test.cc:1846] Connecting to unix:/tmp/dist-test-taskSSMwbW/test-tmp/rpc-test-29acb9c6a2ce4fb0b85b9c3179628f62.sock
I20260924 21:12:14.054332 23586 rpc-test.cc:1859] Sending 1024MB via ssl-enabled unix socket: real 1.300s user 1.387s sys 0.957s
I20260924 21:12:15.353938 23586 rpc-test.cc:1859] Sending 1024MB via ssl-enabled unix socket: real 1.299s user 1.424s sys 0.910s
I20260924 21:12:16.671837 23586 rpc-test.cc:1859] Sending 1024MB via ssl-enabled unix socket: real 1.318s user 1.530s sys 0.843s
I20260924 21:12:17.951609 23586 rpc-test.cc:1859] Sending 1024MB via ssl-enabled unix socket: real 1.280s user 1.469s sys 0.830s
I20260924 21:12:19.266577 23586 rpc-test.cc:1859] Sending 1024MB via ssl-enabled unix socket: real 1.315s user 1.549s sys 0.820s
W20260924 21:12:19.267443 24040 connection.cc:196] Error closing socket: Network error: TlsSocket::Close: Broken pipe
[ OK ] Parameters/TestRpc.TestPerformanceBySocketType/SSL_UnixSocket (6558 ms)
[----------] 20 tests from Parameters/TestRpc (26511 ms total)
[----------] 1 test from Parameters/TestRpcSocketTxRxQueue
[ RUN ] Parameters/TestRpcSocketTxRxQueue.AcceptorRxQueueSizeMetric/0
I20260924 21:12:19.276494 24068 acceptor_pool.cc:254] collecting diagnostics on the listening RPC socket 0.0.0.0:35159 every 1 connection(s)
I20260924 21:12:19.276553 24069 acceptor_pool.cc:254] collecting diagnostics on the listening RPC socket 0.0.0.0:35159 every 1 connection(s)
W20260924 21:12:19.277087 24064 negotiation.cc:337] Failed RPC negotiation. Trace:
0924 21:12:19.276943 (+ 0us) reactor.cc:625] Submitting negotiation task for server connection from 127.0.0.1:42494 (local address 127.0.0.1:35159)
0924 21:12:19.276991 (+ 48us) server_negotiation.cc:206] Beginning negotiation
0924 21:12:19.276993 (+ 2us) server_negotiation.cc:399] Waiting for connection header
0924 21:12:19.277058 (+ 65us) negotiation.cc:327] Negotiation complete: Network error: Server connection negotiation failed: server connection from 127.0.0.1:42494: BlockingRecv error: recv got EOF from 127.0.0.1:42494 (error 108)
Metrics: {"server-negotiator.queue_time_us":15}
[ OK ] Parameters/TestRpcSocketTxRxQueue.AcceptorRxQueueSizeMetric/0 (10 ms)
[----------] 1 test from Parameters/TestRpcSocketTxRxQueue (10 ms total)
[----------] Global test environment tear-down
[==========] 21 tests from 2 test suites ran. (26522 ms total)
[ PASSED ] 20 tests.
[ FAILED ] 1 test, listed below:
[ FAILED ] Parameters/TestRpc.TestCallWithChainCertAndChainCA/SSL_UnixSocket, where GetParam() = (true, true)
1 FAILED TEST