Diagnosed failure
Parameters/TestRpc.TestCallWithChainCertAndChainCA/SSL_TCP: /data0/somelongdirectorytoavoidrpathissues/src/kudu/src/kudu/rpc/rpc-test.cc:270: Failure
Failed
Bad status: Runtime error: could not verify certificate chain (error with cert: subject=CN = localhost, ST = sadfjas, C = AS, emailAddress = sdflkdsajf, O = lskdfjlsad, OU = sldfkja, issuer=C = AS, ST = ASDfkjdhf, L = lskdjf, O = saldfja, OU = skdjf, CN = localhost, emailAddress = sadjflkadsj): : certificate has expired
Google Test trace:
/data0/somelongdirectorytoavoidrpathissues/src/kudu/src/kudu/rpc/rpc-test.cc:267: Connecting to 0.0.0.0:36375
I20260924 10:34:36.458745 1238 test_util.cc:175] -----------------------------------------------
I20260924 10:34:36.458828 1238 test_util.cc:176] Had fatal failures, leaving test files at /tmp/dist-test-tasktmFdRM/test-tmp/rpc-test.5.Parameters_TestRpc.TestCallWithChainCertAndChainCA_SSL_TCP.1790246076368440-1238-0
Full log
Note: This is test shard 6 of 8.
[==========] Running 21 tests from 2 test suites.
[----------] Global test environment set-up.
[----------] 20 tests from Parameters/TestRpc
[ RUN ] Parameters/TestRpc.TestMessengerCreateDestroy/SSL_TCP
WARNING: Logging before InitGoogleLogging() is written to STDERR
I20260924 10:34:36.405202 1238 rpc-test.cc:169] started messenger TestCreateDestroy
[ OK ] Parameters/TestRpc.TestMessengerCreateDestroy/SSL_TCP (32 ms)
[ RUN ] Parameters/TestRpc.TestNegotiationDeadlock/SSL_TCP
I20260924 10:34:36.432030 1258 acceptor_pool.cc:254] collecting diagnostics on the listening RPC socket 0.0.0.0:41137 every 8 connection(s)
I20260924 10:34:36.432030 1259 acceptor_pool.cc:254] collecting diagnostics on the listening RPC socket 0.0.0.0:41137 every 8 connection(s)
[ OK ] Parameters/TestRpc.TestNegotiationDeadlock/SSL_TCP (35 ms)
[ RUN ] Parameters/TestRpc.TestCallWithChainCertAndChainCA/SSL_TCP
I20260924 10:34:36.453444 1274 acceptor_pool.cc:254] collecting diagnostics on the listening RPC socket 0.0.0.0:36375 every 8 connection(s)
I20260924 10:34:36.453486 1275 acceptor_pool.cc:254] collecting diagnostics on the listening RPC socket 0.0.0.0:36375 every 8 connection(s)
/data0/somelongdirectorytoavoidrpathissues/src/kudu/src/kudu/rpc/rpc-test.cc:270: Failure
Failed
Bad status: Runtime error: could not verify certificate chain (error with cert: subject=CN = localhost, ST = sadfjas, C = AS, emailAddress = sdflkdsajf, O = lskdfjlsad, OU = sldfkja, issuer=C = AS, ST = ASDfkjdhf, L = lskdjf, O = saldfja, OU = skdjf, CN = localhost, emailAddress = sadjflkadsj): : certificate has expired
Google Test trace:
/data0/somelongdirectorytoavoidrpathissues/src/kudu/src/kudu/rpc/rpc-test.cc:267: Connecting to 0.0.0.0:36375
I20260924 10:34:36.458745 1238 test_util.cc:175] -----------------------------------------------
I20260924 10:34:36.458828 1238 test_util.cc:176] Had fatal failures, leaving test files at /tmp/dist-test-tasktmFdRM/test-tmp/rpc-test.5.Parameters_TestRpc.TestCallWithChainCertAndChainCA_SSL_TCP.1790246076368440-1238-0
[ FAILED ] Parameters/TestRpc.TestCallWithChainCertAndChainCA/SSL_TCP, where GetParam() = (true, false) (16 ms)
[ RUN ] Parameters/TestRpc.TestCallWithPasswordProtectedKey/SSL_TCP
I20260924 10:34:36.477604 1299 acceptor_pool.cc:254] collecting diagnostics on the listening RPC socket 0.0.0.0:34701 every 8 connection(s)
I20260924 10:34:36.477638 1300 acceptor_pool.cc:254] collecting diagnostics on the listening RPC socket 0.0.0.0:34701 every 8 connection(s)
[ OK ] Parameters/TestRpc.TestCallWithPasswordProtectedKey/SSL_TCP (33 ms)
[ RUN ] Parameters/TestRpc.TestCallToBadServer/SSL_TCP
I20260924 10:34:36.514729 1238 rpc-test.cc:394] Status: Network error: Client connection negotiation failed: client connection to 0.0.0.0:0: connect: Connection refused (error 111)
I20260924 10:34:36.515357 1238 rpc-test.cc:394] Status: Network error: Client connection negotiation failed: client connection to 0.0.0.0:0: connect: Connection refused (error 111)
I20260924 10:34:36.515821 1238 rpc-test.cc:394] Status: Network error: Client connection negotiation failed: client connection to 0.0.0.0:0: connect: Connection refused (error 111)
I20260924 10:34:36.516222 1238 rpc-test.cc:394] Status: Network error: Client connection negotiation failed: client connection to 0.0.0.0:0: connect: Connection refused (error 111)
I20260924 10:34:36.516618 1238 rpc-test.cc:394] Status: Network error: Client connection negotiation failed: client connection to 0.0.0.0:0: connect: Connection refused (error 111)
[ OK ] Parameters/TestRpc.TestCallToBadServer/SSL_TCP (25 ms)
[ RUN ] Parameters/TestRpc.TestWrongService/SSL_TCP
I20260924 10:34:36.544009 1335 acceptor_pool.cc:254] collecting diagnostics on the listening RPC socket 0.0.0.0:36697 every 8 connection(s)
I20260924 10:34:36.544030 1334 acceptor_pool.cc:254] collecting diagnostics on the listening RPC socket 0.0.0.0:36697 every 8 connection(s)
I20260924 10:34:36.557472 1332 messenger.cc:345] service WrongServiceName not registered on TestServer
[ OK ] Parameters/TestRpc.TestWrongService/SSL_TCP (42 ms)
[ RUN ] Parameters/TestRpc.TestConnectionKeepalive/SSL_TCP
I20260924 10:34:36.567895 1357 acceptor_pool.cc:254] collecting diagnostics on the listening RPC socket 0.0.0.0:46391 every 8 connection(s)
I20260924 10:34:36.567948 1358 acceptor_pool.cc:254] collecting diagnostics on the listening RPC socket 0.0.0.0:46391 every 8 connection(s)
I20260924 10:34:36.568223 1238 rpc-test.cc:488] Connecting to 0.0.0.0:46391
[ OK ] Parameters/TestRpc.TestConnectionKeepalive/SSL_TCP (1033 ms)
[ RUN ] Parameters/TestRpc.TestClientConnectionMetrics/SSL_TCP
I20260924 10:34:37.615253 1382 acceptor_pool.cc:254] collecting diagnostics on the listening RPC socket 0.0.0.0:42305 every 8 connection(s)
I20260924 10:34:37.615317 1383 acceptor_pool.cc:254] collecting diagnostics on the listening RPC socket 0.0.0.0:42305 every 8 connection(s)
I20260924 10:34:37.615646 1238 rpc-test.cc:569] Connecting to 0.0.0.0:42305
[ OK ] Parameters/TestRpc.TestClientConnectionMetrics/SSL_TCP (13917 ms)
[ RUN ] Parameters/TestRpc.TestCredentialsPolicy/SSL_TCP
I20260924 10:34:51.528374 1405 acceptor_pool.cc:254] collecting diagnostics on the listening RPC socket 0.0.0.0:42519 every 8 connection(s)
I20260924 10:34:51.528421 1406 acceptor_pool.cc:254] collecting diagnostics on the listening RPC socket 0.0.0.0:42519 every 8 connection(s)
I20260924 10:34:51.528733 1238 rpc-test.cc:700] Connecting to 0.0.0.0:42519
[ OK ] Parameters/TestRpc.TestCredentialsPolicy/SSL_TCP (44 ms)
[ RUN ] Parameters/TestRpc.TestCallLongerThanKeepalive/SSL_TCP
I20260924 10:34:51.564987 1430 acceptor_pool.cc:254] collecting diagnostics on the listening RPC socket 0.0.0.0:35589 every 8 connection(s)
I20260924 10:34:51.565035 1431 acceptor_pool.cc:254] collecting diagnostics on the listening RPC socket 0.0.0.0:35589 every 8 connection(s)
I20260924 10:34:51.593501 1434 rpc-test-base.h:222] got call: sleep_micros: 3000000 deferred: true
I20260924 10:34:54.594419 1434 rpcz_store.cc:275] Call kudu.rpc.GenericCalculatorService.Sleep from 127.0.0.1:33634 (request call id 0) took 3001 ms. Trace:
I20260924 10:34:54.594547 1434 rpcz_store.cc:276] 0924 10:34:51.593418 (+ 0us) service_pool.cc:170] Inserting onto call queue
0924 10:34:51.593474 (+ 56us) service_pool.cc:227] Handling call
0924 10:34:54.594396 (+3000922us) inbound_call.cc:173] Queueing success response
Metrics: {}
[ OK ] Parameters/TestRpc.TestCallLongerThanKeepalive/SSL_TCP (3041 ms)
[ RUN ] Parameters/TestRpc.TestRpcSidecar/SSL_TCP
I20260924 10:34:54.608177 1455 acceptor_pool.cc:254] collecting diagnostics on the listening RPC socket 0.0.0.0:36671 every 8 connection(s)
I20260924 10:34:54.608180 1456 acceptor_pool.cc:254] collecting diagnostics on the listening RPC socket 0.0.0.0:36671 every 8 connection(s)
[ OK ] Parameters/TestRpc.TestRpcSidecar/SSL_TCP (83 ms)
[ RUN ] Parameters/TestRpc.TestRpcSidecarLimits/SSL_TCP
I20260924 10:34:56.320393 1480 acceptor_pool.cc:254] collecting diagnostics on the listening RPC socket 0.0.0.0:35819 every 8 connection(s)
I20260924 10:34:56.320430 1481 acceptor_pool.cc:254] collecting diagnostics on the listening RPC socket 0.0.0.0:35819 every 8 connection(s)
W20260924 10:34:56.328722 1238 serialization.cc:72] Serialized kudu.rpc_test.PushStringsRequestPB (2147483654 bytes) is larger than the maximum configured RPC message size (52428800 bytes). Sending anyway, but peer may reject the data.
W20260924 10:34:56.332583 1479 connection.cc:535] server connection from 127.0.0.1:59172 recv error: Network error: RPC frame had a length of 2147483714, but we only support messages up to 52428800 bytes long.
W20260924 10:34:56.332643 1479 connection.cc:158] shutting down server connection from 127.0.0.1:59172 with pending inbound data: 4/2147483714 bytes received; last active 0 ns ago: status Network error: RPC frame had a length of 2147483714, but we only support messages up to 52428800 bytes long.
W20260924 10:34:56.332926 1493 connection.cc:196] Error closing socket: Network error: TlsSocket::Close: Connection reset by peer
I20260924 10:34:56.338907 1505 acceptor_pool.cc:254] collecting diagnostics on the listening RPC socket 0.0.0.0:43385 every 8 connection(s)
I20260924 10:34:56.338951 1506 acceptor_pool.cc:254] collecting diagnostics on the listening RPC socket 0.0.0.0:43385 every 8 connection(s)
W20260924 10:35:00.567098 1504 connection.cc:577] server connection from 127.0.0.1:57360: received bad data: 'Corruption: Invalid packet: message had a length of 2147483710, but we only support messages up to 2147483647 bytes
'
[ OK ] Parameters/TestRpc.TestRpcSidecarLimits/SSL_TCP (5888 ms)
[ RUN ] Parameters/TestRpc.TestCallTimeoutDoesntAffectNegotiation/SSL_TCP
I20260924 10:35:00.578037 1530 acceptor_pool.cc:254] collecting diagnostics on the listening RPC socket 0.0.0.0:33707 every 8 connection(s)
I20260924 10:35:00.578150 1531 acceptor_pool.cc:254] collecting diagnostics on the listening RPC socket 0.0.0.0:33707 every 8 connection(s)
W20260924 10:35:00.604218 1526 negotiation.cc:266] Injecting 500ms delay in negotiation
I20260924 10:35:00.654646 1238 rpc-test-base.h:595] status: Timed out: connection negotiation to 0.0.0.0:33707 for RPC Sleep timed out after 0.050s (ON_OUTBOUND_QUEUE), seconds elapsed: 0.0509097
[ OK ] Parameters/TestRpc.TestCallTimeoutDoesntAffectNegotiation/SSL_TCP (540 ms)
[ RUN ] Parameters/TestRpc.TestRpcHandlerLatencyMetric/SSL_TCP
I20260924 10:35:01.138949 1555 acceptor_pool.cc:254] collecting diagnostics on the listening RPC socket 0.0.0.0:46863 every 8 connection(s)
I20260924 10:35:01.138962 1556 acceptor_pool.cc:254] collecting diagnostics on the listening RPC socket 0.0.0.0:46863 every 8 connection(s)
I20260924 10:35:01.170286 1238 rpc-test.cc:1236] Sleep() min lat: 20339
I20260924 10:35:01.170356 1238 rpc-test.cc:1237] Sleep() mean lat: 20339
I20260924 10:35:01.170384 1238 rpc-test.cc:1238] Sleep() max lat: 20339
I20260924 10:35:01.170398 1238 rpc-test.cc:1239] Sleep() #calls: 1
[ OK ] Parameters/TestRpc.TestRpcHandlerLatencyMetric/SSL_TCP (61 ms)
[ RUN ] Parameters/TestRpc.TimedOutOnResponseMetricServiceQueue/SSL_TCP
I20260924 10:35:01.182794 1581 acceptor_pool.cc:254] collecting diagnostics on the listening RPC socket 0.0.0.0:44005 every 8 connection(s)
I20260924 10:35:01.182852 1582 acceptor_pool.cc:254] collecting diagnostics on the listening RPC socket 0.0.0.0:44005 every 8 connection(s)
W20260924 10:35:01.260026 1583 rpcz_store.cc:267] Call kudu.rpc_test.CalculatorService.Sleep from 127.0.0.1:38176 (request call id 2) took 20 ms (client timeout 20 ms). Trace:
W20260924 10:35:01.260154 1583 rpcz_store.cc:269] 0924 10:35:01.239576 (+ 0us) service_pool.cc:170] Inserting onto call queue
0924 10:35:01.259966 (+ 20390us) service_pool.cc:214] Skipping call since client already timed out
0924 10:35:01.260003 (+ 37us) inbound_call.cc:173] Queueing failure response
Metrics: {}
[ OK ] Parameters/TestRpc.TimedOutOnResponseMetricServiceQueue/SSL_TCP (89 ms)
[ RUN ] Parameters/TestRpc.RpcPendingConnectionsMetric/SSL_TCP
I20260924 10:35:01.264801 1604 acceptor_pool.cc:254] collecting diagnostics on the listening RPC socket 0.0.0.0:41181 every 8 connection(s)
I20260924 10:35:01.264884 1605 acceptor_pool.cc:254] collecting diagnostics on the listening RPC socket 0.0.0.0:41181 every 8 connection(s)
W20260924 10:35:01.265954 1600 negotiation.cc:337] Failed RPC negotiation. Trace:
0924 10:35:01.265585 (+ 0us) reactor.cc:625] Submitting negotiation task for server connection from 127.0.0.1:44900 (local address 127.0.0.1:41181)
0924 10:35:01.265671 (+ 86us) server_negotiation.cc:206] Beginning negotiation
0924 10:35:01.265680 (+ 9us) server_negotiation.cc:399] Waiting for connection header
0924 10:35:01.265766 (+ 86us) negotiation.cc:327] Negotiation complete: Network error: Server connection negotiation failed: server connection from 127.0.0.1:44900: BlockingRecv error: recv got EOF from 127.0.0.1:44900 (error 108)
Metrics: {"server-negotiator.queue_time_us":23}
[ OK ] Parameters/TestRpc.RpcPendingConnectionsMetric/SSL_TCP (14 ms)
[ RUN ] Parameters/TestRpc.TestRpcContextClientDeadline/SSL_TCP
I20260924 10:35:01.288277 1620 acceptor_pool.cc:254] collecting diagnostics on the listening RPC socket 0.0.0.0:33287 every 8 connection(s)
I20260924 10:35:01.288287 1621 acceptor_pool.cc:254] collecting diagnostics on the listening RPC socket 0.0.0.0:33287 every 8 connection(s)
[ OK ] Parameters/TestRpc.TestRpcContextClientDeadline/SSL_TCP (47 ms)
[ RUN ] Parameters/TestRpc.TestApplicationFeatureFlagUnsupportedServer/SSL_TCP
I20260924 10:35:01.337466 1645 acceptor_pool.cc:254] collecting diagnostics on the listening RPC socket 0.0.0.0:39779 every 8 connection(s)
I20260924 10:35:01.337514 1646 acceptor_pool.cc:254] collecting diagnostics on the listening RPC socket 0.0.0.0:39779 every 8 connection(s)
[ OK ] Parameters/TestRpc.TestApplicationFeatureFlagUnsupportedServer/SSL_TCP (24 ms)
[ RUN ] Parameters/TestRpc.TestCancellationAsync/SSL_TCP
I20260924 10:35:01.364406 1670 acceptor_pool.cc:254] collecting diagnostics on the listening RPC socket 0.0.0.0:40015 every 8 connection(s)
I20260924 10:35:01.364445 1671 acceptor_pool.cc:254] collecting diagnostics on the listening RPC socket 0.0.0.0:40015 every 8 connection(s)
I20260924 10:35:01.364713 1238 rpc-test.cc:1716] Connecting to 0.0.0.0:40015
I20260924 10:35:01.382561 1238 test_util.cc:268] Using random seed: 653194655
I20260924 10:35:01.401808 1674 rpc-test-base.h:240] got call: sleep_micros: 500 pattern: 4294967295 num_repetitions: 2097152 sidecar_idx: 0
I20260924 10:35:01.419073 1673 rpc-test-base.h:240] got call: sleep_micros: 500 pattern: 4294967295 num_repetitions: 2097152 sidecar_idx: 0
I20260924 10:35:01.435740 1674 rpc-test-base.h:240] got call: sleep_micros: 500 pattern: 4294967295 num_repetitions: 2097152 sidecar_idx: 0
I20260924 10:35:01.452956 1673 rpc-test-base.h:240] got call: sleep_micros: 500 pattern: 4294967295 num_repetitions: 2097152 sidecar_idx: 0
I20260924 10:35:01.472556 1674 rpc-test-base.h:240] got call: sleep_micros: 500 pattern: 4294967295 num_repetitions: 2097152 sidecar_idx: 0
I20260924 10:35:01.489461 1673 rpc-test-base.h:240] got call: sleep_micros: 500 pattern: 4294967295 num_repetitions: 2097152 sidecar_idx: 0
I20260924 10:35:01.509598 1674 rpc-test-base.h:240] got call: sleep_micros: 500 pattern: 4294967295 num_repetitions: 2097152 sidecar_idx: 0
I20260924 10:35:01.527524 1673 rpc-test-base.h:240] got call: sleep_micros: 500 pattern: 4294967295 num_repetitions: 2097152 sidecar_idx: 0
W20260924 10:35:01.539013 1668 connection.cc:441] server connection from 127.0.0.1:35118 torn down before Call kudu.rpc.GenericCalculatorService.SleepWithSidecar from 127.0.0.1:35118 (request call id 8) could send its response
W20260924 10:35:01.550019 1668 connection.cc:441] server connection from 127.0.0.1:35118 torn down before Call kudu.rpc.GenericCalculatorService.SleepWithSidecar from 127.0.0.1:35118 (request call id 9) could send its response
[ OK ] Parameters/TestRpc.TestCancellationAsync/SSL_TCP (204 ms)
[ RUN ] Parameters/TestRpc.TestPerformanceBySocketType/SSL_TCP
I20260924 10:35:01.581554 1696 acceptor_pool.cc:254] collecting diagnostics on the listening RPC socket 0.0.0.0:39093 every 8 connection(s)
I20260924 10:35:01.581598 1695 acceptor_pool.cc:254] collecting diagnostics on the listening RPC socket 0.0.0.0:39093 every 8 connection(s)
I20260924 10:35:01.581811 1238 rpc-test.cc:1846] Connecting to 0.0.0.0:39093
I20260924 10:35:03.872604 1238 rpc-test.cc:1859] Sending 1024MB via ssl-enabled tcp socket: real 2.285s user 2.300s sys 1.736s
I20260924 10:35:06.041117 1238 rpc-test.cc:1859] Sending 1024MB via ssl-enabled tcp socket: real 2.168s user 2.209s sys 1.623s
I20260924 10:35:08.234302 1238 rpc-test.cc:1859] Sending 1024MB via ssl-enabled tcp socket: real 2.193s user 2.247s sys 1.617s
I20260924 10:35:10.380183 1238 rpc-test.cc:1859] Sending 1024MB via ssl-enabled tcp socket: real 2.146s user 2.217s sys 1.575s
I20260924 10:35:12.633553 1238 rpc-test.cc:1859] Sending 1024MB via ssl-enabled tcp socket: real 2.253s user 2.329s sys 1.654s
[ OK ] Parameters/TestRpc.TestPerformanceBySocketType/SSL_TCP (11083 ms)
[----------] 20 tests from Parameters/TestRpc (36261 ms total)
[----------] 1 test from Parameters/TestRpcSocketTxRxQueue
[ RUN ] Parameters/TestRpcSocketTxRxQueue.OverCapacity/0
W20260924 10:35:12.918040 1739 negotiation.cc:337] Failed RPC negotiation. Trace:
0924 10:35:12.652259 (+ 0us) reactor.cc:625] Submitting negotiation task for client connection to 0.0.0.0:38741 (local address 127.0.0.1:50536)
0924 10:35:12.652399 (+ 140us) negotiation.cc:107] Waiting for socket to connect
0924 10:35:12.652411 (+ 12us) client_negotiation.cc:174] Beginning negotiation
0924 10:35:12.652508 (+ 97us) client_negotiation.cc:252] Sending NEGOTIATE NegotiatePB request
0924 10:35:12.917883 (+265375us) negotiation.cc:327] Negotiation complete: Network error: Client connection negotiation failed: client connection to 0.0.0.0:38741: BlockingRecv error: recv error from unknown peer: Transport endpoint is not connected (error 107)
Metrics: {"client-negotiator.queue_time_us":51}
W20260924 10:35:12.918040 1712 negotiation.cc:337] Failed RPC negotiation. Trace:
0924 10:35:12.648767 (+ 0us) reactor.cc:625] Submitting negotiation task for client connection to 0.0.0.0:38741 (local address 127.0.0.1:50518)
0924 10:35:12.648887 (+ 120us) negotiation.cc:107] Waiting for socket to connect
0924 10:35:12.648902 (+ 15us) client_negotiation.cc:174] Beginning negotiation
0924 10:35:12.648995 (+ 93us) client_negotiation.cc:252] Sending NEGOTIATE NegotiatePB request
0924 10:35:12.917883 (+268888us) negotiation.cc:327] Negotiation complete: Network error: Client connection negotiation failed: client connection to 0.0.0.0:38741: BlockingRecv error: recv error from unknown peer: Transport endpoint is not connected (error 107)
Metrics: {"client-negotiator.queue_time_us":43}
W20260924 10:35:12.918251 1721 negotiation.cc:337] Failed RPC negotiation. Trace:
0924 10:35:12.649911 (+ 0us) reactor.cc:625] Submitting negotiation task for client connection to 0.0.0.0:38741 (local address 127.0.0.1:50526)
0924 10:35:12.650018 (+ 107us) negotiation.cc:107] Waiting for socket to connect
0924 10:35:12.650032 (+ 14us) client_negotiation.cc:174] Beginning negotiation
0924 10:35:12.650116 (+ 84us) client_negotiation.cc:252] Sending NEGOTIATE NegotiatePB request
0924 10:35:12.917942 (+267826us) negotiation.cc:327] Negotiation complete: Network error: Client connection negotiation failed: client connection to 0.0.0.0:38741: BlockingRecv error: recv error from unknown peer: Transport endpoint is not connected (error 107)
Metrics: {"client-negotiator.queue_time_us":43}
W20260924 10:35:12.918418 1730 negotiation.cc:337] Failed RPC negotiation. Trace:
0924 10:35:12.651029 (+ 0us) reactor.cc:625] Submitting negotiation task for client connection to 0.0.0.0:38741 (local address 127.0.0.1:50528)
0924 10:35:12.651132 (+ 103us) negotiation.cc:107] Waiting for socket to connect
0924 10:35:12.651146 (+ 14us) client_negotiation.cc:174] Beginning negotiation
0924 10:35:12.651222 (+ 76us) client_negotiation.cc:252] Sending NEGOTIATE NegotiatePB request
0924 10:35:12.917942 (+266720us) negotiation.cc:327] Negotiation complete: Network error: Client connection negotiation failed: client connection to 0.0.0.0:38741: BlockingRecv error: recv error from unknown peer: Transport endpoint is not connected (error 107)
Metrics: {"client-negotiator.queue_time_us":25}
W20260924 10:35:12.918521 1757 negotiation.cc:337] Failed RPC negotiation. Trace:
0924 10:35:12.654557 (+ 0us) reactor.cc:625] Submitting negotiation task for client connection to 0.0.0.0:38741 (local address 127.0.0.1:50560)
0924 10:35:12.654654 (+ 97us) negotiation.cc:107] Waiting for socket to connect
0924 10:35:12.654669 (+ 15us) client_negotiation.cc:174] Beginning negotiation
0924 10:35:12.654742 (+ 73us) client_negotiation.cc:252] Sending NEGOTIATE NegotiatePB request
0924 10:35:12.918455 (+263713us) negotiation.cc:327] Negotiation complete: Network error: Client connection negotiation failed: client connection to 0.0.0.0:38741: BlockingRecv error: recv error from unknown peer: Transport endpoint is not connected (error 107)
Metrics: {"client-negotiator.queue_time_us":24}
W20260924 10:35:12.918648 1748 negotiation.cc:337] Failed RPC negotiation. Trace:
0924 10:35:12.653463 (+ 0us) reactor.cc:625] Submitting negotiation task for client connection to 0.0.0.0:38741 (local address 127.0.0.1:50552)
0924 10:35:12.653589 (+ 126us) negotiation.cc:107] Waiting for socket to connect
0924 10:35:12.653600 (+ 11us) client_negotiation.cc:174] Beginning negotiation
0924 10:35:12.653678 (+ 78us) client_negotiation.cc:252] Sending NEGOTIATE NegotiatePB request
0924 10:35:12.918586 (+264908us) negotiation.cc:327] Negotiation complete: Network error: Client connection negotiation failed: client connection to 0.0.0.0:38741: BlockingRecv error: recv error from unknown peer: Transport endpoint is not connected (error 107)
Metrics: {"client-negotiator.queue_time_us":33}
[ OK ] Parameters/TestRpcSocketTxRxQueue.OverCapacity/0 (1040 ms)
[----------] 1 test from Parameters/TestRpcSocketTxRxQueue (1040 ms total)
[----------] Global test environment tear-down
[==========] 21 tests from 2 test suites ran. (37301 ms total)
[ PASSED ] 20 tests.
[ FAILED ] 1 test, listed below:
[ FAILED ] Parameters/TestRpc.TestCallWithChainCertAndChainCA/SSL_TCP, where GetParam() = (true, false)
1 FAILED TEST