Diagnosed failure

Parameters/TestRpc.TestCallWithChainCertAndChainCA/SSL_UnixSocket: /data0/somelongdirectorytoavoidrpathissues/src/kudu/src/kudu/rpc/rpc-test.cc:270: Failure
Failed
Bad status: Runtime error: could not verify certificate chain (error with cert: subject=CN = localhost, ST = sadfjas, C = AS, emailAddress = sdflkdsajf, O = lskdfjlsad, OU = sldfkja, issuer=C = AS, ST = ASDfkjdhf, L = lskdjf, O = saldfja, OU = skdjf, CN = localhost, emailAddress = sadjflkadsj): : certificate has expired
Google Test trace:
/data0/somelongdirectorytoavoidrpathissues/src/kudu/src/kudu/rpc/rpc-test.cc:267: Connecting to unix:/tmp/dist-test-task5futV2/test-tmp/rpc-test-03db26336a954c4697004139bb399ac1.sock
I20260929 18:28:24.458643   772 test_util.cc:175] -----------------------------------------------
I20260929 18:28:24.458688   772 test_util.cc:176] Had fatal failures, leaving test files at /tmp/dist-test-task5futV2/test-tmp/rpc-test.6.Parameters_TestRpc.TestCallWithChainCertAndChainCA_SSL_UnixSocket.1790706504384073-772-0

Full log

Note: This is test shard 7 of 8.
[==========] Running 21 tests from 2 test suites.
[----------] Global test environment set-up.
[----------] 20 tests from Parameters/TestRpc
[ RUN      ] Parameters/TestRpc.TestMessengerCreateDestroy/SSL_UnixSocket
WARNING: Logging before InitGoogleLogging() is written to STDERR
I20260929 18:28:24.418977   772 rpc-test.cc:169] started messenger TestCreateDestroy
[       OK ] Parameters/TestRpc.TestMessengerCreateDestroy/SSL_UnixSocket (29 ms)
[ RUN      ] Parameters/TestRpc.TestNegotiationDeadlock/SSL_UnixSocket
I20260929 18:28:24.435374   792 acceptor_pool.cc:254] collecting diagnostics on the listening RPC socket unix:/tmp/dist-test-task5futV2/test-tmp/rpc-test-398092d879f144b5b8a0ad727d6dd2aa.sock every 8 connection(s)
I20260929 18:28:24.435411   793 acceptor_pool.cc:254] collecting diagnostics on the listening RPC socket unix:/tmp/dist-test-task5futV2/test-tmp/rpc-test-398092d879f144b5b8a0ad727d6dd2aa.sock every 8 connection(s)
[       OK ] Parameters/TestRpc.TestNegotiationDeadlock/SSL_UnixSocket (24 ms)
[ RUN      ] Parameters/TestRpc.TestCallWithChainCertAndChainCA/SSL_UnixSocket
I20260929 18:28:24.454592   808 acceptor_pool.cc:254] collecting diagnostics on the listening RPC socket unix:/tmp/dist-test-task5futV2/test-tmp/rpc-test-03db26336a954c4697004139bb399ac1.sock every 8 connection(s)
I20260929 18:28:24.454602   809 acceptor_pool.cc:254] collecting diagnostics on the listening RPC socket unix:/tmp/dist-test-task5futV2/test-tmp/rpc-test-03db26336a954c4697004139bb399ac1.sock every 8 connection(s)
/data0/somelongdirectorytoavoidrpathissues/src/kudu/src/kudu/rpc/rpc-test.cc:270: Failure
Failed
Bad status: Runtime error: could not verify certificate chain (error with cert: subject=CN = localhost, ST = sadfjas, C = AS, emailAddress = sdflkdsajf, O = lskdfjlsad, OU = sldfkja, issuer=C = AS, ST = ASDfkjdhf, L = lskdjf, O = saldfja, OU = skdjf, CN = localhost, emailAddress = sadjflkadsj): : certificate has expired
Google Test trace:
/data0/somelongdirectorytoavoidrpathissues/src/kudu/src/kudu/rpc/rpc-test.cc:267: Connecting to unix:/tmp/dist-test-task5futV2/test-tmp/rpc-test-03db26336a954c4697004139bb399ac1.sock
I20260929 18:28:24.458643   772 test_util.cc:175] -----------------------------------------------
I20260929 18:28:24.458688   772 test_util.cc:176] Had fatal failures, leaving test files at /tmp/dist-test-task5futV2/test-tmp/rpc-test.6.Parameters_TestRpc.TestCallWithChainCertAndChainCA_SSL_UnixSocket.1790706504384073-772-0
[  FAILED  ] Parameters/TestRpc.TestCallWithChainCertAndChainCA/SSL_UnixSocket, where GetParam() = (true, true) (14 ms)
[ RUN      ] Parameters/TestRpc.TestCallWithPasswordProtectedKey/SSL_UnixSocket
I20260929 18:28:24.478936   833 acceptor_pool.cc:254] collecting diagnostics on the listening RPC socket unix:/tmp/dist-test-task5futV2/test-tmp/rpc-test-7c04a77d5bbc48b6bb27f150027f3be3.sock every 8 connection(s)
I20260929 18:28:24.478972   834 acceptor_pool.cc:254] collecting diagnostics on the listening RPC socket unix:/tmp/dist-test-task5futV2/test-tmp/rpc-test-7c04a77d5bbc48b6bb27f150027f3be3.sock every 8 connection(s)
W20260929 18:28:24.490610   830 connection.cc:196] Error closing socket: Network error: TlsSocket::Close: Broken pipe
[       OK ] Parameters/TestRpc.TestCallWithPasswordProtectedKey/SSL_UnixSocket (33 ms)
[ RUN      ] Parameters/TestRpc.TestCallToBadServer/SSL_UnixSocket
I20260929 18:28:24.511283   772 rpc-test.cc:394] Status: Network error: Client connection negotiation failed: client connection to 0.0.0.0:0: connect: Connection refused (error 111)
I20260929 18:28:24.511616   772 rpc-test.cc:394] Status: Network error: Client connection negotiation failed: client connection to 0.0.0.0:0: connect: Connection refused (error 111)
I20260929 18:28:24.511948   772 rpc-test.cc:394] Status: Network error: Client connection negotiation failed: client connection to 0.0.0.0:0: connect: Connection refused (error 111)
I20260929 18:28:24.512251   772 rpc-test.cc:394] Status: Network error: Client connection negotiation failed: client connection to 0.0.0.0:0: connect: Connection refused (error 111)
I20260929 18:28:24.512579   772 rpc-test.cc:394] Status: Network error: Client connection negotiation failed: client connection to 0.0.0.0:0: connect: Connection refused (error 111)
[       OK ] Parameters/TestRpc.TestCallToBadServer/SSL_UnixSocket (21 ms)
[ RUN      ] Parameters/TestRpc.TestWrongService/SSL_UnixSocket
I20260929 18:28:24.519694   868 acceptor_pool.cc:254] collecting diagnostics on the listening RPC socket unix:/tmp/dist-test-task5futV2/test-tmp/rpc-test-81cfc89ce86049fe9f9348180ad4f750.sock every 8 connection(s)
I20260929 18:28:24.519755   869 acceptor_pool.cc:254] collecting diagnostics on the listening RPC socket unix:/tmp/dist-test-task5futV2/test-tmp/rpc-test-81cfc89ce86049fe9f9348180ad4f750.sock every 8 connection(s)
I20260929 18:28:24.534823   865 messenger.cc:345] service WrongServiceName not registered on TestServer
[       OK ] Parameters/TestRpc.TestWrongService/SSL_UnixSocket (23 ms)
[ RUN      ] Parameters/TestRpc.TestConnectionKeepalive/SSL_UnixSocket
I20260929 18:28:24.547963   891 acceptor_pool.cc:254] collecting diagnostics on the listening RPC socket unix:/tmp/dist-test-task5futV2/test-tmp/rpc-test-50a108206d884c3e8e2e379e849fb99a.sock every 8 connection(s)
I20260929 18:28:24.548030   892 acceptor_pool.cc:254] collecting diagnostics on the listening RPC socket unix:/tmp/dist-test-task5futV2/test-tmp/rpc-test-50a108206d884c3e8e2e379e849fb99a.sock every 8 connection(s)
I20260929 18:28:24.548231   772 rpc-test.cc:488] Connecting to unix:/tmp/dist-test-task5futV2/test-tmp/rpc-test-50a108206d884c3e8e2e379e849fb99a.sock
W20260929 18:28:25.038187   904 connection.cc:196] Error closing socket: Network error: TlsSocket::Close: Broken pipe
[       OK ] Parameters/TestRpc.TestConnectionKeepalive/SSL_UnixSocket (1038 ms)
[ RUN      ] Parameters/TestRpc.TestClientConnectionMetrics/SSL_UnixSocket
I20260929 18:28:25.583770   916 acceptor_pool.cc:254] collecting diagnostics on the listening RPC socket unix:/tmp/dist-test-task5futV2/test-tmp/rpc-test-3011282756ce4817822166c80f3c9a10.sock every 8 connection(s)
I20260929 18:28:25.583825   917 acceptor_pool.cc:254] collecting diagnostics on the listening RPC socket unix:/tmp/dist-test-task5futV2/test-tmp/rpc-test-3011282756ce4817822166c80f3c9a10.sock every 8 connection(s)
I20260929 18:28:25.584036   772 rpc-test.cc:569] Connecting to unix:/tmp/dist-test-task5futV2/test-tmp/rpc-test-3011282756ce4817822166c80f3c9a10.sock
W20260929 18:28:35.856480   913 connection.cc:196] Error closing socket: Network error: TlsSocket::Close: Broken pipe
[       OK ] Parameters/TestRpc.TestClientConnectionMetrics/SSL_UnixSocket (10282 ms)
[ RUN      ] Parameters/TestRpc.TestCredentialsPolicy/SSL_UnixSocket
I20260929 18:28:35.868060   939 acceptor_pool.cc:254] collecting diagnostics on the listening RPC socket unix:/tmp/dist-test-task5futV2/test-tmp/rpc-test-1f321d7183814249bcb13ef6c5e8d5d1.sock every 8 connection(s)
I20260929 18:28:35.868142   940 acceptor_pool.cc:254] collecting diagnostics on the listening RPC socket unix:/tmp/dist-test-task5futV2/test-tmp/rpc-test-1f321d7183814249bcb13ef6c5e8d5d1.sock every 8 connection(s)
I20260929 18:28:35.868345   772 rpc-test.cc:700] Connecting to unix:/tmp/dist-test-task5futV2/test-tmp/rpc-test-1f321d7183814249bcb13ef6c5e8d5d1.sock
W20260929 18:28:35.892664   938 connection.cc:196] Error closing socket: Network error: TlsSocket::Close: Broken pipe
[       OK ] Parameters/TestRpc.TestCredentialsPolicy/SSL_UnixSocket (39 ms)
[ RUN      ] Parameters/TestRpc.TestCallLongerThanKeepalive/SSL_UnixSocket
I20260929 18:28:35.913537   964 acceptor_pool.cc:254] collecting diagnostics on the listening RPC socket unix:/tmp/dist-test-task5futV2/test-tmp/rpc-test-3653f8819da34060b1b3dc73df4a3dbc.sock every 8 connection(s)
I20260929 18:28:35.913578   965 acceptor_pool.cc:254] collecting diagnostics on the listening RPC socket unix:/tmp/dist-test-task5futV2/test-tmp/rpc-test-3653f8819da34060b1b3dc73df4a3dbc.sock every 8 connection(s)
I20260929 18:28:35.929222   968 rpc-test-base.h:222] got call: sleep_micros: 3000000 deferred: true
I20260929 18:28:38.930047   968 rpcz_store.cc:275] Call kudu.rpc.GenericCalculatorService.Sleep from unix:<unnamed> (request call id 0) took 3000 ms. Trace:
I20260929 18:28:38.930150   968 rpcz_store.cc:276] 0929 18:28:35.929162 (+     0us) service_pool.cc:170] Inserting onto call queue
0929 18:28:35.929205 (+    43us) service_pool.cc:227] Handling call
0929 18:28:38.930029 (+3000824us) inbound_call.cc:173] Queueing success response
Metrics: {}
W20260929 18:28:38.931564   961 connection.cc:196] Error closing socket: Network error: TlsSocket::Close: Broken pipe
[       OK ] Parameters/TestRpc.TestCallLongerThanKeepalive/SSL_UnixSocket (3034 ms)
[ RUN      ] Parameters/TestRpc.TestRpcSidecar/SSL_UnixSocket
I20260929 18:28:38.941177   989 acceptor_pool.cc:254] collecting diagnostics on the listening RPC socket unix:/tmp/dist-test-task5futV2/test-tmp/rpc-test-3f04f888d83142b9926b50c28668e900.sock every 8 connection(s)
I20260929 18:28:38.941243   990 acceptor_pool.cc:254] collecting diagnostics on the listening RPC socket unix:/tmp/dist-test-task5futV2/test-tmp/rpc-test-3f04f888d83142b9926b50c28668e900.sock every 8 connection(s)
W20260929 18:28:39.000988   986 connection.cc:196] Error closing socket: Network error: TlsSocket::Close: Broken pipe
[       OK ] Parameters/TestRpc.TestRpcSidecar/SSL_UnixSocket (69 ms)
[ RUN      ] Parameters/TestRpc.TestRpcSidecarLimits/SSL_UnixSocket
I20260929 18:28:40.636833  1015 acceptor_pool.cc:254] collecting diagnostics on the listening RPC socket unix:/tmp/dist-test-task5futV2/test-tmp/rpc-test-6f942249a4a943938615f9c88de510a9.sock every 8 connection(s)
I20260929 18:28:40.636825  1014 acceptor_pool.cc:254] collecting diagnostics on the listening RPC socket unix:/tmp/dist-test-task5futV2/test-tmp/rpc-test-6f942249a4a943938615f9c88de510a9.sock every 8 connection(s)
W20260929 18:28:40.655663   772 serialization.cc:72] Serialized kudu.rpc_test.PushStringsRequestPB (2147483654 bytes) is larger than the maximum configured RPC message size (52428800 bytes). Sending anyway, but peer may reject the data.
W20260929 18:28:40.659579  1011 connection.cc:535] server connection from unix:<unnamed> recv error: Network error: RPC frame had a length of 2147483714, but we only support messages up to 52428800 bytes long.
W20260929 18:28:40.659664  1011 connection.cc:158] shutting down server connection from unix:<unnamed> with pending inbound data: 4/2147483714 bytes received; last active 0 ns ago: status Network error: RPC frame had a length of 2147483714, but we only support messages up to 52428800 bytes long.
W20260929 18:28:40.659915  1027 connection.cc:196] Error closing socket: Network error: TlsSocket::Close: Broken pipe
I20260929 18:28:40.685905  1039 acceptor_pool.cc:254] collecting diagnostics on the listening RPC socket unix:/tmp/dist-test-task5futV2/test-tmp/rpc-test-6f942249a4a943938615f9c88de510a9.sock every 8 connection(s)
I20260929 18:28:40.686141  1040 acceptor_pool.cc:254] collecting diagnostics on the listening RPC socket unix:/tmp/dist-test-task5futV2/test-tmp/rpc-test-6f942249a4a943938615f9c88de510a9.sock every 8 connection(s)
W20260929 18:28:45.298970  1036 connection.cc:577] server connection from unix:<unnamed>: received bad data: 'Corruption: Invalid packet: message had a length of 2147483710, but we only support messages up to 2147483647 bytes
'
W20260929 18:28:45.299294  1052 connection.cc:196] Error closing socket: Network error: TlsSocket::Close: Broken pipe
[       OK ] Parameters/TestRpc.TestRpcSidecarLimits/SSL_UnixSocket (6298 ms)
[ RUN      ] Parameters/TestRpc.TestCallTimeoutDoesntAffectNegotiation/SSL_UnixSocket
I20260929 18:28:45.318732  1064 acceptor_pool.cc:254] collecting diagnostics on the listening RPC socket unix:/tmp/dist-test-task5futV2/test-tmp/rpc-test-94e326b363464cd1b8c10fe89c2f6e0f.sock every 8 connection(s)
I20260929 18:28:45.318766  1065 acceptor_pool.cc:254] collecting diagnostics on the listening RPC socket unix:/tmp/dist-test-task5futV2/test-tmp/rpc-test-94e326b363464cd1b8c10fe89c2f6e0f.sock every 8 connection(s)
W20260929 18:28:45.335460  1060 negotiation.cc:266] Injecting 500ms delay in negotiation
I20260929 18:28:45.385722   772 rpc-test-base.h:595] status: Timed out: connection negotiation to unix:/tmp/dist-test-task5futV2/test-tmp/rpc-test-94e326b363464cd1b8c10fe89c2f6e0f.sock for RPC Sleep timed out after 0.050s (ON_OUTBOUND_QUEUE), seconds elapsed: 0.0505942
W20260929 18:28:45.840114  1061 connection.cc:196] Error closing socket: Network error: TlsSocket::Close: Broken pipe
[       OK ] Parameters/TestRpc.TestCallTimeoutDoesntAffectNegotiation/SSL_UnixSocket (539 ms)
[ RUN      ] Parameters/TestRpc.TestRpcHandlerLatencyMetric/SSL_UnixSocket
I20260929 18:28:45.856814  1089 acceptor_pool.cc:254] collecting diagnostics on the listening RPC socket unix:/tmp/dist-test-task5futV2/test-tmp/rpc-test-cda591367c154096ae3cdd7d25b80a33.sock every 8 connection(s)
I20260929 18:28:45.856851  1090 acceptor_pool.cc:254] collecting diagnostics on the listening RPC socket unix:/tmp/dist-test-task5futV2/test-tmp/rpc-test-cda591367c154096ae3cdd7d25b80a33.sock every 8 connection(s)
I20260929 18:28:45.900580   772 rpc-test.cc:1236] Sleep() min lat: 20300
I20260929 18:28:45.900638   772 rpc-test.cc:1237] Sleep() mean lat: 20300
I20260929 18:28:45.900662   772 rpc-test.cc:1238] Sleep() max lat: 20300
I20260929 18:28:45.900674   772 rpc-test.cc:1239] Sleep() #calls: 1
W20260929 18:28:45.901414  1086 connection.cc:196] Error closing socket: Network error: TlsSocket::Close: Broken pipe
[       OK ] Parameters/TestRpc.TestRpcHandlerLatencyMetric/SSL_UnixSocket (61 ms)
[ RUN      ] Parameters/TestRpc.TimedOutOnResponseMetricServiceQueue/SSL_UnixSocket
I20260929 18:28:45.918367  1115 acceptor_pool.cc:254] collecting diagnostics on the listening RPC socket unix:/tmp/dist-test-task5futV2/test-tmp/rpc-test-40d0f4d7e68e427e9dc9619fb3a0e73b.sock every 8 connection(s)
I20260929 18:28:45.918427  1116 acceptor_pool.cc:254] collecting diagnostics on the listening RPC socket unix:/tmp/dist-test-task5futV2/test-tmp/rpc-test-40d0f4d7e68e427e9dc9619fb3a0e73b.sock every 8 connection(s)
W20260929 18:28:45.980129  1117 rpcz_store.cc:267] Call kudu.rpc_test.CalculatorService.Sleep from unix:<unnamed> (request call id 2) took 20 ms (client timeout 20 ms). Trace:
W20260929 18:28:45.980222  1117 rpcz_store.cc:269] 0929 18:28:45.959783 (+     0us) service_pool.cc:170] Inserting onto call queue
0929 18:28:45.980081 (+ 20298us) service_pool.cc:214] Skipping call since client already timed out
0929 18:28:45.980111 (+    30us) inbound_call.cc:173] Queueing failure response
Metrics: {}
W20260929 18:28:45.981073  1112 connection.cc:196] Error closing socket: Network error: TlsSocket::Close: Broken pipe
[       OK ] Parameters/TestRpc.TimedOutOnResponseMetricServiceQueue/SSL_UnixSocket (79 ms)
[ RUN      ] Parameters/TestRpc.RpcPendingConnectionsMetric/SSL_UnixSocket
I20260929 18:28:45.984654  1139 acceptor_pool.cc:254] collecting diagnostics on the listening RPC socket 0.0.0.0:37323 every 8 connection(s)
I20260929 18:28:45.985033  1138 acceptor_pool.cc:254] collecting diagnostics on the listening RPC socket 0.0.0.0:37323 every 8 connection(s)
W20260929 18:28:45.993570  1134 negotiation.cc:337] Failed RPC negotiation. Trace:
0929 18:28:45.993102 (+     0us) reactor.cc:625] Submitting negotiation task for server connection from 127.0.0.1:49308 (local address 127.0.0.1:37323)
0929 18:28:45.993220 (+   118us) server_negotiation.cc:206] Beginning negotiation
0929 18:28:45.993223 (+     3us) server_negotiation.cc:399] Waiting for connection header
0929 18:28:45.993311 (+    88us) negotiation.cc:327] Negotiation complete: Network error: Server connection negotiation failed: server connection from 127.0.0.1:49308: BlockingRecv error: recv got EOF from 127.0.0.1:49308 (error 108)
Metrics: {"server-negotiator.queue_time_us":43}
[       OK ] Parameters/TestRpc.RpcPendingConnectionsMetric/SSL_UnixSocket (21 ms)
[ RUN      ] Parameters/TestRpc.TestRpcContextClientDeadline/SSL_UnixSocket
I20260929 18:28:46.019848  1154 acceptor_pool.cc:254] collecting diagnostics on the listening RPC socket unix:/tmp/dist-test-task5futV2/test-tmp/rpc-test-122b156313f042c3b9c50c828720b330.sock every 8 connection(s)
I20260929 18:28:46.019892  1155 acceptor_pool.cc:254] collecting diagnostics on the listening RPC socket unix:/tmp/dist-test-task5futV2/test-tmp/rpc-test-122b156313f042c3b9c50c828720b330.sock every 8 connection(s)
[       OK ] Parameters/TestRpc.TestRpcContextClientDeadline/SSL_UnixSocket (46 ms)
[ RUN      ] Parameters/TestRpc.TestApplicationFeatureFlagUnsupportedServer/SSL_UnixSocket
I20260929 18:28:46.066581  1179 acceptor_pool.cc:254] collecting diagnostics on the listening RPC socket unix:/tmp/dist-test-task5futV2/test-tmp/rpc-test-ff91bc3d85d549ca9b897b950d1ae65f.sock every 8 connection(s)
I20260929 18:28:46.066617  1180 acceptor_pool.cc:254] collecting diagnostics on the listening RPC socket unix:/tmp/dist-test-task5futV2/test-tmp/rpc-test-ff91bc3d85d549ca9b897b950d1ae65f.sock every 8 connection(s)
W20260929 18:28:46.090901  1176 connection.cc:196] Error closing socket: Network error: TlsSocket::Close: Broken pipe
[       OK ] Parameters/TestRpc.TestApplicationFeatureFlagUnsupportedServer/SSL_UnixSocket (41 ms)
[ RUN      ] Parameters/TestRpc.TestCancellationAsync/SSL_UnixSocket
I20260929 18:28:46.178359  1205 acceptor_pool.cc:254] collecting diagnostics on the listening RPC socket unix:/tmp/dist-test-task5futV2/test-tmp/rpc-test-852f53cbe7ac466589288d31af664b73.sock every 8 connection(s)
I20260929 18:28:46.178359  1204 acceptor_pool.cc:254] collecting diagnostics on the listening RPC socket unix:/tmp/dist-test-task5futV2/test-tmp/rpc-test-852f53cbe7ac466589288d31af664b73.sock every 8 connection(s)
I20260929 18:28:46.178557   772 rpc-test.cc:1716] Connecting to unix:/tmp/dist-test-task5futV2/test-tmp/rpc-test-852f53cbe7ac466589288d31af664b73.sock
I20260929 18:28:46.191850   772 test_util.cc:268] Using random seed: 1516503273
I20260929 18:28:46.207824  1208 rpc-test-base.h:240] got call: sleep_micros: 500 pattern: 4294967295 num_repetitions: 2097152 sidecar_idx: 0
I20260929 18:28:46.224268  1207 rpc-test-base.h:240] got call: sleep_micros: 500 pattern: 4294967295 num_repetitions: 2097152 sidecar_idx: 0
I20260929 18:28:46.241846  1208 rpc-test-base.h:240] got call: sleep_micros: 500 pattern: 4294967295 num_repetitions: 2097152 sidecar_idx: 0
I20260929 18:28:46.262404  1207 rpc-test-base.h:240] got call: sleep_micros: 500 pattern: 4294967295 num_repetitions: 2097152 sidecar_idx: 0
I20260929 18:28:46.279933  1208 rpc-test-base.h:240] got call: sleep_micros: 500 pattern: 4294967295 num_repetitions: 2097152 sidecar_idx: 0
I20260929 18:28:46.295500  1207 rpc-test-base.h:240] got call: sleep_micros: 500 pattern: 4294967295 num_repetitions: 2097152 sidecar_idx: 0
I20260929 18:28:46.310920  1208 rpc-test-base.h:240] got call: sleep_micros: 500 pattern: 4294967295 num_repetitions: 2097152 sidecar_idx: 0
W20260929 18:28:46.312340  1201 connection.cc:196] Error closing socket: Network error: TlsSocket::Close: Broken pipe
W20260929 18:28:46.318786  1201 connection.cc:441] server connection from unix:<unnamed> torn down before Call kudu.rpc.GenericCalculatorService.SleepWithSidecar from unix:<unnamed> (request call id 8) could send its response
W20260929 18:28:46.328584  1201 connection.cc:441] server connection from unix:<unnamed> torn down before Call kudu.rpc.GenericCalculatorService.SleepWithSidecar from unix:<unnamed> (request call id 9) could send its response
[       OK ] Parameters/TestRpc.TestCancellationAsync/SSL_UnixSocket (237 ms)
[ RUN      ] Parameters/TestRpc.TestPerformanceBySocketType/SSL_UnixSocket
I20260929 18:28:46.353258  1229 acceptor_pool.cc:254] collecting diagnostics on the listening RPC socket unix:/tmp/dist-test-task5futV2/test-tmp/rpc-test-3d8bc0ea7dd94917ab4fc043f85fc31a.sock every 8 connection(s)
I20260929 18:28:46.353317  1230 acceptor_pool.cc:254] collecting diagnostics on the listening RPC socket unix:/tmp/dist-test-task5futV2/test-tmp/rpc-test-3d8bc0ea7dd94917ab4fc043f85fc31a.sock every 8 connection(s)
I20260929 18:28:46.353543   772 rpc-test.cc:1846] Connecting to unix:/tmp/dist-test-task5futV2/test-tmp/rpc-test-3d8bc0ea7dd94917ab4fc043f85fc31a.sock
I20260929 18:28:47.800290   772 rpc-test.cc:1859] Sending 1024MB via ssl-enabled unix socket: real 1.415s	user 1.942s	sys 0.667s
I20260929 18:28:49.226718   772 rpc-test.cc:1859] Sending 1024MB via ssl-enabled unix socket: real 1.426s	user 1.852s	sys 0.766s
I20260929 18:28:50.602792   772 rpc-test.cc:1859] Sending 1024MB via ssl-enabled unix socket: real 1.376s	user 1.694s	sys 0.834s
I20260929 18:28:51.907574   772 rpc-test.cc:1859] Sending 1024MB via ssl-enabled unix socket: real 1.305s	user 1.687s	sys 0.721s
I20260929 18:28:53.206774   772 rpc-test.cc:1859] Sending 1024MB via ssl-enabled unix socket: real 1.299s	user 1.753s	sys 0.652s
W20260929 18:28:53.207540  1226 connection.cc:196] Error closing socket: Network error: TlsSocket::Close: Broken pipe
[       OK ] Parameters/TestRpc.TestPerformanceBySocketType/SSL_UnixSocket (6878 ms)
[----------] 20 tests from Parameters/TestRpc (28818 ms total)

[----------] 1 test from Parameters/TestRpcSocketTxRxQueue
[ RUN      ] Parameters/TestRpcSocketTxRxQueue.AcceptorRxQueueSizeMetric/0
I20260929 18:28:53.213999  1254 acceptor_pool.cc:254] collecting diagnostics on the listening RPC socket 0.0.0.0:37977 every 1 connection(s)
I20260929 18:28:53.214044  1255 acceptor_pool.cc:254] collecting diagnostics on the listening RPC socket 0.0.0.0:37977 every 1 connection(s)
W20260929 18:28:53.214759  1250 negotiation.cc:337] Failed RPC negotiation. Trace:
0929 18:28:53.214545 (+     0us) reactor.cc:625] Submitting negotiation task for server connection from 127.0.0.1:45230 (local address 127.0.0.1:37977)
0929 18:28:53.214623 (+    78us) server_negotiation.cc:206] Beginning negotiation
0929 18:28:53.214626 (+     3us) server_negotiation.cc:399] Waiting for connection header
0929 18:28:53.214699 (+    73us) negotiation.cc:327] Negotiation complete: Network error: Server connection negotiation failed: server connection from 127.0.0.1:45230: BlockingRecv error: recv got EOF from 127.0.0.1:45230 (error 108)
Metrics: {"server-negotiator.queue_time_us":21}
[       OK ] Parameters/TestRpcSocketTxRxQueue.AcceptorRxQueueSizeMetric/0 (7 ms)
[----------] 1 test from Parameters/TestRpcSocketTxRxQueue (7 ms total)

[----------] Global test environment tear-down
[==========] 21 tests from 2 test suites ran. (28826 ms total)
[  PASSED  ] 20 tests.
[  FAILED  ] 1 test, listed below:
[  FAILED  ] Parameters/TestRpc.TestCallWithChainCertAndChainCA/SSL_UnixSocket, where GetParam() = (true, true)

 1 FAILED TEST