Diagnosed failure

Parameters/TestRpc.TestCallWithChainCertAndChainCA/SSL_UnixSocket: /data0/somelongdirectorytoavoidrpathissues/src/kudu/src/kudu/rpc/rpc-test.cc:270: Failure
Failed
Bad status: Runtime error: could not verify certificate chain (error with cert: subject=CN = localhost, ST = sadfjas, C = AS, emailAddress = sdflkdsajf, O = lskdfjlsad, OU = sldfkja, issuer=C = AS, ST = ASDfkjdhf, L = lskdjf, O = saldfja, OU = skdjf, CN = localhost, emailAddress = sadjflkadsj): : certificate has expired
Google Test trace:
/data0/somelongdirectorytoavoidrpathissues/src/kudu/src/kudu/rpc/rpc-test.cc:267: Connecting to unix:/tmp/dist-test-taskMS6r8C/test-tmp/rpc-test-b2e6a88a3ed04a0d8920582a3b021477.sock
I20260926 07:26:12.222271  5402 test_util.cc:175] -----------------------------------------------
I20260926 07:26:12.222326  5402 test_util.cc:176] Had fatal failures, leaving test files at /tmp/dist-test-taskMS6r8C/test-tmp/rpc-test.6.Parameters_TestRpc.TestCallWithChainCertAndChainCA_SSL_UnixSocket.1790407572136434-5402-0

Full log

Note: This is test shard 7 of 8.
[==========] Running 21 tests from 2 test suites.
[----------] Global test environment set-up.
[----------] 20 tests from Parameters/TestRpc
[ RUN      ] Parameters/TestRpc.TestMessengerCreateDestroy/SSL_UnixSocket
WARNING: Logging before InitGoogleLogging() is written to STDERR
I20260926 07:26:12.166445  5402 rpc-test.cc:169] started messenger TestCreateDestroy
[       OK ] Parameters/TestRpc.TestMessengerCreateDestroy/SSL_UnixSocket (24 ms)
[ RUN      ] Parameters/TestRpc.TestNegotiationDeadlock/SSL_UnixSocket
I20260926 07:26:12.192217  5422 acceptor_pool.cc:254] collecting diagnostics on the listening RPC socket unix:/tmp/dist-test-taskMS6r8C/test-tmp/rpc-test-b140bf8467da4b128a6aa411adf1aa19.sock every 8 connection(s)
I20260926 07:26:12.192217  5423 acceptor_pool.cc:254] collecting diagnostics on the listening RPC socket unix:/tmp/dist-test-taskMS6r8C/test-tmp/rpc-test-b140bf8467da4b128a6aa411adf1aa19.sock every 8 connection(s)
[       OK ] Parameters/TestRpc.TestNegotiationDeadlock/SSL_UnixSocket (35 ms)
[ RUN      ] Parameters/TestRpc.TestCallWithChainCertAndChainCA/SSL_UnixSocket
I20260926 07:26:12.216706  5438 acceptor_pool.cc:254] collecting diagnostics on the listening RPC socket unix:/tmp/dist-test-taskMS6r8C/test-tmp/rpc-test-b2e6a88a3ed04a0d8920582a3b021477.sock every 8 connection(s)
I20260926 07:26:12.216761  5439 acceptor_pool.cc:254] collecting diagnostics on the listening RPC socket unix:/tmp/dist-test-taskMS6r8C/test-tmp/rpc-test-b2e6a88a3ed04a0d8920582a3b021477.sock every 8 connection(s)
/data0/somelongdirectorytoavoidrpathissues/src/kudu/src/kudu/rpc/rpc-test.cc:270: Failure
Failed
Bad status: Runtime error: could not verify certificate chain (error with cert: subject=CN = localhost, ST = sadfjas, C = AS, emailAddress = sdflkdsajf, O = lskdfjlsad, OU = sldfkja, issuer=C = AS, ST = ASDfkjdhf, L = lskdjf, O = saldfja, OU = skdjf, CN = localhost, emailAddress = sadjflkadsj): : certificate has expired
Google Test trace:
/data0/somelongdirectorytoavoidrpathissues/src/kudu/src/kudu/rpc/rpc-test.cc:267: Connecting to unix:/tmp/dist-test-taskMS6r8C/test-tmp/rpc-test-b2e6a88a3ed04a0d8920582a3b021477.sock
I20260926 07:26:12.222271  5402 test_util.cc:175] -----------------------------------------------
I20260926 07:26:12.222326  5402 test_util.cc:176] Had fatal failures, leaving test files at /tmp/dist-test-taskMS6r8C/test-tmp/rpc-test.6.Parameters_TestRpc.TestCallWithChainCertAndChainCA_SSL_UnixSocket.1790407572136434-5402-0
[  FAILED  ] Parameters/TestRpc.TestCallWithChainCertAndChainCA/SSL_UnixSocket, where GetParam() = (true, true) (18 ms)
[ RUN      ] Parameters/TestRpc.TestCallWithPasswordProtectedKey/SSL_UnixSocket
I20260926 07:26:12.230512  5463 acceptor_pool.cc:254] collecting diagnostics on the listening RPC socket unix:/tmp/dist-test-taskMS6r8C/test-tmp/rpc-test-9acaaf6204db40c8bb7b801612232c62.sock every 8 connection(s)
I20260926 07:26:12.230551  5464 acceptor_pool.cc:254] collecting diagnostics on the listening RPC socket unix:/tmp/dist-test-taskMS6r8C/test-tmp/rpc-test-9acaaf6204db40c8bb7b801612232c62.sock every 8 connection(s)
W20260926 07:26:12.244067  5460 connection.cc:196] Error closing socket: Network error: TlsSocket::Close: Broken pipe
[       OK ] Parameters/TestRpc.TestCallWithPasswordProtectedKey/SSL_UnixSocket (23 ms)
[ RUN      ] Parameters/TestRpc.TestCallToBadServer/SSL_UnixSocket
I20260926 07:26:12.269656  5402 rpc-test.cc:394] Status: Network error: Client connection negotiation failed: client connection to 0.0.0.0:0: connect: Connection refused (error 111)
I20260926 07:26:12.270206  5402 rpc-test.cc:394] Status: Network error: Client connection negotiation failed: client connection to 0.0.0.0:0: connect: Connection refused (error 111)
I20260926 07:26:12.270627  5402 rpc-test.cc:394] Status: Network error: Client connection negotiation failed: client connection to 0.0.0.0:0: connect: Connection refused (error 111)
I20260926 07:26:12.271076  5402 rpc-test.cc:394] Status: Network error: Client connection negotiation failed: client connection to 0.0.0.0:0: connect: Connection refused (error 111)
I20260926 07:26:12.271498  5402 rpc-test.cc:394] Status: Network error: Client connection negotiation failed: client connection to 0.0.0.0:0: connect: Connection refused (error 111)
[       OK ] Parameters/TestRpc.TestCallToBadServer/SSL_UnixSocket (26 ms)
[ RUN      ] Parameters/TestRpc.TestWrongService/SSL_UnixSocket
I20260926 07:26:12.285820  5498 acceptor_pool.cc:254] collecting diagnostics on the listening RPC socket unix:/tmp/dist-test-taskMS6r8C/test-tmp/rpc-test-889f99a1fba04a5a8f809dc572e6d762.sock every 8 connection(s)
I20260926 07:26:12.285863  5499 acceptor_pool.cc:254] collecting diagnostics on the listening RPC socket unix:/tmp/dist-test-taskMS6r8C/test-tmp/rpc-test-889f99a1fba04a5a8f809dc572e6d762.sock every 8 connection(s)
I20260926 07:26:12.302714  5495 messenger.cc:345] service WrongServiceName not registered on TestServer
W20260926 07:26:12.303740  5495 connection.cc:196] Error closing socket: Network error: TlsSocket::Close: Broken pipe
[       OK ] Parameters/TestRpc.TestWrongService/SSL_UnixSocket (33 ms)
[ RUN      ] Parameters/TestRpc.TestConnectionKeepalive/SSL_UnixSocket
I20260926 07:26:12.313212  5521 acceptor_pool.cc:254] collecting diagnostics on the listening RPC socket unix:/tmp/dist-test-taskMS6r8C/test-tmp/rpc-test-84bfa9f374b8443086086df5216bad5f.sock every 8 connection(s)
I20260926 07:26:12.313256  5522 acceptor_pool.cc:254] collecting diagnostics on the listening RPC socket unix:/tmp/dist-test-taskMS6r8C/test-tmp/rpc-test-84bfa9f374b8443086086df5216bad5f.sock every 8 connection(s)
I20260926 07:26:12.313519  5402 rpc-test.cc:488] Connecting to unix:/tmp/dist-test-taskMS6r8C/test-tmp/rpc-test-84bfa9f374b8443086086df5216bad5f.sock
W20260926 07:26:12.807523  5534 connection.cc:196] Error closing socket: Network error: TlsSocket::Close: Broken pipe
[       OK ] Parameters/TestRpc.TestConnectionKeepalive/SSL_UnixSocket (1033 ms)
[ RUN      ] Parameters/TestRpc.TestClientConnectionMetrics/SSL_UnixSocket
I20260926 07:26:13.347342  5546 acceptor_pool.cc:254] collecting diagnostics on the listening RPC socket unix:/tmp/dist-test-taskMS6r8C/test-tmp/rpc-test-f7068e69473f4aec88225eb1eeecdfd1.sock every 8 connection(s)
I20260926 07:26:13.347474  5547 acceptor_pool.cc:254] collecting diagnostics on the listening RPC socket unix:/tmp/dist-test-taskMS6r8C/test-tmp/rpc-test-f7068e69473f4aec88225eb1eeecdfd1.sock every 8 connection(s)
I20260926 07:26:13.347760  5402 rpc-test.cc:569] Connecting to unix:/tmp/dist-test-taskMS6r8C/test-tmp/rpc-test-f7068e69473f4aec88225eb1eeecdfd1.sock
W20260926 07:26:24.213169  5543 connection.cc:196] Error closing socket: Network error: TlsSocket::Close: Broken pipe
[       OK ] Parameters/TestRpc.TestClientConnectionMetrics/SSL_UnixSocket (10875 ms)
[ RUN      ] Parameters/TestRpc.TestCredentialsPolicy/SSL_UnixSocket
I20260926 07:26:24.229175  5569 acceptor_pool.cc:254] collecting diagnostics on the listening RPC socket unix:/tmp/dist-test-taskMS6r8C/test-tmp/rpc-test-c85bcd5d0ec0430a9e93e3362c17bbdb.sock every 8 connection(s)
I20260926 07:26:24.229175  5570 acceptor_pool.cc:254] collecting diagnostics on the listening RPC socket unix:/tmp/dist-test-taskMS6r8C/test-tmp/rpc-test-c85bcd5d0ec0430a9e93e3362c17bbdb.sock every 8 connection(s)
I20260926 07:26:24.229503  5402 rpc-test.cc:700] Connecting to unix:/tmp/dist-test-taskMS6r8C/test-tmp/rpc-test-c85bcd5d0ec0430a9e93e3362c17bbdb.sock
W20260926 07:26:24.250391  5568 connection.cc:196] Error closing socket: Network error: TlsSocket::Close: Broken pipe
W20260926 07:26:24.255165  5568 connection.cc:196] Error closing socket: Network error: TlsSocket::Close: Broken pipe
[       OK ] Parameters/TestRpc.TestCredentialsPolicy/SSL_UnixSocket (41 ms)
[ RUN      ] Parameters/TestRpc.TestCallLongerThanKeepalive/SSL_UnixSocket
I20260926 07:26:24.270772  5594 acceptor_pool.cc:254] collecting diagnostics on the listening RPC socket unix:/tmp/dist-test-taskMS6r8C/test-tmp/rpc-test-34cf2af77faf497b80c21dc20af8b45c.sock every 8 connection(s)
I20260926 07:26:24.270802  5595 acceptor_pool.cc:254] collecting diagnostics on the listening RPC socket unix:/tmp/dist-test-taskMS6r8C/test-tmp/rpc-test-34cf2af77faf497b80c21dc20af8b45c.sock every 8 connection(s)
I20260926 07:26:24.298597  5598 rpc-test-base.h:222] got call: sleep_micros: 3000000 deferred: true
I20260926 07:26:27.299494  5598 rpcz_store.cc:275] Call kudu.rpc.GenericCalculatorService.Sleep from unix:<unnamed> (request call id 0) took 3000 ms. Trace:
I20260926 07:26:27.299619  5598 rpcz_store.cc:276] 0926 07:26:24.298525 (+     0us) service_pool.cc:170] Inserting onto call queue
0926 07:26:24.298574 (+    49us) service_pool.cc:227] Handling call
0926 07:26:27.299473 (+3000899us) inbound_call.cc:173] Queueing success response
Metrics: {}
[       OK ] Parameters/TestRpc.TestCallLongerThanKeepalive/SSL_UnixSocket (3046 ms)
[ RUN      ] Parameters/TestRpc.TestRpcSidecar/SSL_UnixSocket
I20260926 07:26:27.313798  5619 acceptor_pool.cc:254] collecting diagnostics on the listening RPC socket unix:/tmp/dist-test-taskMS6r8C/test-tmp/rpc-test-c616410a3ef94ff6b96b3907b04ac3af.sock every 8 connection(s)
I20260926 07:26:27.313918  5620 acceptor_pool.cc:254] collecting diagnostics on the listening RPC socket unix:/tmp/dist-test-taskMS6r8C/test-tmp/rpc-test-c616410a3ef94ff6b96b3907b04ac3af.sock every 8 connection(s)
W20260926 07:26:27.369433  5616 connection.cc:196] Error closing socket: Network error: TlsSocket::Close: Broken pipe
[       OK ] Parameters/TestRpc.TestRpcSidecar/SSL_UnixSocket (68 ms)
[ RUN      ] Parameters/TestRpc.TestRpcSidecarLimits/SSL_UnixSocket
I20260926 07:26:29.192024  5644 acceptor_pool.cc:254] collecting diagnostics on the listening RPC socket unix:/tmp/dist-test-taskMS6r8C/test-tmp/rpc-test-acfbf98136e845d58f30a6b19a3a179c.sock every 8 connection(s)
I20260926 07:26:29.192027  5645 acceptor_pool.cc:254] collecting diagnostics on the listening RPC socket unix:/tmp/dist-test-taskMS6r8C/test-tmp/rpc-test-acfbf98136e845d58f30a6b19a3a179c.sock every 8 connection(s)
W20260926 07:26:29.211458  5402 serialization.cc:72] Serialized kudu.rpc_test.PushStringsRequestPB (2147483654 bytes) is larger than the maximum configured RPC message size (52428800 bytes). Sending anyway, but peer may reject the data.
W20260926 07:26:29.215776  5641 connection.cc:535] server connection from unix:<unnamed> recv error: Network error: RPC frame had a length of 2147483714, but we only support messages up to 52428800 bytes long.
W20260926 07:26:29.215891  5641 connection.cc:158] shutting down server connection from unix:<unnamed> with pending inbound data: 4/2147483714 bytes received; last active 0 ns ago: status Network error: RPC frame had a length of 2147483714, but we only support messages up to 52428800 bytes long.
W20260926 07:26:29.216194  5657 connection.cc:196] Error closing socket: Network error: TlsSocket::Close: Broken pipe
I20260926 07:26:29.240262  5670 acceptor_pool.cc:254] collecting diagnostics on the listening RPC socket unix:/tmp/dist-test-taskMS6r8C/test-tmp/rpc-test-acfbf98136e845d58f30a6b19a3a179c.sock every 8 connection(s)
I20260926 07:26:29.240262  5669 acceptor_pool.cc:254] collecting diagnostics on the listening RPC socket unix:/tmp/dist-test-taskMS6r8C/test-tmp/rpc-test-acfbf98136e845d58f30a6b19a3a179c.sock every 8 connection(s)
W20260926 07:26:34.122604  5666 connection.cc:577] server connection from unix:<unnamed>: received bad data: 'Corruption: Invalid packet: message had a length of 2147483710, but we only support messages up to 2147483647 bytes
'
W20260926 07:26:34.122998  5682 connection.cc:196] Error closing socket: Network error: TlsSocket::Close: Broken pipe
[       OK ] Parameters/TestRpc.TestRpcSidecarLimits/SSL_UnixSocket (6754 ms)
[ RUN      ] Parameters/TestRpc.TestCallTimeoutDoesntAffectNegotiation/SSL_UnixSocket
I20260926 07:26:34.139961  5694 acceptor_pool.cc:254] collecting diagnostics on the listening RPC socket unix:/tmp/dist-test-taskMS6r8C/test-tmp/rpc-test-f86f290ead2348dcb66e9b49577ba54f.sock every 8 connection(s)
I20260926 07:26:34.140085  5695 acceptor_pool.cc:254] collecting diagnostics on the listening RPC socket unix:/tmp/dist-test-taskMS6r8C/test-tmp/rpc-test-f86f290ead2348dcb66e9b49577ba54f.sock every 8 connection(s)
W20260926 07:26:34.156893  5689 negotiation.cc:266] Injecting 500ms delay in negotiation
I20260926 07:26:34.207125  5402 rpc-test-base.h:595] status: Timed out: connection negotiation to unix:/tmp/dist-test-taskMS6r8C/test-tmp/rpc-test-f86f290ead2348dcb66e9b49577ba54f.sock for RPC Sleep timed out after 0.050s (ON_OUTBOUND_QUEUE), seconds elapsed: 0.0507779
[       OK ] Parameters/TestRpc.TestCallTimeoutDoesntAffectNegotiation/SSL_UnixSocket (542 ms)
[ RUN      ] Parameters/TestRpc.TestRpcHandlerLatencyMetric/SSL_UnixSocket
I20260926 07:26:34.682454  5719 acceptor_pool.cc:254] collecting diagnostics on the listening RPC socket unix:/tmp/dist-test-taskMS6r8C/test-tmp/rpc-test-27386a423d4d47d3bcb47bad64a1370c.sock every 8 connection(s)
I20260926 07:26:34.682490  5720 acceptor_pool.cc:254] collecting diagnostics on the listening RPC socket unix:/tmp/dist-test-taskMS6r8C/test-tmp/rpc-test-27386a423d4d47d3bcb47bad64a1370c.sock every 8 connection(s)
I20260926 07:26:34.724977  5402 rpc-test.cc:1236] Sleep() min lat: 20422
I20260926 07:26:34.725052  5402 rpc-test.cc:1237] Sleep() mean lat: 20422
I20260926 07:26:34.725142  5402 rpc-test.cc:1238] Sleep() max lat: 20422
I20260926 07:26:34.725199  5402 rpc-test.cc:1239] Sleep() #calls: 1
[       OK ] Parameters/TestRpc.TestRpcHandlerLatencyMetric/SSL_UnixSocket (59 ms)
[ RUN      ] Parameters/TestRpc.TimedOutOnResponseMetricServiceQueue/SSL_UnixSocket
I20260926 07:26:34.735317  5745 acceptor_pool.cc:254] collecting diagnostics on the listening RPC socket unix:/tmp/dist-test-taskMS6r8C/test-tmp/rpc-test-223d408f73ee4d9a958ff480acd83151.sock every 8 connection(s)
I20260926 07:26:34.735365  5746 acceptor_pool.cc:254] collecting diagnostics on the listening RPC socket unix:/tmp/dist-test-taskMS6r8C/test-tmp/rpc-test-223d408f73ee4d9a958ff480acd83151.sock every 8 connection(s)
W20260926 07:26:34.787905  5747 rpcz_store.cc:267] Call kudu.rpc_test.CalculatorService.Sleep from unix:<unnamed> (request call id 2) took 20 ms (client timeout 20 ms). Trace:
W20260926 07:26:34.788012  5747 rpcz_store.cc:269] 0926 07:26:34.767467 (+     0us) service_pool.cc:170] Inserting onto call queue
0926 07:26:34.787835 (+ 20368us) service_pool.cc:214] Skipping call since client already timed out
0926 07:26:34.787865 (+    30us) inbound_call.cc:173] Queueing failure response
Metrics: {}
W20260926 07:26:34.788940  5742 connection.cc:196] Error closing socket: Network error: TlsSocket::Close: Broken pipe
[       OK ] Parameters/TestRpc.TimedOutOnResponseMetricServiceQueue/SSL_UnixSocket (62 ms)
[ RUN      ] Parameters/TestRpc.RpcPendingConnectionsMetric/SSL_UnixSocket
I20260926 07:26:34.792752  5768 acceptor_pool.cc:254] collecting diagnostics on the listening RPC socket 0.0.0.0:36103 every 8 connection(s)
I20260926 07:26:34.792784  5769 acceptor_pool.cc:254] collecting diagnostics on the listening RPC socket 0.0.0.0:36103 every 8 connection(s)
W20260926 07:26:34.794070  5764 negotiation.cc:337] Failed RPC negotiation. Trace:
0926 07:26:34.793636 (+     0us) reactor.cc:625] Submitting negotiation task for server connection from 127.0.0.1:48526 (local address 127.0.0.1:36103)
0926 07:26:34.793762 (+   126us) server_negotiation.cc:206] Beginning negotiation
0926 07:26:34.793767 (+     5us) server_negotiation.cc:399] Waiting for connection header
0926 07:26:34.793869 (+   102us) negotiation.cc:327] Negotiation complete: Network error: Server connection negotiation failed: server connection from 127.0.0.1:48526: BlockingRecv error: recv got EOF from 127.0.0.1:48526 (error 108)
Metrics: {"server-negotiator.queue_time_us":47}
[       OK ] Parameters/TestRpc.RpcPendingConnectionsMetric/SSL_UnixSocket (14 ms)
[ RUN      ] Parameters/TestRpc.TestRpcContextClientDeadline/SSL_UnixSocket
I20260926 07:26:34.810760  5784 acceptor_pool.cc:254] collecting diagnostics on the listening RPC socket unix:/tmp/dist-test-taskMS6r8C/test-tmp/rpc-test-f6f7bb07808a4a1681ec50236f5e992d.sock every 8 connection(s)
I20260926 07:26:34.810763  5785 acceptor_pool.cc:254] collecting diagnostics on the listening RPC socket unix:/tmp/dist-test-taskMS6r8C/test-tmp/rpc-test-f6f7bb07808a4a1681ec50236f5e992d.sock every 8 connection(s)
W20260926 07:26:34.848181  5781 connection.cc:196] Error closing socket: Network error: TlsSocket::Close: Broken pipe
[       OK ] Parameters/TestRpc.TestRpcContextClientDeadline/SSL_UnixSocket (44 ms)
[ RUN      ] Parameters/TestRpc.TestApplicationFeatureFlagUnsupportedServer/SSL_UnixSocket
I20260926 07:26:34.867259  5809 acceptor_pool.cc:254] collecting diagnostics on the listening RPC socket unix:/tmp/dist-test-taskMS6r8C/test-tmp/rpc-test-4f190193bb2f455bb9dea08cde300823.sock every 8 connection(s)
I20260926 07:26:34.867275  5810 acceptor_pool.cc:254] collecting diagnostics on the listening RPC socket unix:/tmp/dist-test-taskMS6r8C/test-tmp/rpc-test-4f190193bb2f455bb9dea08cde300823.sock every 8 connection(s)
W20260926 07:26:34.885329  5806 connection.cc:196] Error closing socket: Network error: TlsSocket::Close: Broken pipe
[       OK ] Parameters/TestRpc.TestApplicationFeatureFlagUnsupportedServer/SSL_UnixSocket (37 ms)
[ RUN      ] Parameters/TestRpc.TestCancellationAsync/SSL_UnixSocket
I20260926 07:26:34.897069  5834 acceptor_pool.cc:254] collecting diagnostics on the listening RPC socket unix:/tmp/dist-test-taskMS6r8C/test-tmp/rpc-test-f614a2eb7b0b4d2499488e63013d615c.sock every 8 connection(s)
I20260926 07:26:34.897118  5835 acceptor_pool.cc:254] collecting diagnostics on the listening RPC socket unix:/tmp/dist-test-taskMS6r8C/test-tmp/rpc-test-f614a2eb7b0b4d2499488e63013d615c.sock every 8 connection(s)
I20260926 07:26:34.897444  5402 rpc-test.cc:1716] Connecting to unix:/tmp/dist-test-taskMS6r8C/test-tmp/rpc-test-f614a2eb7b0b4d2499488e63013d615c.sock
I20260926 07:26:34.925360  5402 test_util.cc:268] Using random seed: -1062019795
I20260926 07:26:34.940917  5838 rpc-test-base.h:240] got call: sleep_micros: 500 pattern: 4294967295 num_repetitions: 2097152 sidecar_idx: 0
I20260926 07:26:34.958969  5837 rpc-test-base.h:240] got call: sleep_micros: 500 pattern: 4294967295 num_repetitions: 2097152 sidecar_idx: 0
I20260926 07:26:34.980309  5838 rpc-test-base.h:240] got call: sleep_micros: 500 pattern: 4294967295 num_repetitions: 2097152 sidecar_idx: 0
I20260926 07:26:34.997560  5837 rpc-test-base.h:240] got call: sleep_micros: 500 pattern: 4294967295 num_repetitions: 2097152 sidecar_idx: 0
I20260926 07:26:35.013911  5838 rpc-test-base.h:240] got call: sleep_micros: 500 pattern: 4294967295 num_repetitions: 2097152 sidecar_idx: 0
I20260926 07:26:35.029740  5837 rpc-test-base.h:240] got call: sleep_micros: 500 pattern: 4294967295 num_repetitions: 2097152 sidecar_idx: 0
I20260926 07:26:35.045814  5838 rpc-test-base.h:240] got call: sleep_micros: 500 pattern: 4294967295 num_repetitions: 2097152 sidecar_idx: 0
I20260926 07:26:35.061545  5837 rpc-test-base.h:240] got call: sleep_micros: 500 pattern: 4294967295 num_repetitions: 2097152 sidecar_idx: 0
W20260926 07:26:35.063460  5831 connection.cc:196] Error closing socket: Network error: TlsSocket::Close: Broken pipe
W20260926 07:26:35.069541  5831 connection.cc:441] server connection from unix:<unnamed> torn down before Call kudu.rpc.GenericCalculatorService.SleepWithSidecar from unix:<unnamed> (request call id 8) could send its response
W20260926 07:26:35.081051  5831 connection.cc:441] server connection from unix:<unnamed> torn down before Call kudu.rpc.GenericCalculatorService.SleepWithSidecar from unix:<unnamed> (request call id 9) could send its response
[       OK ] Parameters/TestRpc.TestCancellationAsync/SSL_UnixSocket (195 ms)
[ RUN      ] Parameters/TestRpc.TestPerformanceBySocketType/SSL_UnixSocket
I20260926 07:26:35.096421  5860 acceptor_pool.cc:254] collecting diagnostics on the listening RPC socket unix:/tmp/dist-test-taskMS6r8C/test-tmp/rpc-test-77926f1669144ce9837b15d6c8bc04d6.sock every 8 connection(s)
I20260926 07:26:35.096434  5859 acceptor_pool.cc:254] collecting diagnostics on the listening RPC socket unix:/tmp/dist-test-taskMS6r8C/test-tmp/rpc-test-77926f1669144ce9837b15d6c8bc04d6.sock every 8 connection(s)
I20260926 07:26:35.096716  5402 rpc-test.cc:1846] Connecting to unix:/tmp/dist-test-taskMS6r8C/test-tmp/rpc-test-77926f1669144ce9837b15d6c8bc04d6.sock
I20260926 07:26:36.745899  5402 rpc-test.cc:1859] Sending 1024MB via ssl-enabled unix socket: real 1.644s	user 2.031s	sys 0.931s
I20260926 07:26:38.477370  5402 rpc-test.cc:1859] Sending 1024MB via ssl-enabled unix socket: real 1.731s	user 2.207s	sys 0.889s
I20260926 07:26:40.058657  5402 rpc-test.cc:1859] Sending 1024MB via ssl-enabled unix socket: real 1.581s	user 2.034s	sys 0.823s
I20260926 07:26:41.699220  5402 rpc-test.cc:1859] Sending 1024MB via ssl-enabled unix socket: real 1.640s	user 2.008s	sys 0.954s
I20260926 07:26:43.341708  5402 rpc-test.cc:1859] Sending 1024MB via ssl-enabled unix socket: real 1.642s	user 1.929s	sys 1.030s
W20260926 07:26:43.342484  5856 connection.cc:196] Error closing socket: Network error: TlsSocket::Close: Broken pipe
[       OK ] Parameters/TestRpc.TestPerformanceBySocketType/SSL_UnixSocket (8261 ms)
[----------] 20 tests from Parameters/TestRpc (31201 ms total)

[----------] 1 test from Parameters/TestRpcSocketTxRxQueue
[ RUN      ] Parameters/TestRpcSocketTxRxQueue.AcceptorRxQueueSizeMetric/0
I20260926 07:26:43.352198  5884 acceptor_pool.cc:254] collecting diagnostics on the listening RPC socket 0.0.0.0:35723 every 1 connection(s)
I20260926 07:26:43.352247  5885 acceptor_pool.cc:254] collecting diagnostics on the listening RPC socket 0.0.0.0:35723 every 1 connection(s)
W20260926 07:26:43.353220  5880 negotiation.cc:337] Failed RPC negotiation. Trace:
0926 07:26:43.352850 (+     0us) reactor.cc:625] Submitting negotiation task for server connection from 127.0.0.1:35386 (local address 127.0.0.1:35723)
0926 07:26:43.352987 (+   137us) server_negotiation.cc:206] Beginning negotiation
0926 07:26:43.352990 (+     3us) server_negotiation.cc:399] Waiting for connection header
0926 07:26:43.353139 (+   149us) negotiation.cc:327] Negotiation complete: Network error: Server connection negotiation failed: server connection from 127.0.0.1:35386: BlockingRecv error: recv got EOF from 127.0.0.1:35386 (error 108)
Metrics: {"server-negotiator.queue_time_us":37}
[       OK ] Parameters/TestRpcSocketTxRxQueue.AcceptorRxQueueSizeMetric/0 (10 ms)
[----------] 1 test from Parameters/TestRpcSocketTxRxQueue (10 ms total)

[----------] Global test environment tear-down
[==========] 21 tests from 2 test suites ran. (31212 ms total)
[  PASSED  ] 20 tests.
[  FAILED  ] 1 test, listed below:
[  FAILED  ] Parameters/TestRpc.TestCallWithChainCertAndChainCA/SSL_UnixSocket, where GetParam() = (true, true)

 1 FAILED TEST