Diagnosed failure

Parameters/TestRpc.TestCallWithChainCertAndChainCA/SSL_TCP: /data0/somelongdirectorytoavoidrpathissues/src/kudu/src/kudu/rpc/rpc-test.cc:270: Failure
Failed
Bad status: Runtime error: could not verify certificate chain (error with cert: subject=CN = localhost, ST = sadfjas, C = AS, emailAddress = sdflkdsajf, O = lskdfjlsad, OU = sldfkja, issuer=C = AS, ST = ASDfkjdhf, L = lskdjf, O = saldfja, OU = skdjf, CN = localhost, emailAddress = sadjflkadsj): : certificate has expired
Google Test trace:
/data0/somelongdirectorytoavoidrpathissues/src/kudu/src/kudu/rpc/rpc-test.cc:267: Connecting to 0.0.0.0:42817
I20260928 14:54:46.562881  1097 test_util.cc:175] -----------------------------------------------
I20260928 14:54:46.562937  1097 test_util.cc:176] Had fatal failures, leaving test files at /tmp/dist-test-taskjGbqfB/test-tmp/rpc-test.5.Parameters_TestRpc.TestCallWithChainCertAndChainCA_SSL_TCP.1790607286480269-1097-0

Full log

Note: This is test shard 6 of 8.
[==========] Running 21 tests from 2 test suites.
[----------] Global test environment set-up.
[----------] 20 tests from Parameters/TestRpc
[ RUN      ] Parameters/TestRpc.TestMessengerCreateDestroy/SSL_TCP
WARNING: Logging before InitGoogleLogging() is written to STDERR
I20260928 14:54:46.503031  1097 rpc-test.cc:169] started messenger TestCreateDestroy
[       OK ] Parameters/TestRpc.TestMessengerCreateDestroy/SSL_TCP (21 ms)
[ RUN      ] Parameters/TestRpc.TestNegotiationDeadlock/SSL_TCP
I20260928 14:54:46.541626  1117 acceptor_pool.cc:254] collecting diagnostics on the listening RPC socket 0.0.0.0:43427 every 8 connection(s)
I20260928 14:54:46.541627  1118 acceptor_pool.cc:254] collecting diagnostics on the listening RPC socket 0.0.0.0:43427 every 8 connection(s)
[       OK ] Parameters/TestRpc.TestNegotiationDeadlock/SSL_TCP (44 ms)
[ RUN      ] Parameters/TestRpc.TestCallWithChainCertAndChainCA/SSL_TCP
I20260928 14:54:46.559048  1133 acceptor_pool.cc:254] collecting diagnostics on the listening RPC socket 0.0.0.0:42817 every 8 connection(s)
I20260928 14:54:46.559077  1134 acceptor_pool.cc:254] collecting diagnostics on the listening RPC socket 0.0.0.0:42817 every 8 connection(s)
/data0/somelongdirectorytoavoidrpathissues/src/kudu/src/kudu/rpc/rpc-test.cc:270: Failure
Failed
Bad status: Runtime error: could not verify certificate chain (error with cert: subject=CN = localhost, ST = sadfjas, C = AS, emailAddress = sdflkdsajf, O = lskdfjlsad, OU = sldfkja, issuer=C = AS, ST = ASDfkjdhf, L = lskdjf, O = saldfja, OU = skdjf, CN = localhost, emailAddress = sadjflkadsj): : certificate has expired
Google Test trace:
/data0/somelongdirectorytoavoidrpathissues/src/kudu/src/kudu/rpc/rpc-test.cc:267: Connecting to 0.0.0.0:42817
I20260928 14:54:46.562881  1097 test_util.cc:175] -----------------------------------------------
I20260928 14:54:46.562937  1097 test_util.cc:176] Had fatal failures, leaving test files at /tmp/dist-test-taskjGbqfB/test-tmp/rpc-test.5.Parameters_TestRpc.TestCallWithChainCertAndChainCA_SSL_TCP.1790607286480269-1097-0
[  FAILED  ] Parameters/TestRpc.TestCallWithChainCertAndChainCA/SSL_TCP, where GetParam() = (true, false) (14 ms)
[ RUN      ] Parameters/TestRpc.TestCallWithPasswordProtectedKey/SSL_TCP
I20260928 14:54:46.577270  1158 acceptor_pool.cc:254] collecting diagnostics on the listening RPC socket 0.0.0.0:39995 every 8 connection(s)
I20260928 14:54:46.577296  1159 acceptor_pool.cc:254] collecting diagnostics on the listening RPC socket 0.0.0.0:39995 every 8 connection(s)
[       OK ] Parameters/TestRpc.TestCallWithPasswordProtectedKey/SSL_TCP (26 ms)
[ RUN      ] Parameters/TestRpc.TestCallToBadServer/SSL_TCP
I20260928 14:54:46.602983  1097 rpc-test.cc:394] Status: Network error: Client connection negotiation failed: client connection to 0.0.0.0:0: connect: Connection refused (error 111)
I20260928 14:54:46.603269  1097 rpc-test.cc:394] Status: Network error: Client connection negotiation failed: client connection to 0.0.0.0:0: connect: Connection refused (error 111)
I20260928 14:54:46.603489  1097 rpc-test.cc:394] Status: Network error: Client connection negotiation failed: client connection to 0.0.0.0:0: connect: Connection refused (error 111)
I20260928 14:54:46.603685  1097 rpc-test.cc:394] Status: Network error: Client connection negotiation failed: client connection to 0.0.0.0:0: connect: Connection refused (error 111)
I20260928 14:54:46.603847  1097 rpc-test.cc:394] Status: Network error: Client connection negotiation failed: client connection to 0.0.0.0:0: connect: Connection refused (error 111)
[       OK ] Parameters/TestRpc.TestCallToBadServer/SSL_TCP (14 ms)
[ RUN      ] Parameters/TestRpc.TestWrongService/SSL_TCP
I20260928 14:54:46.622117  1193 acceptor_pool.cc:254] collecting diagnostics on the listening RPC socket 0.0.0.0:39511 every 8 connection(s)
I20260928 14:54:46.622152  1194 acceptor_pool.cc:254] collecting diagnostics on the listening RPC socket 0.0.0.0:39511 every 8 connection(s)
I20260928 14:54:46.641772  1192 messenger.cc:345] service WrongServiceName not registered on TestServer
[       OK ] Parameters/TestRpc.TestWrongService/SSL_TCP (38 ms)
[ RUN      ] Parameters/TestRpc.TestConnectionKeepalive/SSL_TCP
I20260928 14:54:46.661366  1216 acceptor_pool.cc:254] collecting diagnostics on the listening RPC socket 0.0.0.0:35425 every 8 connection(s)
I20260928 14:54:46.661386  1217 acceptor_pool.cc:254] collecting diagnostics on the listening RPC socket 0.0.0.0:35425 every 8 connection(s)
I20260928 14:54:46.661532  1097 rpc-test.cc:488] Connecting to 0.0.0.0:35425
[       OK ] Parameters/TestRpc.TestConnectionKeepalive/SSL_TCP (1050 ms)
[ RUN      ] Parameters/TestRpc.TestClientConnectionMetrics/SSL_TCP
I20260928 14:54:47.708992  1242 acceptor_pool.cc:254] collecting diagnostics on the listening RPC socket 0.0.0.0:38851 every 8 connection(s)
I20260928 14:54:47.708952  1241 acceptor_pool.cc:254] collecting diagnostics on the listening RPC socket 0.0.0.0:38851 every 8 connection(s)
I20260928 14:54:47.709108  1097 rpc-test.cc:569] Connecting to 0.0.0.0:38851
[       OK ] Parameters/TestRpc.TestClientConnectionMetrics/SSL_TCP (9755 ms)
[ RUN      ] Parameters/TestRpc.TestCredentialsPolicy/SSL_TCP
I20260928 14:54:57.503022  1264 acceptor_pool.cc:254] collecting diagnostics on the listening RPC socket 0.0.0.0:44501 every 8 connection(s)
I20260928 14:54:57.503051  1265 acceptor_pool.cc:254] collecting diagnostics on the listening RPC socket 0.0.0.0:44501 every 8 connection(s)
I20260928 14:54:57.503175  1097 rpc-test.cc:700] Connecting to 0.0.0.0:44501
[       OK ] Parameters/TestRpc.TestCredentialsPolicy/SSL_TCP (86 ms)
[ RUN      ] Parameters/TestRpc.TestCallLongerThanKeepalive/SSL_TCP
I20260928 14:54:57.550518  1289 acceptor_pool.cc:254] collecting diagnostics on the listening RPC socket 0.0.0.0:33547 every 8 connection(s)
I20260928 14:54:57.550561  1290 acceptor_pool.cc:254] collecting diagnostics on the listening RPC socket 0.0.0.0:33547 every 8 connection(s)
I20260928 14:54:57.557683  1292 rpc-test-base.h:222] got call: sleep_micros: 3000000 deferred: true
I20260928 14:55:00.558359  1292 rpcz_store.cc:275] Call kudu.rpc.GenericCalculatorService.Sleep from 127.0.0.1:36220 (request call id 0) took 3000 ms. Trace:
I20260928 14:55:00.558466  1292 rpcz_store.cc:276] 0928 14:54:57.557633 (+     0us) service_pool.cc:170] Inserting onto call queue
0928 14:54:57.557665 (+    32us) service_pool.cc:227] Handling call
0928 14:55:00.558341 (+3000676us) inbound_call.cc:173] Queueing success response
Metrics: {}
[       OK ] Parameters/TestRpc.TestCallLongerThanKeepalive/SSL_TCP (3025 ms)
[ RUN      ] Parameters/TestRpc.TestRpcSidecar/SSL_TCP
I20260928 14:55:00.582536  1314 acceptor_pool.cc:254] collecting diagnostics on the listening RPC socket 0.0.0.0:46831 every 8 connection(s)
I20260928 14:55:00.582578  1315 acceptor_pool.cc:254] collecting diagnostics on the listening RPC socket 0.0.0.0:46831 every 8 connection(s)
[       OK ] Parameters/TestRpc.TestRpcSidecar/SSL_TCP (78 ms)
[ RUN      ] Parameters/TestRpc.TestRpcSidecarLimits/SSL_TCP
I20260928 14:55:03.297271  1339 acceptor_pool.cc:254] collecting diagnostics on the listening RPC socket 0.0.0.0:45163 every 8 connection(s)
I20260928 14:55:03.297335  1340 acceptor_pool.cc:254] collecting diagnostics on the listening RPC socket 0.0.0.0:45163 every 8 connection(s)
W20260928 14:55:03.303769  1097 serialization.cc:72] Serialized kudu.rpc_test.PushStringsRequestPB (2147483654 bytes) is larger than the maximum configured RPC message size (52428800 bytes). Sending anyway, but peer may reject the data.
W20260928 14:55:03.306874  1338 connection.cc:535] server connection from 127.0.0.1:53036 recv error: Network error: RPC frame had a length of 2147483714, but we only support messages up to 52428800 bytes long.
W20260928 14:55:03.306947  1338 connection.cc:158] shutting down server connection from 127.0.0.1:53036 with pending inbound data: 4/2147483714 bytes received; last active 0 ns ago: status Network error: RPC frame had a length of 2147483714, but we only support messages up to 52428800 bytes long.
W20260928 14:55:03.307163  1352 connection.cc:196] Error closing socket: Network error: TlsSocket::Close: Connection reset by peer
I20260928 14:55:03.327133  1365 acceptor_pool.cc:254] collecting diagnostics on the listening RPC socket 0.0.0.0:40239 every 8 connection(s)
I20260928 14:55:03.327133  1364 acceptor_pool.cc:254] collecting diagnostics on the listening RPC socket 0.0.0.0:40239 every 8 connection(s)
W20260928 14:55:08.816649  1361 connection.cc:577] server connection from 127.0.0.1:38562: received bad data: 'Corruption: Invalid packet: message had a length of 2147483710, but we only support messages up to 2147483647 bytes
'
[       OK ] Parameters/TestRpc.TestRpcSidecarLimits/SSL_TCP (8178 ms)
[ RUN      ] Parameters/TestRpc.TestCallTimeoutDoesntAffectNegotiation/SSL_TCP
I20260928 14:55:08.824383  1390 acceptor_pool.cc:254] collecting diagnostics on the listening RPC socket 0.0.0.0:38995 every 8 connection(s)
I20260928 14:55:08.824404  1389 acceptor_pool.cc:254] collecting diagnostics on the listening RPC socket 0.0.0.0:38995 every 8 connection(s)
W20260928 14:55:08.834522  1385 negotiation.cc:266] Injecting 500ms delay in negotiation
I20260928 14:55:08.884810  1097 rpc-test-base.h:595] status: Timed out: connection negotiation to 0.0.0.0:38995 for RPC Sleep timed out after 0.050s (ON_OUTBOUND_QUEUE), seconds elapsed: 0.0506301
[       OK ] Parameters/TestRpc.TestCallTimeoutDoesntAffectNegotiation/SSL_TCP (520 ms)
[ RUN      ] Parameters/TestRpc.TestRpcHandlerLatencyMetric/SSL_TCP
I20260928 14:55:09.361462  1414 acceptor_pool.cc:254] collecting diagnostics on the listening RPC socket 0.0.0.0:41555 every 8 connection(s)
I20260928 14:55:09.361462  1415 acceptor_pool.cc:254] collecting diagnostics on the listening RPC socket 0.0.0.0:41555 every 8 connection(s)
I20260928 14:55:09.398888  1097 rpc-test.cc:1236] Sleep() min lat: 20277
I20260928 14:55:09.398964  1097 rpc-test.cc:1237] Sleep() mean lat: 20277
I20260928 14:55:09.398991  1097 rpc-test.cc:1238] Sleep() max lat: 20277
I20260928 14:55:09.399003  1097 rpc-test.cc:1239] Sleep() #calls: 1
[       OK ] Parameters/TestRpc.TestRpcHandlerLatencyMetric/SSL_TCP (61 ms)
[ RUN      ] Parameters/TestRpc.TimedOutOnResponseMetricServiceQueue/SSL_TCP
I20260928 14:55:09.422020  1440 acceptor_pool.cc:254] collecting diagnostics on the listening RPC socket 0.0.0.0:35083 every 8 connection(s)
I20260928 14:55:09.422040  1441 acceptor_pool.cc:254] collecting diagnostics on the listening RPC socket 0.0.0.0:35083 every 8 connection(s)
W20260928 14:55:09.476007  1442 rpcz_store.cc:267] Call kudu.rpc_test.CalculatorService.Sleep from 127.0.0.1:54368 (request call id 2) took 20 ms (client timeout 20 ms). Trace:
W20260928 14:55:09.476099  1442 rpcz_store.cc:269] 0928 14:55:09.455648 (+     0us) service_pool.cc:170] Inserting onto call queue
0928 14:55:09.475958 (+ 20310us) service_pool.cc:214] Skipping call since client already timed out
0928 14:55:09.475969 (+    11us) inbound_call.cc:173] Queueing failure response
Metrics: {}
[       OK ] Parameters/TestRpc.TimedOutOnResponseMetricServiceQueue/SSL_TCP (76 ms)
[ RUN      ] Parameters/TestRpc.RpcPendingConnectionsMetric/SSL_TCP
I20260928 14:55:09.479180  1463 acceptor_pool.cc:254] collecting diagnostics on the listening RPC socket 0.0.0.0:41881 every 8 connection(s)
I20260928 14:55:09.479228  1464 acceptor_pool.cc:254] collecting diagnostics on the listening RPC socket 0.0.0.0:41881 every 8 connection(s)
W20260928 14:55:09.479800  1459 negotiation.cc:337] Failed RPC negotiation. Trace:
0928 14:55:09.479618 (+     0us) reactor.cc:625] Submitting negotiation task for server connection from 127.0.0.1:46310 (local address 127.0.0.1:41881)
0928 14:55:09.479662 (+    44us) server_negotiation.cc:206] Beginning negotiation
0928 14:55:09.479668 (+     6us) server_negotiation.cc:399] Waiting for connection header
0928 14:55:09.479742 (+    74us) negotiation.cc:327] Negotiation complete: Network error: Server connection negotiation failed: server connection from 127.0.0.1:46310: BlockingRecv error: recv got EOF from 127.0.0.1:46310 (error 108)
Metrics: {"server-negotiator.queue_time_us":13}
[       OK ] Parameters/TestRpc.RpcPendingConnectionsMetric/SSL_TCP (13 ms)
[ RUN      ] Parameters/TestRpc.TestRpcContextClientDeadline/SSL_TCP
I20260928 14:55:09.503436  1479 acceptor_pool.cc:254] collecting diagnostics on the listening RPC socket 0.0.0.0:44593 every 8 connection(s)
I20260928 14:55:09.503458  1480 acceptor_pool.cc:254] collecting diagnostics on the listening RPC socket 0.0.0.0:44593 every 8 connection(s)
[       OK ] Parameters/TestRpc.TestRpcContextClientDeadline/SSL_TCP (63 ms)
[ RUN      ] Parameters/TestRpc.TestApplicationFeatureFlagUnsupportedServer/SSL_TCP
I20260928 14:55:09.565296  1504 acceptor_pool.cc:254] collecting diagnostics on the listening RPC socket 0.0.0.0:38203 every 8 connection(s)
I20260928 14:55:09.565310  1505 acceptor_pool.cc:254] collecting diagnostics on the listening RPC socket 0.0.0.0:38203 every 8 connection(s)
[       OK ] Parameters/TestRpc.TestApplicationFeatureFlagUnsupportedServer/SSL_TCP (26 ms)
[ RUN      ] Parameters/TestRpc.TestCancellationAsync/SSL_TCP
I20260928 14:55:09.598049  1529 acceptor_pool.cc:254] collecting diagnostics on the listening RPC socket 0.0.0.0:43153 every 8 connection(s)
I20260928 14:55:09.598089  1530 acceptor_pool.cc:254] collecting diagnostics on the listening RPC socket 0.0.0.0:43153 every 8 connection(s)
I20260928 14:55:09.598206  1097 rpc-test.cc:1716] Connecting to 0.0.0.0:43153
I20260928 14:55:09.605409  1097 test_util.cc:268] Using random seed: 1084164638
I20260928 14:55:09.625267  1533 rpc-test-base.h:240] got call: sleep_micros: 500 pattern: 4294967295 num_repetitions: 2097152 sidecar_idx: 0
I20260928 14:55:09.641522  1533 rpc-test-base.h:240] got call: sleep_micros: 500 pattern: 4294967295 num_repetitions: 2097152 sidecar_idx: 0
I20260928 14:55:09.658207  1533 rpc-test-base.h:240] got call: sleep_micros: 500 pattern: 4294967295 num_repetitions: 2097152 sidecar_idx: 0
I20260928 14:55:09.670701  1533 rpc-test-base.h:240] got call: sleep_micros: 500 pattern: 4294967295 num_repetitions: 2097152 sidecar_idx: 0
I20260928 14:55:09.684257  1533 rpc-test-base.h:240] got call: sleep_micros: 500 pattern: 4294967295 num_repetitions: 2097152 sidecar_idx: 0
I20260928 14:55:09.697638  1533 rpc-test-base.h:240] got call: sleep_micros: 500 pattern: 4294967295 num_repetitions: 2097152 sidecar_idx: 0
I20260928 14:55:09.710969  1533 rpc-test-base.h:240] got call: sleep_micros: 500 pattern: 4294967295 num_repetitions: 2097152 sidecar_idx: 0
I20260928 14:55:09.724761  1533 rpc-test-base.h:240] got call: sleep_micros: 500 pattern: 4294967295 num_repetitions: 2097152 sidecar_idx: 0
W20260928 14:55:09.728076  1526 connection.cc:441] server connection from 127.0.0.1:48478 torn down before Call kudu.rpc.GenericCalculatorService.SleepWithSidecar from 127.0.0.1:48478 (request call id 9) could send its response
[       OK ] Parameters/TestRpc.TestCancellationAsync/SSL_TCP (148 ms)
[ RUN      ] Parameters/TestRpc.TestPerformanceBySocketType/SSL_TCP
I20260928 14:55:09.752415  1554 acceptor_pool.cc:254] collecting diagnostics on the listening RPC socket 0.0.0.0:42493 every 8 connection(s)
I20260928 14:55:09.752451  1555 acceptor_pool.cc:254] collecting diagnostics on the listening RPC socket 0.0.0.0:42493 every 8 connection(s)
I20260928 14:55:09.752564  1097 rpc-test.cc:1846] Connecting to 0.0.0.0:42493
I20260928 14:55:11.458092  1097 rpc-test.cc:1859] Sending 1024MB via ssl-enabled tcp socket: real 1.674s	user 1.664s	sys 1.275s
I20260928 14:55:13.101189  1097 rpc-test.cc:1859] Sending 1024MB via ssl-enabled tcp socket: real 1.643s	user 1.551s	sys 1.320s
I20260928 14:55:14.759071  1097 rpc-test.cc:1859] Sending 1024MB via ssl-enabled tcp socket: real 1.658s	user 1.506s	sys 1.407s
I20260928 14:55:16.379603  1097 rpc-test.cc:1859] Sending 1024MB via ssl-enabled tcp socket: real 1.620s	user 1.474s	sys 1.379s
I20260928 14:55:18.033175  1097 rpc-test.cc:1859] Sending 1024MB via ssl-enabled tcp socket: real 1.653s	user 1.586s	sys 1.300s
[       OK ] Parameters/TestRpc.TestPerformanceBySocketType/SSL_TCP (8305 ms)
[----------] 20 tests from Parameters/TestRpc (31552 ms total)

[----------] 1 test from Parameters/TestRpcSocketTxRxQueue
[ RUN      ] Parameters/TestRpcSocketTxRxQueue.OverCapacity/0
W20260928 14:55:18.299387  1589 negotiation.cc:337] Failed RPC negotiation. Trace:
0928 14:55:18.038096 (+     0us) reactor.cc:625] Submitting negotiation task for client connection to 0.0.0.0:37063 (local address 127.0.0.1:39864)
0928 14:55:18.038143 (+    47us) negotiation.cc:107] Waiting for socket to connect
0928 14:55:18.038150 (+     7us) client_negotiation.cc:174] Beginning negotiation
0928 14:55:18.038186 (+    36us) client_negotiation.cc:252] Sending NEGOTIATE NegotiatePB request
0928 14:55:18.299233 (+261047us) negotiation.cc:327] Negotiation complete: Network error: Client connection negotiation failed: client connection to 0.0.0.0:37063: BlockingRecv error: recv error from unknown peer: Transport endpoint is not connected (error 107)
Metrics: {"client-negotiator.queue_time_us":28}
W20260928 14:55:18.299383  1598 negotiation.cc:337] Failed RPC negotiation. Trace:
0928 14:55:18.038939 (+     0us) reactor.cc:625] Submitting negotiation task for client connection to 0.0.0.0:37063 (local address 127.0.0.1:39878)
0928 14:55:18.038979 (+    40us) negotiation.cc:107] Waiting for socket to connect
0928 14:55:18.038989 (+    10us) client_negotiation.cc:174] Beginning negotiation
0928 14:55:18.039036 (+    47us) client_negotiation.cc:252] Sending NEGOTIATE NegotiatePB request
0928 14:55:18.299233 (+260197us) negotiation.cc:327] Negotiation complete: Network error: Client connection negotiation failed: client connection to 0.0.0.0:37063: BlockingRecv error: recv error from unknown peer: Transport endpoint is not connected (error 107)
Metrics: {"client-negotiator.queue_time_us":16}
W20260928 14:55:18.299407  1571 negotiation.cc:337] Failed RPC negotiation. Trace:
0928 14:55:18.036317 (+     0us) reactor.cc:625] Submitting negotiation task for client connection to 0.0.0.0:37063 (local address 127.0.0.1:39854)
0928 14:55:18.036363 (+    46us) negotiation.cc:107] Waiting for socket to connect
0928 14:55:18.036374 (+    11us) client_negotiation.cc:174] Beginning negotiation
0928 14:55:18.036425 (+    51us) client_negotiation.cc:252] Sending NEGOTIATE NegotiatePB request
0928 14:55:18.299238 (+262813us) negotiation.cc:327] Negotiation complete: Network error: Client connection negotiation failed: client connection to 0.0.0.0:37063: BlockingRecv error: recv error from unknown peer: Transport endpoint is not connected (error 107)
Metrics: {"client-negotiator.queue_time_us":18}
W20260928 14:55:18.299404  1580 negotiation.cc:337] Failed RPC negotiation. Trace:
0928 14:55:18.037301 (+     0us) reactor.cc:625] Submitting negotiation task for client connection to 0.0.0.0:37063 (local address 127.0.0.1:39860)
0928 14:55:18.037351 (+    50us) negotiation.cc:107] Waiting for socket to connect
0928 14:55:18.037359 (+     8us) client_negotiation.cc:174] Beginning negotiation
0928 14:55:18.037404 (+    45us) client_negotiation.cc:252] Sending NEGOTIATE NegotiatePB request
0928 14:55:18.299238 (+261834us) negotiation.cc:327] Negotiation complete: Network error: Client connection negotiation failed: client connection to 0.0.0.0:37063: BlockingRecv error: recv error from unknown peer: Transport endpoint is not connected (error 107)
Metrics: {"client-negotiator.queue_time_us":27}
W20260928 14:55:18.299619  1616 negotiation.cc:337] Failed RPC negotiation. Trace:
0928 14:55:18.040722 (+     0us) reactor.cc:625] Submitting negotiation task for client connection to 0.0.0.0:37063 (local address 127.0.0.1:39898)
0928 14:55:18.040755 (+    33us) negotiation.cc:107] Waiting for socket to connect
0928 14:55:18.040762 (+     7us) client_negotiation.cc:174] Beginning negotiation
0928 14:55:18.040797 (+    35us) client_negotiation.cc:252] Sending NEGOTIATE NegotiatePB request
0928 14:55:18.299478 (+258681us) negotiation.cc:327] Negotiation complete: Network error: Client connection negotiation failed: client connection to 0.0.0.0:37063: BlockingRecv error: recv error from unknown peer: Transport endpoint is not connected (error 107)
Metrics: {"client-negotiator.queue_time_us":16}
W20260928 14:55:18.299587  1607 negotiation.cc:337] Failed RPC negotiation. Trace:
0928 14:55:18.039924 (+     0us) reactor.cc:625] Submitting negotiation task for client connection to 0.0.0.0:37063 (local address 127.0.0.1:39886)
0928 14:55:18.039973 (+    49us) negotiation.cc:107] Waiting for socket to connect
0928 14:55:18.039981 (+     8us) client_negotiation.cc:174] Beginning negotiation
0928 14:55:18.040026 (+    45us) client_negotiation.cc:252] Sending NEGOTIATE NegotiatePB request
0928 14:55:18.299466 (+259440us) negotiation.cc:327] Negotiation complete: Network error: Client connection negotiation failed: client connection to 0.0.0.0:37063: BlockingRecv error: recv error from unknown peer: Transport endpoint is not connected (error 107)
Metrics: {"client-negotiator.queue_time_us":30}
[       OK ] Parameters/TestRpcSocketTxRxQueue.OverCapacity/0 (1033 ms)
[----------] 1 test from Parameters/TestRpcSocketTxRxQueue (1033 ms total)

[----------] Global test environment tear-down
[==========] 21 tests from 2 test suites ran. (32586 ms total)
[  PASSED  ] 20 tests.
[  FAILED  ] 1 test, listed below:
[  FAILED  ] Parameters/TestRpc.TestCallWithChainCertAndChainCA/SSL_TCP, where GetParam() = (true, false)

 1 FAILED TEST