Diagnosed failure
Parameters/TestRpc.TestCallWithChainCertAndChainCA/SSL_UnixSocket: /data0/somelongdirectorytoavoidrpathissues/src/kudu/src/kudu/rpc/rpc-test.cc:270: Failure
Failed
Bad status: Runtime error: could not verify certificate chain (error with cert: subject=CN = localhost, ST = sadfjas, C = AS, emailAddress = sdflkdsajf, O = lskdfjlsad, OU = sldfkja, issuer=C = AS, ST = ASDfkjdhf, L = lskdjf, O = saldfja, OU = skdjf, CN = localhost, emailAddress = sadjflkadsj): : certificate has expired
Google Test trace:
/data0/somelongdirectorytoavoidrpathissues/src/kudu/src/kudu/rpc/rpc-test.cc:267: Connecting to unix:/tmp/dist-test-taskHAOixM/test-tmp/rpc-test-6b0da8b14d4c4e31abaa1e6ae4be30dc.sock
I20260928 19:37:01.444243 843 test_util.cc:175] -----------------------------------------------
I20260928 19:37:01.444422 843 test_util.cc:176] Had fatal failures, leaving test files at /tmp/dist-test-taskHAOixM/test-tmp/rpc-test.6.Parameters_TestRpc.TestCallWithChainCertAndChainCA_SSL_UnixSocket.1790624220077518-843-0
Full log
Note: This is test shard 7 of 8.
[==========] Running 21 tests from 2 test suites.
[----------] Global test environment set-up.
[----------] 20 tests from Parameters/TestRpc
[ RUN ] Parameters/TestRpc.TestMessengerCreateDestroy/SSL_UnixSocket
WARNING: Logging before InitGoogleLogging() is written to STDERR
I20260928 19:37:00.174764 843 rpc-test.cc:169] started messenger TestCreateDestroy
[ OK ] Parameters/TestRpc.TestMessengerCreateDestroy/SSL_UnixSocket (1172 ms)
[ RUN ] Parameters/TestRpc.TestNegotiationDeadlock/SSL_UnixSocket
I20260928 19:37:01.332521 865 acceptor_pool.cc:254] collecting diagnostics on the listening RPC socket unix:/tmp/dist-test-taskHAOixM/test-tmp/rpc-test-f9c3574894314c73b35742d4ab38766c.sock every 8 connection(s)
I20260928 19:37:01.334050 866 acceptor_pool.cc:254] collecting diagnostics on the listening RPC socket unix:/tmp/dist-test-taskHAOixM/test-tmp/rpc-test-f9c3574894314c73b35742d4ab38766c.sock every 8 connection(s)
[ OK ] Parameters/TestRpc.TestNegotiationDeadlock/SSL_UnixSocket (82 ms)
[ RUN ] Parameters/TestRpc.TestCallWithChainCertAndChainCA/SSL_UnixSocket
I20260928 19:37:01.413638 881 acceptor_pool.cc:254] collecting diagnostics on the listening RPC socket unix:/tmp/dist-test-taskHAOixM/test-tmp/rpc-test-6b0da8b14d4c4e31abaa1e6ae4be30dc.sock every 8 connection(s)
I20260928 19:37:01.416173 882 acceptor_pool.cc:254] collecting diagnostics on the listening RPC socket unix:/tmp/dist-test-taskHAOixM/test-tmp/rpc-test-6b0da8b14d4c4e31abaa1e6ae4be30dc.sock every 8 connection(s)
/data0/somelongdirectorytoavoidrpathissues/src/kudu/src/kudu/rpc/rpc-test.cc:270: Failure
Failed
Bad status: Runtime error: could not verify certificate chain (error with cert: subject=CN = localhost, ST = sadfjas, C = AS, emailAddress = sdflkdsajf, O = lskdfjlsad, OU = sldfkja, issuer=C = AS, ST = ASDfkjdhf, L = lskdjf, O = saldfja, OU = skdjf, CN = localhost, emailAddress = sadjflkadsj): : certificate has expired
Google Test trace:
/data0/somelongdirectorytoavoidrpathissues/src/kudu/src/kudu/rpc/rpc-test.cc:267: Connecting to unix:/tmp/dist-test-taskHAOixM/test-tmp/rpc-test-6b0da8b14d4c4e31abaa1e6ae4be30dc.sock
I20260928 19:37:01.444243 843 test_util.cc:175] -----------------------------------------------
I20260928 19:37:01.444422 843 test_util.cc:176] Had fatal failures, leaving test files at /tmp/dist-test-taskHAOixM/test-tmp/rpc-test.6.Parameters_TestRpc.TestCallWithChainCertAndChainCA_SSL_UnixSocket.1790624220077518-843-0
[ FAILED ] Parameters/TestRpc.TestCallWithChainCertAndChainCA/SSL_UnixSocket, where GetParam() = (true, true) (58 ms)
[ RUN ] Parameters/TestRpc.TestCallWithPasswordProtectedKey/SSL_UnixSocket
I20260928 19:37:01.470139 906 acceptor_pool.cc:254] collecting diagnostics on the listening RPC socket unix:/tmp/dist-test-taskHAOixM/test-tmp/rpc-test-9ebd7322d2754a8b9ee3b47742f70092.sock every 8 connection(s)
I20260928 19:37:01.470862 907 acceptor_pool.cc:254] collecting diagnostics on the listening RPC socket unix:/tmp/dist-test-taskHAOixM/test-tmp/rpc-test-9ebd7322d2754a8b9ee3b47742f70092.sock every 8 connection(s)
W20260928 19:37:01.513819 903 connection.cc:196] Error closing socket: Network error: TlsSocket::Close: Broken pipe
[ OK ] Parameters/TestRpc.TestCallWithPasswordProtectedKey/SSL_UnixSocket (75 ms)
[ RUN ] Parameters/TestRpc.TestCallToBadServer/SSL_UnixSocket
I20260928 19:37:01.557075 843 rpc-test.cc:394] Status: Network error: Client connection negotiation failed: client connection to 0.0.0.0:0: connect: Connection refused (error 111)
I20260928 19:37:01.558545 843 rpc-test.cc:394] Status: Network error: Client connection negotiation failed: client connection to 0.0.0.0:0: connect: Connection refused (error 111)
I20260928 19:37:01.560417 843 rpc-test.cc:394] Status: Network error: Client connection negotiation failed: client connection to 0.0.0.0:0: connect: Connection refused (error 111)
I20260928 19:37:01.562371 843 rpc-test.cc:394] Status: Network error: Client connection negotiation failed: client connection to 0.0.0.0:0: connect: Connection refused (error 111)
I20260928 19:37:01.564217 843 rpc-test.cc:394] Status: Network error: Client connection negotiation failed: client connection to 0.0.0.0:0: connect: Connection refused (error 111)
[ OK ] Parameters/TestRpc.TestCallToBadServer/SSL_UnixSocket (47 ms)
[ RUN ] Parameters/TestRpc.TestWrongService/SSL_UnixSocket
I20260928 19:37:01.589783 941 acceptor_pool.cc:254] collecting diagnostics on the listening RPC socket unix:/tmp/dist-test-taskHAOixM/test-tmp/rpc-test-28ebb61989ea443aa824d369e721c805.sock every 8 connection(s)
I20260928 19:37:01.590684 942 acceptor_pool.cc:254] collecting diagnostics on the listening RPC socket unix:/tmp/dist-test-taskHAOixM/test-tmp/rpc-test-28ebb61989ea443aa824d369e721c805.sock every 8 connection(s)
I20260928 19:37:01.652809 938 messenger.cc:345] service WrongServiceName not registered on TestServer
[ OK ] Parameters/TestRpc.TestWrongService/SSL_UnixSocket (93 ms)
[ RUN ] Parameters/TestRpc.TestConnectionKeepalive/SSL_UnixSocket
I20260928 19:37:01.690598 964 acceptor_pool.cc:254] collecting diagnostics on the listening RPC socket unix:/tmp/dist-test-taskHAOixM/test-tmp/rpc-test-131da6503ee341009ce2c6f0d5c8e17f.sock every 8 connection(s)
I20260928 19:37:01.691311 965 acceptor_pool.cc:254] collecting diagnostics on the listening RPC socket unix:/tmp/dist-test-taskHAOixM/test-tmp/rpc-test-131da6503ee341009ce2c6f0d5c8e17f.sock every 8 connection(s)
I20260928 19:37:01.694504 843 rpc-test.cc:488] Connecting to unix:/tmp/dist-test-taskHAOixM/test-tmp/rpc-test-131da6503ee341009ce2c6f0d5c8e17f.sock
W20260928 19:37:02.164083 977 connection.cc:196] Error closing socket: Network error: TlsSocket::Close: Broken pipe
[ OK ] Parameters/TestRpc.TestConnectionKeepalive/SSL_UnixSocket (1083 ms)
[ RUN ] Parameters/TestRpc.TestClientConnectionMetrics/SSL_UnixSocket
I20260928 19:37:02.766978 989 acceptor_pool.cc:254] collecting diagnostics on the listening RPC socket unix:/tmp/dist-test-taskHAOixM/test-tmp/rpc-test-e74c52549df646868b8cd028e05d13ae.sock every 8 connection(s)
I20260928 19:37:02.767702 990 acceptor_pool.cc:254] collecting diagnostics on the listening RPC socket unix:/tmp/dist-test-taskHAOixM/test-tmp/rpc-test-e74c52549df646868b8cd028e05d13ae.sock every 8 connection(s)
I20260928 19:37:02.770895 843 rpc-test.cc:569] Connecting to unix:/tmp/dist-test-taskHAOixM/test-tmp/rpc-test-e74c52549df646868b8cd028e05d13ae.sock
W20260928 19:39:22.749907 986 connection.cc:196] Error closing socket: Network error: TlsSocket::Close: Broken pipe
[ OK ] Parameters/TestRpc.TestClientConnectionMetrics/SSL_UnixSocket (140013 ms)
[ RUN ] Parameters/TestRpc.TestCredentialsPolicy/SSL_UnixSocket
I20260928 19:39:22.794910 1026 acceptor_pool.cc:254] collecting diagnostics on the listening RPC socket unix:/tmp/dist-test-taskHAOixM/test-tmp/rpc-test-eb81a2542b884c78993c951ba684f183.sock every 8 connection(s)
I20260928 19:39:22.795773 1027 acceptor_pool.cc:254] collecting diagnostics on the listening RPC socket unix:/tmp/dist-test-taskHAOixM/test-tmp/rpc-test-eb81a2542b884c78993c951ba684f183.sock every 8 connection(s)
I20260928 19:39:22.799041 843 rpc-test.cc:700] Connecting to unix:/tmp/dist-test-taskHAOixM/test-tmp/rpc-test-eb81a2542b884c78993c951ba684f183.sock
W20260928 19:39:22.833427 1025 connection.cc:196] Error closing socket: Network error: TlsSocket::Close: Broken pipe
[ OK ] Parameters/TestRpc.TestCredentialsPolicy/SSL_UnixSocket (98 ms)
[ RUN ] Parameters/TestRpc.TestCallLongerThanKeepalive/SSL_UnixSocket
I20260928 19:39:22.883494 1051 acceptor_pool.cc:254] collecting diagnostics on the listening RPC socket unix:/tmp/dist-test-taskHAOixM/test-tmp/rpc-test-25efc4f23d6446969da568a093d9ccf7.sock every 8 connection(s)
I20260928 19:39:22.884292 1052 acceptor_pool.cc:254] collecting diagnostics on the listening RPC socket unix:/tmp/dist-test-taskHAOixM/test-tmp/rpc-test-25efc4f23d6446969da568a093d9ccf7.sock every 8 connection(s)
I20260928 19:39:22.922122 1055 rpc-test-base.h:222] got call: sleep_micros: 3000000 deferred: true
I20260928 19:39:25.926354 1055 rpcz_store.cc:275] Call kudu.rpc.GenericCalculatorService.Sleep from unix:<unnamed> (request call id 0) took 3004 ms. Trace:
I20260928 19:39:25.926674 1055 rpcz_store.cc:276] 0928 19:39:22.921938 (+ 0us) service_pool.cc:170] Inserting onto call queue
0928 19:39:22.922068 (+ 130us) service_pool.cc:227] Handling call
0928 19:39:25.926304 (+3004236us) inbound_call.cc:173] Queueing success response
Metrics: {}
W20260928 19:39:25.930399 1048 connection.cc:196] Error closing socket: Network error: TlsSocket::Close: Broken pipe
[ OK ] Parameters/TestRpc.TestCallLongerThanKeepalive/SSL_UnixSocket (3080 ms)
[ RUN ] Parameters/TestRpc.TestRpcSidecar/SSL_UnixSocket
I20260928 19:39:25.975118 1076 acceptor_pool.cc:254] collecting diagnostics on the listening RPC socket unix:/tmp/dist-test-taskHAOixM/test-tmp/rpc-test-b383d8360f3a4d9b825cb91b78ddd23f.sock every 8 connection(s)
I20260928 19:39:25.975991 1077 acceptor_pool.cc:254] collecting diagnostics on the listening RPC socket unix:/tmp/dist-test-taskHAOixM/test-tmp/rpc-test-b383d8360f3a4d9b825cb91b78ddd23f.sock every 8 connection(s)
[ OK ] Parameters/TestRpc.TestRpcSidecar/SSL_UnixSocket (571 ms)
[ RUN ] Parameters/TestRpc.TestRpcSidecarLimits/SSL_UnixSocket
I20260928 19:39:43.633677 1103 acceptor_pool.cc:254] collecting diagnostics on the listening RPC socket unix:/tmp/dist-test-taskHAOixM/test-tmp/rpc-test-366d175802334ceda5424c7cb0c887c8.sock every 8 connection(s)
I20260928 19:39:43.634469 1104 acceptor_pool.cc:254] collecting diagnostics on the listening RPC socket unix:/tmp/dist-test-taskHAOixM/test-tmp/rpc-test-366d175802334ceda5424c7cb0c887c8.sock every 8 connection(s)
W20260928 19:39:43.653748 843 serialization.cc:72] Serialized kudu.rpc_test.PushStringsRequestPB (2147483654 bytes) is larger than the maximum configured RPC message size (52428800 bytes). Sending anyway, but peer may reject the data.
W20260928 19:39:43.665043 1100 connection.cc:535] server connection from unix:<unnamed> recv error: Network error: RPC frame had a length of 2147483714, but we only support messages up to 52428800 bytes long.
W20260928 19:39:43.665400 1100 connection.cc:158] shutting down server connection from unix:<unnamed> with pending inbound data: 4/2147483714 bytes received; last active 0 ns ago: status Network error: RPC frame had a length of 2147483714, but we only support messages up to 52428800 bytes long.
W20260928 19:39:43.666139 1116 connection.cc:698] client connection to unix:/tmp/dist-test-taskHAOixM/test-tmp/rpc-test-366d175802334ceda5424c7cb0c887c8.sock send error: Network error: failed to write to TLS socket: Broken pipe
W20260928 19:39:43.666863 1116 connection.cc:196] Error closing socket: Network error: TlsSocket::Close: Success
[ OK ] Parameters/TestRpc.TestRpcSidecarLimits/SSL_UnixSocket (17806 ms)
[ RUN ] Parameters/TestRpc.TestCallTimeoutDoesntAffectNegotiation/SSL_UnixSocket
I20260928 19:39:44.344172 1128 acceptor_pool.cc:254] collecting diagnostics on the listening RPC socket unix:/tmp/dist-test-taskHAOixM/test-tmp/rpc-test-03d128d3faf345e88ded2617e275b3cd.sock every 8 connection(s)
I20260928 19:39:44.344926 1129 acceptor_pool.cc:254] collecting diagnostics on the listening RPC socket unix:/tmp/dist-test-taskHAOixM/test-tmp/rpc-test-03d128d3faf345e88ded2617e275b3cd.sock every 8 connection(s)
W20260928 19:39:44.372910 1124 negotiation.cc:266] Injecting 500ms delay in negotiation
I20260928 19:39:44.422417 843 rpc-test-base.h:595] status: Timed out: connection negotiation to unix:/tmp/dist-test-taskHAOixM/test-tmp/rpc-test-03d128d3faf345e88ded2617e275b3cd.sock for RPC Sleep timed out after 0.050s (ON_OUTBOUND_QUEUE), seconds elapsed: 0.0507315
W20260928 19:39:44.885442 1125 connection.cc:196] Error closing socket: Network error: TlsSocket::Close: Broken pipe
[ OK ] Parameters/TestRpc.TestCallTimeoutDoesntAffectNegotiation/SSL_UnixSocket (574 ms)
[ RUN ] Parameters/TestRpc.TestRpcHandlerLatencyMetric/SSL_UnixSocket
I20260928 19:39:44.924283 1153 acceptor_pool.cc:254] collecting diagnostics on the listening RPC socket unix:/tmp/dist-test-taskHAOixM/test-tmp/rpc-test-2c278b4928f14c289d93ed221788dbb2.sock every 8 connection(s)
I20260928 19:39:44.924993 1154 acceptor_pool.cc:254] collecting diagnostics on the listening RPC socket unix:/tmp/dist-test-taskHAOixM/test-tmp/rpc-test-2c278b4928f14c289d93ed221788dbb2.sock every 8 connection(s)
I20260928 19:39:44.977941 843 rpc-test.cc:1236] Sleep() min lat: 21661
I20260928 19:39:44.978175 843 rpc-test.cc:1237] Sleep() mean lat: 21661
I20260928 19:39:44.978372 843 rpc-test.cc:1238] Sleep() max lat: 21661
I20260928 19:39:44.978534 843 rpc-test.cc:1239] Sleep() #calls: 1
[ OK ] Parameters/TestRpc.TestRpcHandlerLatencyMetric/SSL_UnixSocket (96 ms)
[ RUN ] Parameters/TestRpc.TimedOutOnResponseMetricServiceQueue/SSL_UnixSocket
I20260928 19:39:45.000320 1179 acceptor_pool.cc:254] collecting diagnostics on the listening RPC socket unix:/tmp/dist-test-taskHAOixM/test-tmp/rpc-test-5efff17ca4324dc1b9d02e999b6fe1c5.sock every 8 connection(s)
I20260928 19:39:45.001037 1180 acceptor_pool.cc:254] collecting diagnostics on the listening RPC socket unix:/tmp/dist-test-taskHAOixM/test-tmp/rpc-test-5efff17ca4324dc1b9d02e999b6fe1c5.sock every 8 connection(s)
W20260928 19:39:45.070530 1181 rpcz_store.cc:267] Call kudu.rpc_test.CalculatorService.Sleep from unix:<unnamed> (request call id 2) took 20 ms (client timeout 20 ms). Trace:
W20260928 19:39:45.070889 1181 rpcz_store.cc:269] 0928 19:39:45.050034 (+ 0us) service_pool.cc:170] Inserting onto call queue
0928 19:39:45.070390 (+ 20356us) service_pool.cc:214] Skipping call since client already timed out
0928 19:39:45.070476 (+ 86us) inbound_call.cc:173] Queueing failure response
Metrics: {}
[ OK ] Parameters/TestRpc.TimedOutOnResponseMetricServiceQueue/SSL_UnixSocket (92 ms)
[ RUN ] Parameters/TestRpc.RpcPendingConnectionsMetric/SSL_UnixSocket
I20260928 19:39:45.089126 1202 acceptor_pool.cc:254] collecting diagnostics on the listening RPC socket 0.0.0.0:39627 every 8 connection(s)
I20260928 19:39:45.089850 1203 acceptor_pool.cc:254] collecting diagnostics on the listening RPC socket 0.0.0.0:39627 every 8 connection(s)
W20260928 19:39:45.106542 1198 negotiation.cc:337] Failed RPC negotiation. Trace:
0928 19:39:45.104310 (+ 0us) reactor.cc:625] Submitting negotiation task for server connection from 127.0.0.1:49066 (local address 127.0.0.1:39627)
0928 19:39:45.105056 (+ 746us) server_negotiation.cc:206] Beginning negotiation
0928 19:39:45.105093 (+ 37us) server_negotiation.cc:399] Waiting for connection header
0928 19:39:45.105523 (+ 430us) negotiation.cc:327] Negotiation complete: Network error: Server connection negotiation failed: server connection from 127.0.0.1:49066: BlockingRecv error: recv got EOF from 127.0.0.1:49066 (error 108)
Metrics: {"server-negotiator.queue_time_us":168}
[ OK ] Parameters/TestRpc.RpcPendingConnectionsMetric/SSL_UnixSocket (42 ms)
[ RUN ] Parameters/TestRpc.TestRpcContextClientDeadline/SSL_UnixSocket
I20260928 19:39:45.164172 1218 acceptor_pool.cc:254] collecting diagnostics on the listening RPC socket unix:/tmp/dist-test-taskHAOixM/test-tmp/rpc-test-47ce1e11d0ec422aa77fe9c63e21e9b2.sock every 8 connection(s)
I20260928 19:39:45.164906 1219 acceptor_pool.cc:254] collecting diagnostics on the listening RPC socket unix:/tmp/dist-test-taskHAOixM/test-tmp/rpc-test-47ce1e11d0ec422aa77fe9c63e21e9b2.sock every 8 connection(s)
[ OK ] Parameters/TestRpc.TestRpcContextClientDeadline/SSL_UnixSocket (102 ms)
[ RUN ] Parameters/TestRpc.TestApplicationFeatureFlagUnsupportedServer/SSL_UnixSocket
I20260928 19:39:45.254019 1243 acceptor_pool.cc:254] collecting diagnostics on the listening RPC socket unix:/tmp/dist-test-taskHAOixM/test-tmp/rpc-test-d8f8e4754dc54900adca3f8e7a724edc.sock every 8 connection(s)
I20260928 19:39:45.254768 1244 acceptor_pool.cc:254] collecting diagnostics on the listening RPC socket unix:/tmp/dist-test-taskHAOixM/test-tmp/rpc-test-d8f8e4754dc54900adca3f8e7a724edc.sock every 8 connection(s)
[ OK ] Parameters/TestRpc.TestApplicationFeatureFlagUnsupportedServer/SSL_UnixSocket (81 ms)
[ RUN ] Parameters/TestRpc.TestCancellationAsync/SSL_UnixSocket
I20260928 19:39:45.322495 1268 acceptor_pool.cc:254] collecting diagnostics on the listening RPC socket unix:/tmp/dist-test-taskHAOixM/test-tmp/rpc-test-db0285184dd14617b8bbbff285b89eed.sock every 8 connection(s)
I20260928 19:39:45.323280 1269 acceptor_pool.cc:254] collecting diagnostics on the listening RPC socket unix:/tmp/dist-test-taskHAOixM/test-tmp/rpc-test-db0285184dd14617b8bbbff285b89eed.sock every 8 connection(s)
I20260928 19:39:45.326623 843 rpc-test.cc:1716] Connecting to unix:/tmp/dist-test-taskHAOixM/test-tmp/rpc-test-db0285184dd14617b8bbbff285b89eed.sock
I20260928 19:39:45.345712 843 test_util.cc:268] Using random seed: 980035737
I20260928 19:39:45.596114 1272 rpc-test-base.h:240] got call: sleep_micros: 500 pattern: 4294967295 num_repetitions: 2097152 sidecar_idx: 0
I20260928 19:39:45.797276 1271 rpc-test-base.h:240] got call: sleep_micros: 500 pattern: 4294967295 num_repetitions: 2097152 sidecar_idx: 0
I20260928 19:39:46.037880 1272 rpc-test-base.h:240] got call: sleep_micros: 500 pattern: 4294967295 num_repetitions: 2097152 sidecar_idx: 0
I20260928 19:39:46.261152 1271 rpc-test-base.h:240] got call: sleep_micros: 500 pattern: 4294967295 num_repetitions: 2097152 sidecar_idx: 0
I20260928 19:39:46.504530 1271 rpc-test-base.h:240] got call: sleep_micros: 500 pattern: 4294967295 num_repetitions: 2097152 sidecar_idx: 0
I20260928 19:39:46.719861 1271 rpc-test-base.h:240] got call: sleep_micros: 500 pattern: 4294967295 num_repetitions: 2097152 sidecar_idx: 0
I20260928 19:39:46.908484 1272 rpc-test-base.h:240] got call: sleep_micros: 500 pattern: 4294967295 num_repetitions: 2097152 sidecar_idx: 0
I20260928 19:39:47.137228 1271 rpc-test-base.h:240] got call: sleep_micros: 500 pattern: 4294967295 num_repetitions: 2097152 sidecar_idx: 0
I20260928 19:39:47.331281 1272 rpc-test-base.h:240] got call: sleep_micros: 500 pattern: 4294967295 num_repetitions: 2097152 sidecar_idx: 0
W20260928 19:39:47.360877 1265 connection.cc:196] Error closing socket: Network error: TlsSocket::Close: Broken pipe
W20260928 19:39:47.378304 1265 connection.cc:441] server connection from unix:<unnamed> torn down before Call kudu.rpc.GenericCalculatorService.SleepWithSidecar from unix:<unnamed> (request call id 8) could send its response
W20260928 19:39:47.468356 1265 connection.cc:441] server connection from unix:<unnamed> torn down before Call kudu.rpc.GenericCalculatorService.SleepWithSidecar from unix:<unnamed> (request call id 9) could send its response
[ OK ] Parameters/TestRpc.TestCancellationAsync/SSL_UnixSocket (2173 ms)
[ RUN ] Parameters/TestRpc.TestPerformanceBySocketType/SSL_UnixSocket
I20260928 19:39:47.575735 1293 acceptor_pool.cc:254] collecting diagnostics on the listening RPC socket unix:/tmp/dist-test-taskHAOixM/test-tmp/rpc-test-ad84c70c996c4aec8e6227287dc385c7.sock every 8 connection(s)
I20260928 19:39:47.576452 1294 acceptor_pool.cc:254] collecting diagnostics on the listening RPC socket unix:/tmp/dist-test-taskHAOixM/test-tmp/rpc-test-ad84c70c996c4aec8e6227287dc385c7.sock every 8 connection(s)
I20260928 19:39:47.579479 843 rpc-test.cc:1846] Connecting to unix:/tmp/dist-test-taskHAOixM/test-tmp/rpc-test-ad84c70c996c4aec8e6227287dc385c7.sock
I20260928 19:40:09.672727 843 rpc-test.cc:1859] Sending 1024MB via ssl-enabled unix socket: real 22.071s user 19.957s sys 13.387s
I20260928 19:40:31.675999 843 rpc-test.cc:1859] Sending 1024MB via ssl-enabled unix socket: real 22.003s user 19.960s sys 13.100s
I20260928 19:40:53.682622 843 rpc-test.cc:1859] Sending 1024MB via ssl-enabled unix socket: real 22.006s user 19.979s sys 13.243s
I20260928 19:41:15.457293 843 rpc-test.cc:1859] Sending 1024MB via ssl-enabled unix socket: real 21.774s user 19.605s sys 13.174s
I20260928 19:41:37.401391 843 rpc-test.cc:1859] Sending 1024MB via ssl-enabled unix socket: real 21.944s user 19.784s sys 13.119s
W20260928 19:41:37.407254 1290 connection.cc:196] Error closing socket: Network error: TlsSocket::Close: Broken pipe
[ OK ] Parameters/TestRpc.TestPerformanceBySocketType/SSL_UnixSocket (109940 ms)
[----------] 20 tests from Parameters/TestRpc (277289 ms total)
[----------] 1 test from Parameters/TestRpcSocketTxRxQueue
[ RUN ] Parameters/TestRpcSocketTxRxQueue.AcceptorRxQueueSizeMetric/0
I20260928 19:41:37.431325 1329 acceptor_pool.cc:254] collecting diagnostics on the listening RPC socket 0.0.0.0:32889 every 1 connection(s)
I20260928 19:41:37.432271 1330 acceptor_pool.cc:254] collecting diagnostics on the listening RPC socket 0.0.0.0:32889 every 1 connection(s)
W20260928 19:41:37.437891 1325 negotiation.cc:337] Failed RPC negotiation. Trace:
0928 19:41:37.436210 (+ 0us) reactor.cc:625] Submitting negotiation task for server connection from 127.0.0.1:50230 (local address 127.0.0.1:32889)
0928 19:41:37.436674 (+ 464us) server_negotiation.cc:206] Beginning negotiation
0928 19:41:37.436699 (+ 25us) server_negotiation.cc:399] Waiting for connection header
0928 19:41:37.436930 (+ 231us) negotiation.cc:327] Negotiation complete: Network error: Server connection negotiation failed: server connection from 127.0.0.1:50230: BlockingRecv error: recv got EOF from 127.0.0.1:50230 (error 108)
Metrics: {"server-negotiator.queue_time_us":111}
[ OK ] Parameters/TestRpcSocketTxRxQueue.AcceptorRxQueueSizeMetric/0 (24 ms)
[----------] 1 test from Parameters/TestRpcSocketTxRxQueue (24 ms total)
[----------] Global test environment tear-down
[==========] 21 tests from 2 test suites ran. (277315 ms total)
[ PASSED ] 20 tests.
[ FAILED ] 1 test, listed below:
[ FAILED ] Parameters/TestRpc.TestCallWithChainCertAndChainCA/SSL_UnixSocket, where GetParam() = (true, true)
1 FAILED TEST