Diagnosed failure

Parameters/TestRpc.TestCallWithChainCertAndRootCA/SSL_UnixSocket: /data0/somelongdirectorytoavoidrpathissues/src/kudu/src/kudu/rpc/rpc-test.cc:303: Failure
Failed
Bad status: Runtime error: could not verify certificate chain (error with cert: subject=CN = localhost, ST = sadfjas, C = AS, emailAddress = sdflkdsajf, O = lskdfjlsad, OU = sldfkja, issuer=C = AS, ST = ASDfkjdhf, L = lskdjf, O = saldfja, OU = skdjf, CN = localhost, emailAddress = sadjflkadsj): : certificate has expired
Google Test trace:
/data0/somelongdirectorytoavoidrpathissues/src/kudu/src/kudu/rpc/rpc-test.cc:300: Connecting to unix:/tmp/dist-test-taskGeLOTW/test-tmp/rpc-test-20b2afef2e464d4bab7e9ddacdddad51.sock
I20260927 23:31:13.780099  2779 test_util.cc:175] -----------------------------------------------
I20260927 23:31:13.780292  2779 test_util.cc:176] Had fatal failures, leaving test files at /tmp/dist-test-taskGeLOTW/test-tmp/rpc-test.2.Parameters_TestRpc.TestCallWithChainCertAndRootCA_SSL_UnixSocket.1790551870277835-2779-0

Full log

Note: This is test shard 3 of 8.
[==========] Running 21 tests from 2 test suites.
[----------] Global test environment set-up.
[----------] 1 test from TestRpc
[ RUN      ] TestRpc.TestNegotiationTimeout
WARNING: Logging before InitGoogleLogging() is written to STDERR
I20260927 23:31:10.464170  2779 rpc-test-base.h:595] status: Timed out: connection negotiation to 0.0.0.0:40317 for RPC Sleep timed out after 0.100s (ON_OUTBOUND_QUEUE), seconds elapsed: 0.100892
W20260927 23:31:13.486169  2789 negotiation.cc:337] Failed RPC negotiation. Trace:
0927 23:31:10.364205 (+     0us) reactor.cc:625] Submitting negotiation task for client connection to 0.0.0.0:40317 (local address 127.0.0.1:59722)
0927 23:31:10.365080 (+   875us) negotiation.cc:107] Waiting for socket to connect
0927 23:31:10.365134 (+    54us) client_negotiation.cc:174] Beginning negotiation
0927 23:31:10.377112 (+ 11978us) client_negotiation.cc:252] Sending NEGOTIATE NegotiatePB request
0927 23:31:13.485037 (+3107925us) negotiation.cc:327] Negotiation complete: Timed out: Client connection negotiation failed: client connection to 0.0.0.0:40317: received 0 of 4 requested bytes
Metrics: {"client-negotiator.queue_time_us":285}
[       OK ] TestRpc.TestNegotiationTimeout (3160 ms)
[----------] 1 test from TestRpc (3160 ms total)

[----------] 20 tests from Parameters/TestRpc
[ RUN      ] Parameters/TestRpc.TestAcceptorPoolStartStop/SSL_UnixSocket
I20260927 23:31:13.521899  2805 acceptor_pool.cc:254] collecting diagnostics on the listening RPC socket unix:/tmp/dist-test-taskGeLOTW/test-tmp/rpc-test-53c3b0f2e74e4a7e842c703998d4ef66.sock every 8 connection(s)
I20260927 23:31:13.523536  2806 acceptor_pool.cc:254] collecting diagnostics on the listening RPC socket unix:/tmp/dist-test-taskGeLOTW/test-tmp/rpc-test-53c3b0f2e74e4a7e842c703998d4ef66.sock every 8 connection(s)
I20260927 23:31:13.566890  2816 acceptor_pool.cc:254] collecting diagnostics on the listening RPC socket unix:/tmp/dist-test-taskGeLOTW/test-tmp/rpc-test-53c3b0f2e74e4a7e842c703998d4ef66.sock every 8 connection(s)
I20260927 23:31:13.568473  2817 acceptor_pool.cc:254] collecting diagnostics on the listening RPC socket unix:/tmp/dist-test-taskGeLOTW/test-tmp/rpc-test-53c3b0f2e74e4a7e842c703998d4ef66.sock every 8 connection(s)
I20260927 23:31:13.586280  2827 acceptor_pool.cc:254] collecting diagnostics on the listening RPC socket unix:/tmp/dist-test-taskGeLOTW/test-tmp/rpc-test-53c3b0f2e74e4a7e842c703998d4ef66.sock every 8 connection(s)
I20260927 23:31:13.586974  2828 acceptor_pool.cc:254] collecting diagnostics on the listening RPC socket unix:/tmp/dist-test-taskGeLOTW/test-tmp/rpc-test-53c3b0f2e74e4a7e842c703998d4ef66.sock every 8 connection(s)
I20260927 23:31:13.619202  2838 acceptor_pool.cc:254] collecting diagnostics on the listening RPC socket unix:/tmp/dist-test-taskGeLOTW/test-tmp/rpc-test-53c3b0f2e74e4a7e842c703998d4ef66.sock every 8 connection(s)
I20260927 23:31:13.620091  2839 acceptor_pool.cc:254] collecting diagnostics on the listening RPC socket unix:/tmp/dist-test-taskGeLOTW/test-tmp/rpc-test-53c3b0f2e74e4a7e842c703998d4ef66.sock every 8 connection(s)
I20260927 23:31:13.634835  2849 acceptor_pool.cc:254] collecting diagnostics on the listening RPC socket unix:/tmp/dist-test-taskGeLOTW/test-tmp/rpc-test-53c3b0f2e74e4a7e842c703998d4ef66.sock every 8 connection(s)
I20260927 23:31:13.635542  2850 acceptor_pool.cc:254] collecting diagnostics on the listening RPC socket unix:/tmp/dist-test-taskGeLOTW/test-tmp/rpc-test-53c3b0f2e74e4a7e842c703998d4ef66.sock every 8 connection(s)
[       OK ] Parameters/TestRpc.TestAcceptorPoolStartStop/SSL_UnixSocket (149 ms)
[ RUN      ] Parameters/TestRpc.TestCall/SSL_UnixSocket
I20260927 23:31:13.661938  2862 acceptor_pool.cc:254] collecting diagnostics on the listening RPC socket unix:/tmp/dist-test-taskGeLOTW/test-tmp/rpc-test-80a9e3d327ba424993beb991d3e6a94a.sock every 8 connection(s)
I20260927 23:31:13.664263  2863 acceptor_pool.cc:254] collecting diagnostics on the listening RPC socket unix:/tmp/dist-test-taskGeLOTW/test-tmp/rpc-test-80a9e3d327ba424993beb991d3e6a94a.sock every 8 connection(s)
I20260927 23:31:13.670126  2779 rpc-test.cc:234] Connecting to unix:/tmp/dist-test-taskGeLOTW/test-tmp/rpc-test-80a9e3d327ba424993beb991d3e6a94a.sock
W20260927 23:31:13.730975  2859 connection.cc:196] Error closing socket: Network error: TlsSocket::Close: Broken pipe
[       OK ] Parameters/TestRpc.TestCall/SSL_UnixSocket (96 ms)
[ RUN      ] Parameters/TestRpc.TestCallWithChainCertAndRootCA/SSL_UnixSocket
I20260927 23:31:13.757682  2887 acceptor_pool.cc:254] collecting diagnostics on the listening RPC socket unix:/tmp/dist-test-taskGeLOTW/test-tmp/rpc-test-20b2afef2e464d4bab7e9ddacdddad51.sock every 8 connection(s)
I20260927 23:31:13.758441  2888 acceptor_pool.cc:254] collecting diagnostics on the listening RPC socket unix:/tmp/dist-test-taskGeLOTW/test-tmp/rpc-test-20b2afef2e464d4bab7e9ddacdddad51.sock every 8 connection(s)
/data0/somelongdirectorytoavoidrpathissues/src/kudu/src/kudu/rpc/rpc-test.cc:303: Failure
Failed
Bad status: Runtime error: could not verify certificate chain (error with cert: subject=CN = localhost, ST = sadfjas, C = AS, emailAddress = sdflkdsajf, O = lskdfjlsad, OU = sldfkja, issuer=C = AS, ST = ASDfkjdhf, L = lskdjf, O = saldfja, OU = skdjf, CN = localhost, emailAddress = sadjflkadsj): : certificate has expired
Google Test trace:
/data0/somelongdirectorytoavoidrpathissues/src/kudu/src/kudu/rpc/rpc-test.cc:300: Connecting to unix:/tmp/dist-test-taskGeLOTW/test-tmp/rpc-test-20b2afef2e464d4bab7e9ddacdddad51.sock
I20260927 23:31:13.780099  2779 test_util.cc:175] -----------------------------------------------
I20260927 23:31:13.780292  2779 test_util.cc:176] Had fatal failures, leaving test files at /tmp/dist-test-taskGeLOTW/test-tmp/rpc-test.2.Parameters_TestRpc.TestCallWithChainCertAndRootCA_SSL_UnixSocket.1790551870277835-2779-0
[  FAILED  ] Parameters/TestRpc.TestCallWithChainCertAndRootCA/SSL_UnixSocket, where GetParam() = (true, true) (44 ms)
[ RUN      ] Parameters/TestRpc.TestCallWithBadPasswordProtectedKey/SSL_UnixSocket
[       OK ] Parameters/TestRpc.TestCallWithBadPasswordProtectedKey/SSL_UnixSocket (32 ms)
[ RUN      ] Parameters/TestRpc.TestInvalidMethodCall/SSL_UnixSocket
I20260927 23:31:13.832927  2924 acceptor_pool.cc:254] collecting diagnostics on the listening RPC socket unix:/tmp/dist-test-taskGeLOTW/test-tmp/rpc-test-6c80636e5990457996fabb16e4d469f3.sock every 8 connection(s)
I20260927 23:31:13.833799  2925 acceptor_pool.cc:254] collecting diagnostics on the listening RPC socket unix:/tmp/dist-test-taskGeLOTW/test-tmp/rpc-test-6c80636e5990457996fabb16e4d469f3.sock every 8 connection(s)
I20260927 23:31:13.837297  2779 rpc-test.cc:406] Connecting to unix:/tmp/dist-test-taskGeLOTW/test-tmp/rpc-test-6c80636e5990457996fabb16e4d469f3.sock
W20260927 23:31:13.874601  2921 connection.cc:196] Error closing socket: Network error: TlsSocket::Close: Broken pipe
[       OK ] Parameters/TestRpc.TestInvalidMethodCall/SSL_UnixSocket (66 ms)
[ RUN      ] Parameters/TestRpc.TestHighFDs/SSL_UnixSocket
I20260927 23:31:14.102840  2949 acceptor_pool.cc:254] collecting diagnostics on the listening RPC socket unix:/tmp/dist-test-taskGeLOTW/test-tmp/rpc-test-d7c6dd3884b8459093d58335df24d07b.sock every 8 connection(s)
I20260927 23:31:14.103567  2950 acceptor_pool.cc:254] collecting diagnostics on the listening RPC socket unix:/tmp/dist-test-taskGeLOTW/test-tmp/rpc-test-d7c6dd3884b8459093d58335df24d07b.sock every 8 connection(s)
W20260927 23:31:14.150509  2946 connection.cc:196] Error closing socket: Network error: TlsSocket::Close: Broken pipe
[       OK ] Parameters/TestRpc.TestHighFDs/SSL_UnixSocket (282 ms)
[ RUN      ] Parameters/TestRpc.TestConnectionAlwaysKeepalive/SSL_UnixSocket
I20260927 23:31:14.176972  2972 acceptor_pool.cc:254] collecting diagnostics on the listening RPC socket unix:/tmp/dist-test-taskGeLOTW/test-tmp/rpc-test-708a099cc22742358650b63f859a8a1d.sock every 8 connection(s)
I20260927 23:31:14.177711  2973 acceptor_pool.cc:254] collecting diagnostics on the listening RPC socket unix:/tmp/dist-test-taskGeLOTW/test-tmp/rpc-test-708a099cc22742358650b63f859a8a1d.sock every 8 connection(s)
I20260927 23:31:14.181160  2779 rpc-test.cc:532] Connecting to unix:/tmp/dist-test-taskGeLOTW/test-tmp/rpc-test-708a099cc22742358650b63f859a8a1d.sock
W20260927 23:31:17.216933  2971 connection.cc:196] Error closing socket: Network error: TlsSocket::Close: Broken pipe
[       OK ] Parameters/TestRpc.TestConnectionAlwaysKeepalive/SSL_UnixSocket (3058 ms)
[ RUN      ] Parameters/TestRpc.TestReopenOutboundConnections/SSL_UnixSocket
I20260927 23:31:17.242852  2995 acceptor_pool.cc:254] collecting diagnostics on the listening RPC socket unix:/tmp/dist-test-taskGeLOTW/test-tmp/rpc-test-99caf77960b142ebbd954ed4021b6861.sock every 8 connection(s)
I20260927 23:31:17.243569  2996 acceptor_pool.cc:254] collecting diagnostics on the listening RPC socket unix:/tmp/dist-test-taskGeLOTW/test-tmp/rpc-test-99caf77960b142ebbd954ed4021b6861.sock every 8 connection(s)
I20260927 23:31:17.246675  2779 rpc-test.cc:658] Connecting to unix:/tmp/dist-test-taskGeLOTW/test-tmp/rpc-test-99caf77960b142ebbd954ed4021b6861.sock
W20260927 23:31:17.275611  2994 connection.cc:196] Error closing socket: Network error: TlsSocket::Close: Broken pipe
W20260927 23:31:17.285219  2994 connection.cc:196] Error closing socket: Network error: TlsSocket::Close: Broken pipe
W20260927 23:31:17.295607  2994 connection.cc:196] Error closing socket: Network error: TlsSocket::Close: Broken pipe
W20260927 23:31:17.305651  2994 connection.cc:196] Error closing socket: Network error: TlsSocket::Close: Broken pipe
W20260927 23:31:17.315771  2994 connection.cc:196] Error closing socket: Network error: TlsSocket::Close: Broken pipe
W20260927 23:31:17.326274  2994 connection.cc:196] Error closing socket: Network error: TlsSocket::Close: Broken pipe
W20260927 23:31:17.336382  2994 connection.cc:196] Error closing socket: Network error: TlsSocket::Close: Broken pipe
W20260927 23:31:17.346180  2994 connection.cc:196] Error closing socket: Network error: TlsSocket::Close: Broken pipe
W20260927 23:31:17.355904  2994 connection.cc:196] Error closing socket: Network error: TlsSocket::Close: Broken pipe
W20260927 23:31:17.365397  2994 connection.cc:196] Error closing socket: Network error: TlsSocket::Close: Broken pipe
W20260927 23:31:17.374642  2994 connection.cc:196] Error closing socket: Network error: TlsSocket::Close: Broken pipe
W20260927 23:31:17.384521  2994 connection.cc:196] Error closing socket: Network error: TlsSocket::Close: Broken pipe
W20260927 23:31:17.395530  2994 connection.cc:196] Error closing socket: Network error: TlsSocket::Close: Broken pipe
W20260927 23:31:17.406334  2994 connection.cc:196] Error closing socket: Network error: TlsSocket::Close: Broken pipe
W20260927 23:31:17.406335  2995 acceptor_pool.cc:285] unable to collect diagnostics on RPC socket unix:/tmp/dist-test-taskGeLOTW/test-tmp/rpc-test-99caf77960b142ebbd954ed4021b6861.sock: Not implemented: netlink diagnostics is currently supported only on IPv4 TCP sockets
W20260927 23:31:17.417717  2994 connection.cc:196] Error closing socket: Network error: TlsSocket::Close: Broken pipe
W20260927 23:31:17.440515  2994 connection.cc:196] Error closing socket: Network error: TlsSocket::Close: Broken pipe
W20260927 23:31:17.451655  2994 connection.cc:196] Error closing socket: Network error: TlsSocket::Close: Broken pipe
W20260927 23:31:17.462867  2994 connection.cc:196] Error closing socket: Network error: TlsSocket::Close: Broken pipe
W20260927 23:31:17.474110  2994 connection.cc:196] Error closing socket: Network error: TlsSocket::Close: Broken pipe
W20260927 23:31:17.485054  2994 connection.cc:196] Error closing socket: Network error: TlsSocket::Close: Broken pipe
W20260927 23:31:17.496613  2994 connection.cc:196] Error closing socket: Network error: TlsSocket::Close: Broken pipe
W20260927 23:31:17.507568  2994 connection.cc:196] Error closing socket: Network error: TlsSocket::Close: Broken pipe
W20260927 23:31:17.517581  2994 connection.cc:196] Error closing socket: Network error: TlsSocket::Close: Broken pipe
W20260927 23:31:17.527504  2994 connection.cc:196] Error closing socket: Network error: TlsSocket::Close: Broken pipe
W20260927 23:31:17.538139  2994 connection.cc:196] Error closing socket: Network error: TlsSocket::Close: Broken pipe
W20260927 23:31:17.547583  2994 connection.cc:196] Error closing socket: Network error: TlsSocket::Close: Broken pipe
W20260927 23:31:17.557087  2994 connection.cc:196] Error closing socket: Network error: TlsSocket::Close: Broken pipe
W20260927 23:31:17.566761  2994 connection.cc:196] Error closing socket: Network error: TlsSocket::Close: Broken pipe
W20260927 23:31:17.576279  2994 connection.cc:196] Error closing socket: Network error: TlsSocket::Close: Broken pipe
W20260927 23:31:17.585772  2994 connection.cc:196] Error closing socket: Network error: TlsSocket::Close: Broken pipe
W20260927 23:31:17.596832  2994 connection.cc:196] Error closing socket: Network error: TlsSocket::Close: Broken pipe
[       OK ] Parameters/TestRpc.TestReopenOutboundConnections/SSL_UnixSocket (380 ms)
[ RUN      ] Parameters/TestRpc.TestConnectionNetworkPlane/SSL_UnixSocket
I20260927 23:31:17.630010  3018 acceptor_pool.cc:254] collecting diagnostics on the listening RPC socket unix:/tmp/dist-test-taskGeLOTW/test-tmp/rpc-test-3439caf35e9d44f98ec6f95ef8f44b68.sock every 8 connection(s)
I20260927 23:31:17.630776  3019 acceptor_pool.cc:254] collecting diagnostics on the listening RPC socket unix:/tmp/dist-test-taskGeLOTW/test-tmp/rpc-test-3439caf35e9d44f98ec6f95ef8f44b68.sock every 8 connection(s)
I20260927 23:31:17.633956  2779 rpc-test.cc:772] Connecting to unix:/tmp/dist-test-taskGeLOTW/test-tmp/rpc-test-3439caf35e9d44f98ec6f95ef8f44b68.sock
W20260927 23:31:17.678642  3017 connection.cc:196] Error closing socket: Network error: TlsSocket::Close: Broken pipe
W20260927 23:31:17.679493  3017 connection.cc:196] Error closing socket: Network error: TlsSocket::Close: Broken pipe
[       OK ] Parameters/TestRpc.TestConnectionNetworkPlane/SSL_UnixSocket (83 ms)
[ RUN      ] Parameters/TestRpc.TestTCPKeepalive/SSL_UnixSocket
I20260927 23:31:17.712447  3043 acceptor_pool.cc:254] collecting diagnostics on the listening RPC socket unix:/tmp/dist-test-taskGeLOTW/test-tmp/rpc-test-46ba63f720bd466fb3101d9c550ae31e.sock every 8 connection(s)
I20260927 23:31:17.713043  3044 acceptor_pool.cc:254] collecting diagnostics on the listening RPC socket unix:/tmp/dist-test-taskGeLOTW/test-tmp/rpc-test-46ba63f720bd466fb3101d9c550ae31e.sock every 8 connection(s)
I20260927 23:31:17.738517  3047 rpc-test-base.h:222] got call: sleep_micros: 8000000 deferred: true
I20260927 23:31:25.742581  3047 rpcz_store.cc:275] Call kudu.rpc.GenericCalculatorService.Sleep from unix:<unnamed> (request call id 0) took 8004 ms. Trace:
I20260927 23:31:25.743103  3047 rpcz_store.cc:276] 0927 23:31:17.738370 (+     0us) service_pool.cc:170] Inserting onto call queue
0927 23:31:17.738465 (+    95us) service_pool.cc:227] Handling call
0927 23:31:25.742394 (+8003929us) inbound_call.cc:173] Queueing success response
Metrics: {}
W20260927 23:31:25.749930  3040 connection.cc:196] Error closing socket: Network error: TlsSocket::Close: Broken pipe
[       OK ] Parameters/TestRpc.TestTCPKeepalive/SSL_UnixSocket (8072 ms)
[ RUN      ] Parameters/TestRpc.TestMaxSmallSidecars/SSL_UnixSocket
I20260927 23:31:25.780884  3069 acceptor_pool.cc:254] collecting diagnostics on the listening RPC socket unix:/tmp/dist-test-taskGeLOTW/test-tmp/rpc-test-d911332190184cf4b7f6a31a2b0a958e.sock every 8 connection(s)
I20260927 23:31:25.781745  3070 acceptor_pool.cc:254] collecting diagnostics on the listening RPC socket unix:/tmp/dist-test-taskGeLOTW/test-tmp/rpc-test-d911332190184cf4b7f6a31a2b0a958e.sock every 8 connection(s)
W20260927 23:31:25.954154  3066 connection.cc:196] Error closing socket: Network error: TlsSocket::Close: Broken pipe
[       OK ] Parameters/TestRpc.TestMaxSmallSidecars/SSL_UnixSocket (201 ms)
[ RUN      ] Parameters/TestRpc.TestCallTimeout/SSL_UnixSocket
I20260927 23:31:26.007159  3094 acceptor_pool.cc:254] collecting diagnostics on the listening RPC socket unix:/tmp/dist-test-taskGeLOTW/test-tmp/rpc-test-c636d536cc9349b4a1b9dda9ef6a5c82.sock every 8 connection(s)
I20260927 23:31:26.007915  3095 acceptor_pool.cc:254] collecting diagnostics on the listening RPC socket unix:/tmp/dist-test-taskGeLOTW/test-tmp/rpc-test-c636d536cc9349b4a1b9dda9ef6a5c82.sock every 8 connection(s)
I20260927 23:31:26.065340  2779 rpc-test-base.h:595] status: Timed out: connection negotiation to unix:/tmp/dist-test-taskGeLOTW/test-tmp/rpc-test-c636d536cc9349b4a1b9dda9ef6a5c82.sock for RPC Sleep timed out after 0.000s (ON_OUTBOUND_QUEUE), seconds elapsed: 0.00290452
I20260927 23:31:26.071933  3098 rpc-test-base.h:222] got call: sleep_micros: 700000
I20260927 23:31:26.266728  2779 rpc-test-base.h:595] status: Timed out: Sleep RPC to unix:/tmp/dist-test-taskGeLOTW/test-tmp/rpc-test-c636d536cc9349b4a1b9dda9ef6a5c82.sock timed out after 0.200s (SENT), seconds elapsed: 0.201048
I20260927 23:31:26.268252  3097 rpc-test-base.h:222] got call: sleep_micros: 2000000
W20260927 23:31:26.772581  3098 rpcz_store.cc:267] Call kudu.rpc.GenericCalculatorService.Sleep from unix:<unnamed> (request call id 1) took 700 ms (client timeout 200 ms). Trace:
W20260927 23:31:26.772970  3098 rpcz_store.cc:269] 0927 23:31:26.071788 (+     0us) service_pool.cc:170] Inserting onto call queue
0927 23:31:26.071887 (+    99us) service_pool.cc:227] Handling call
0927 23:31:26.772524 (+700637us) inbound_call.cc:173] Queueing success response
Metrics: {}
I20260927 23:31:27.769146  2779 rpc-test-base.h:595] status: Timed out: Sleep RPC to unix:/tmp/dist-test-taskGeLOTW/test-tmp/rpc-test-c636d536cc9349b4a1b9dda9ef6a5c82.sock timed out after 1.500s (SENT), seconds elapsed: 1.50205
W20260927 23:31:28.268821  3097 rpcz_store.cc:267] Call kudu.rpc.GenericCalculatorService.Sleep from unix:<unnamed> (request call id 2) took 2000 ms (client timeout 1500 ms). Trace:
W20260927 23:31:28.269182  3097 rpcz_store.cc:269] 0927 23:31:26.267915 (+     0us) service_pool.cc:170] Inserting onto call queue
0927 23:31:26.268058 (+   143us) service_pool.cc:227] Handling call
0927 23:31:28.268764 (+2000706us) inbound_call.cc:173] Queueing success response
Metrics: {}
W20260927 23:31:28.269788  3091 connection.cc:441] server connection from unix:<unnamed> torn down before Call kudu.rpc.GenericCalculatorService.Sleep from unix:<unnamed> (request call id 2) could send its response
[       OK ] Parameters/TestRpc.TestCallTimeout/SSL_UnixSocket (2315 ms)
[ RUN      ] Parameters/TestRpc.TestServerShutsDown/SSL_UnixSocket
I20260927 23:31:28.276913  2779 rpc-test.cc:1125] Connecting to 0.0.0.0:46035
W20260927 23:31:28.286373  3111 negotiation.cc:337] Failed RPC negotiation. Trace:
0927 23:31:28.284961 (+     0us) reactor.cc:625] Submitting negotiation task for client connection to 0.0.0.0:46035 (local address 127.0.0.1:41234)
0927 23:31:28.285408 (+   447us) negotiation.cc:107] Waiting for socket to connect
0927 23:31:28.285438 (+    30us) client_negotiation.cc:174] Beginning negotiation
0927 23:31:28.285650 (+   212us) client_negotiation.cc:252] Sending NEGOTIATE NegotiatePB request
0927 23:31:28.285862 (+   212us) negotiation.cc:327] Negotiation complete: Network error: Client connection negotiation failed: client connection to 0.0.0.0:46035: BlockingWrite error: write error: Broken pipe (error 32)
Metrics: {"client-negotiator.queue_time_us":117}
[       OK ] Parameters/TestRpc.TestServerShutsDown/SSL_UnixSocket (13 ms)
[ RUN      ] Parameters/TestRpc.TimedOutOnResponseMetric/SSL_UnixSocket
I20260927 23:31:28.308871  3128 acceptor_pool.cc:254] collecting diagnostics on the listening RPC socket unix:/tmp/dist-test-taskGeLOTW/test-tmp/rpc-test-4ba6c6999b614573941de881f42c6d1b.sock every 8 connection(s)
I20260927 23:31:28.309581  3129 acceptor_pool.cc:254] collecting diagnostics on the listening RPC socket unix:/tmp/dist-test-taskGeLOTW/test-tmp/rpc-test-4ba6c6999b614573941de881f42c6d1b.sock every 8 connection(s)
W20260927 23:31:28.546355  3132 rpcz_store.cc:267] Call kudu.rpc_test.CalculatorService.Sleep from unix:<unnamed> (request call id 3) took 50 ms (client timeout 25 ms). Trace:
W20260927 23:31:28.546684  3132 rpcz_store.cc:269] 0927 23:31:28.495743 (+     0us) service_pool.cc:170] Inserting onto call queue
0927 23:31:28.495865 (+   122us) service_pool.cc:227] Handling call
0927 23:31:28.546240 (+ 50375us) inbound_call.cc:173] Queueing success response
Related trace 'test_child':
Metrics: {"test_sleep_us":50000,"child_traces":[["test_child",{"related_trace_metric":1}]]}
W20260927 23:31:28.605968  3132 rpcz_store.cc:267] Call kudu.rpc_test.CalculatorService.Sleep from unix:<unnamed> (request call id 4) took 50 ms (client timeout 50 ms). Trace:
W20260927 23:31:28.606308  3132 rpcz_store.cc:269] 0927 23:31:28.555436 (+     0us) service_pool.cc:170] Inserting onto call queue
0927 23:31:28.555558 (+   122us) service_pool.cc:227] Handling call
0927 23:31:28.605908 (+ 50350us) inbound_call.cc:173] Queueing success response
Related trace 'test_child':
Metrics: {"test_sleep_us":50000,"child_traces":[["test_child",{"related_trace_metric":1}]]}
W20260927 23:31:28.610215  3125 connection.cc:196] Error closing socket: Network error: TlsSocket::Close: Broken pipe
[       OK ] Parameters/TestRpc.TimedOutOnResponseMetric/SSL_UnixSocket (326 ms)
[ RUN      ] Parameters/TestRpc.AcceptorDispatchingTimesMetric/SSL_UnixSocket
I20260927 23:31:28.627000  3153 acceptor_pool.cc:254] collecting diagnostics on the listening RPC socket 0.0.0.0:44357 every 8 connection(s)
I20260927 23:31:28.627667  3154 acceptor_pool.cc:254] collecting diagnostics on the listening RPC socket 0.0.0.0:44357 every 8 connection(s)
W20260927 23:31:28.634013  3149 negotiation.cc:337] Failed RPC negotiation. Trace:
0927 23:31:28.631436 (+     0us) reactor.cc:625] Submitting negotiation task for server connection from 127.0.0.1:56806 (local address 127.0.0.1:44357)
0927 23:31:28.632184 (+   748us) server_negotiation.cc:206] Beginning negotiation
0927 23:31:28.632222 (+    38us) server_negotiation.cc:399] Waiting for connection header
0927 23:31:28.632575 (+   353us) negotiation.cc:327] Negotiation complete: Network error: Server connection negotiation failed: server connection from 127.0.0.1:56806: BlockingRecv error: recv got EOF from 127.0.0.1:56806 (error 108)
Metrics: {"server-negotiator.queue_time_us":179}
[       OK ] Parameters/TestRpc.AcceptorDispatchingTimesMetric/SSL_UnixSocket (21 ms)
[ RUN      ] Parameters/TestRpc.TestRpcCallbackDestroysMessenger/SSL_UnixSocket
[       OK ] Parameters/TestRpc.TestRpcCallbackDestroysMessenger/SSL_UnixSocket (34 ms)
[ RUN      ] Parameters/TestRpc.TestApplicationFeatureFlag/SSL_UnixSocket
I20260927 23:31:28.693584  3178 acceptor_pool.cc:254] collecting diagnostics on the listening RPC socket unix:/tmp/dist-test-taskGeLOTW/test-tmp/rpc-test-4256591cc7c44852bbc9bf05ab70025e.sock every 8 connection(s)
I20260927 23:31:28.694319  3179 acceptor_pool.cc:254] collecting diagnostics on the listening RPC socket unix:/tmp/dist-test-taskGeLOTW/test-tmp/rpc-test-4256591cc7c44852bbc9bf05ab70025e.sock every 8 connection(s)
W20260927 23:31:28.735227  3175 messenger.cc:357] Unable to handle RPC call: Not implemented: call requires unsupported application feature flags: 99
[       OK ] Parameters/TestRpc.TestApplicationFeatureFlag/SSL_UnixSocket (71 ms)
[ RUN      ] Parameters/TestRpc.TestCancellation/SSL_UnixSocket
I20260927 23:31:28.771373  3203 acceptor_pool.cc:254] collecting diagnostics on the listening RPC socket unix:/tmp/dist-test-taskGeLOTW/test-tmp/rpc-test-d9040f7e09fa48b7880db668aea0db7c.sock every 8 connection(s)
I20260927 23:31:28.772064  3204 acceptor_pool.cc:254] collecting diagnostics on the listening RPC socket unix:/tmp/dist-test-taskGeLOTW/test-tmp/rpc-test-d9040f7e09fa48b7880db668aea0db7c.sock every 8 connection(s)
I20260927 23:31:28.775269  2779 rpc-test.cc:1648] Connecting to unix:/tmp/dist-test-taskGeLOTW/test-tmp/rpc-test-d9040f7e09fa48b7880db668aea0db7c.sock
I20260927 23:31:28.891604  2779 rpc-test-base.h:595] status: Aborted: Sleep RPC to unix:/tmp/dist-test-taskGeLOTW/test-tmp/rpc-test-d9040f7e09fa48b7880db668aea0db7c.sock is cancelled in state READY, seconds elapsed: 0.000377737
I20260927 23:31:29.072041  2779 rpc-test-base.h:595] status: Aborted: Sleep RPC to unix:/tmp/dist-test-taskGeLOTW/test-tmp/rpc-test-d9040f7e09fa48b7880db668aea0db7c.sock is cancelled in state SENT, seconds elapsed: 0.000653632
I20260927 23:31:29.072409  3206 rpc-test-base.h:222] got call: sleep_micros: 510000
I20260927 23:31:29.244835  2779 rpc-test-base.h:595] status: Aborted: Sleep RPC to unix:/tmp/dist-test-taskGeLOTW/test-tmp/rpc-test-d9040f7e09fa48b7880db668aea0db7c.sock is cancelled in state SENT, seconds elapsed: 0.000765425
I20260927 23:31:29.245147  3205 rpc-test-base.h:222] got call: sleep_micros: 510000
I20260927 23:31:29.431623  2779 rpc-test-base.h:595] status: Aborted: Sleep RPC to unix:/tmp/dist-test-taskGeLOTW/test-tmp/rpc-test-d9040f7e09fa48b7880db668aea0db7c.sock is cancelled in state SENT, seconds elapsed: 0.000852761
W20260927 23:31:29.442320  3207 rpcz_store.cc:267] Call kudu.rpc.GenericCalculatorService.Sleep from unix:<unnamed> (request call id 11) took 10 ms (client timeout 10 ms). Trace:
W20260927 23:31:29.442704  3207 rpcz_store.cc:269] 0927 23:31:29.431634 (+     0us) service_pool.cc:170] Inserting onto call queue
0927 23:31:29.442030 (+ 10396us) service_pool.cc:214] Skipping call since client already timed out
0927 23:31:29.442131 (+   101us) inbound_call.cc:173] Queueing failure response
Metrics: {}
I20260927 23:31:29.443212  3207 rpc-test-base.h:222] got call: sleep_micros: 1500000
W20260927 23:31:29.582938  3206 rpcz_store.cc:267] Call kudu.rpc.GenericCalculatorService.Sleep from unix:<unnamed> (request call id 3) took 510 ms (client timeout 10 ms). Trace:
W20260927 23:31:29.583251  3206 rpcz_store.cc:269] 0927 23:31:29.072219 (+     0us) service_pool.cc:170] Inserting onto call queue
0927 23:31:29.072324 (+   105us) service_pool.cc:227] Handling call
0927 23:31:29.582884 (+510560us) inbound_call.cc:173] Queueing success response
Metrics: {}
W20260927 23:31:29.755720  3205 rpcz_store.cc:267] Call kudu.rpc.GenericCalculatorService.Sleep from unix:<unnamed> (request call id 7) took 510 ms (client timeout 10 ms). Trace:
W20260927 23:31:29.756088  3205 rpcz_store.cc:269] 0927 23:31:29.244973 (+     0us) service_pool.cc:170] Inserting onto call queue
0927 23:31:29.245098 (+   125us) service_pool.cc:227] Handling call
0927 23:31:29.755666 (+510568us) inbound_call.cc:173] Queueing success response
Metrics: {}
I20260927 23:31:30.433439  2779 rpc-test-base.h:595] status: Timed out: Sleep RPC to unix:/tmp/dist-test-taskGeLOTW/test-tmp/rpc-test-d9040f7e09fa48b7880db668aea0db7c.sock timed out after 1.000s (SENT), seconds elapsed: 1.00138
I20260927 23:31:30.435375  3205 rpc-test-base.h:222] got call: sleep_micros: 1500000
W20260927 23:31:30.943920  3207 rpcz_store.cc:267] Call kudu.rpc.GenericCalculatorService.Sleep from unix:<unnamed> (request call id 12) took 1511 ms (client timeout 1000 ms). Trace:
W20260927 23:31:30.944293  3207 rpcz_store.cc:269] 0927 23:31:29.432691 (+     0us) service_pool.cc:170] Inserting onto call queue
0927 23:31:29.443177 (+ 10486us) service_pool.cc:227] Handling call
0927 23:31:30.943755 (+1500578us) inbound_call.cc:173] Queueing success response
Metrics: {}
I20260927 23:31:31.436287  2779 rpc-test-base.h:595] status: Timed out: Sleep RPC to unix:/tmp/dist-test-taskGeLOTW/test-tmp/rpc-test-d9040f7e09fa48b7880db668aea0db7c.sock timed out after 1.000s (SENT), seconds elapsed: 1.00235
W20260927 23:31:31.438024  3200 messenger.cc:357] Unable to handle RPC call: Not implemented: call requires unsupported application feature flags: 99, 1
W20260927 23:31:31.439870  3200 messenger.cc:357] Unable to handle RPC call: Not implemented: call requires unsupported application feature flags: 99, 1
W20260927 23:31:31.670778  3200 connection.cc:196] Error closing socket: Network error: TlsSocket::Close: Broken pipe
W20260927 23:31:31.936018  3205 rpcz_store.cc:267] Call kudu.rpc.GenericCalculatorService.Sleep from unix:<unnamed> (request call id 13) took 1501 ms (client timeout 1000 ms). Trace:
W20260927 23:31:31.936416  3205 rpcz_store.cc:269] 0927 23:31:30.435048 (+     0us) service_pool.cc:170] Inserting onto call queue
0927 23:31:30.435258 (+   210us) service_pool.cc:227] Handling call
0927 23:31:31.935965 (+1500707us) inbound_call.cc:173] Queueing success response
Metrics: {}
W20260927 23:31:31.937031  3200 connection.cc:441] server connection from unix:<unnamed> torn down before Call kudu.rpc.GenericCalculatorService.Sleep from unix:<unnamed> (request call id 13) could send its response
[       OK ] Parameters/TestRpc.TestCancellation/SSL_UnixSocket (3201 ms)
[ RUN      ] Parameters/TestRpc.TestCancellationMultiThreads/SSL_UnixSocket
I20260927 23:31:31.981523  3229 acceptor_pool.cc:254] collecting diagnostics on the listening RPC socket unix:/tmp/dist-test-taskGeLOTW/test-tmp/rpc-test-68577ff9959649308d840b081953258e.sock every 8 connection(s)
I20260927 23:31:31.982381  3230 acceptor_pool.cc:254] collecting diagnostics on the listening RPC socket unix:/tmp/dist-test-taskGeLOTW/test-tmp/rpc-test-68577ff9959649308d840b081953258e.sock every 8 connection(s)
I20260927 23:31:31.985649  2779 rpc-test.cc:1808] Connecting to unix:/tmp/dist-test-taskGeLOTW/test-tmp/rpc-test-68577ff9959649308d840b081953258e.sock
I20260927 23:31:32.154983  3243 test_util.cc:268] Using random seed: 1501288962
I20260927 23:31:32.156065  3244 test_util.cc:268] Using random seed: 1501290125
I20260927 23:31:32.157615  3245 test_util.cc:268] Using random seed: 1501291671
I20260927 23:31:32.159164  3246 test_util.cc:268] Using random seed: 1501293098
I20260927 23:31:32.160558  3247 test_util.cc:268] Using random seed: 1501294500
I20260927 23:31:32.162346  3248 test_util.cc:268] Using random seed: 1501295865
I20260927 23:31:32.163689  3249 test_util.cc:268] Using random seed: 1501297632
I20260927 23:31:32.165421  3250 test_util.cc:268] Using random seed: 1501299372
I20260927 23:31:32.167016  3251 test_util.cc:268] Using random seed: 1501300988
I20260927 23:31:32.168913  3252 test_util.cc:268] Using random seed: 1501302845
I20260927 23:31:32.170368  3253 test_util.cc:268] Using random seed: 1501304281
I20260927 23:31:32.172166  3254 test_util.cc:268] Using random seed: 1501306001
I20260927 23:31:32.173898  3255 test_util.cc:268] Using random seed: 1501307838
I20260927 23:31:32.175860  3256 test_util.cc:268] Using random seed: 1501309788
I20260927 23:31:32.177979  3257 test_util.cc:268] Using random seed: 1501311460
I20260927 23:31:32.180130  3258 test_util.cc:268] Using random seed: 1501313626
I20260927 23:31:32.182201  3259 test_util.cc:268] Using random seed: 1501316071
I20260927 23:31:32.184423  3260 test_util.cc:268] Using random seed: 1501318321
I20260927 23:31:32.188934  3261 test_util.cc:268] Using random seed: 1501322699
I20260927 23:31:32.192287  3262 test_util.cc:268] Using random seed: 1501326177
I20260927 23:31:32.194742  3263 test_util.cc:268] Using random seed: 1501328583
I20260927 23:31:32.197319  3264 test_util.cc:268] Using random seed: 1501331203
I20260927 23:31:32.200485  3265 test_util.cc:268] Using random seed: 1501334294
I20260927 23:31:32.205904  3266 test_util.cc:268] Using random seed: 1501339268
I20260927 23:31:32.208806  3267 test_util.cc:268] Using random seed: 1501342124
I20260927 23:31:32.213918  3268 test_util.cc:268] Using random seed: 1501347786
I20260927 23:31:32.217445  3269 test_util.cc:268] Using random seed: 1501351321
I20260927 23:31:32.221414  3270 test_util.cc:268] Using random seed: 1501355245
I20260927 23:31:32.223718  3271 test_util.cc:268] Using random seed: 1501357628
I20260927 23:31:32.225355  3272 test_util.cc:268] Using random seed: 1501359320
W20260927 23:31:52.004593  3226 connection.cc:196] Error closing socket: Network error: TlsSocket::Close: Broken pipe
[       OK ] Parameters/TestRpc.TestCancellationMultiThreads/SSL_UnixSocket (20078 ms)
[ RUN      ] Parameters/TestRpc.TestCallId/SSL_UnixSocket
I20260927 23:31:52.051409  3286 acceptor_pool.cc:254] collecting diagnostics on the listening RPC socket unix:/tmp/dist-test-taskGeLOTW/test-tmp/rpc-test-38759b9a05b64136893ed918fa6154cd.sock every 8 connection(s)
I20260927 23:31:52.052285  3287 acceptor_pool.cc:254] collecting diagnostics on the listening RPC socket unix:/tmp/dist-test-taskGeLOTW/test-tmp/rpc-test-38759b9a05b64136893ed918fa6154cd.sock every 8 connection(s)
[       OK ] Parameters/TestRpc.TestCallId/SSL_UnixSocket (98 ms)
[----------] 20 tests from Parameters/TestRpc (38632 ms total)

[----------] Global test environment tear-down
[==========] 21 tests from 2 test suites ran. (41794 ms total)
[  PASSED  ] 20 tests.
[  FAILED  ] 1 test, listed below:
[  FAILED  ] Parameters/TestRpc.TestCallWithChainCertAndRootCA/SSL_UnixSocket, where GetParam() = (true, true)

 1 FAILED TEST
I20260927 23:31:52.141490  2779 logging.cc:424] LogThrottler /data0/somelongdirectorytoavoidrpathissues/src/kudu/src/kudu/rpc/acceptor_pool.cc:285: suppressed but not reported on 3 messages since previous log ~34 seconds ago