Diagnosed failure
Parameters/TestRpc.TestCallWithChainCertAndChainCA/SSL_UnixSocket: /data0/somelongdirectorytoavoidrpathissues/src/kudu/src/kudu/rpc/rpc-test.cc:270: Failure
Failed
Bad status: Runtime error: could not verify certificate chain (error with cert: subject=CN = localhost, ST = sadfjas, C = AS, emailAddress = sdflkdsajf, O = lskdfjlsad, OU = sldfkja, issuer=C = AS, ST = ASDfkjdhf, L = lskdjf, O = saldfja, OU = skdjf, CN = localhost, emailAddress = sadjflkadsj): : certificate has expired
Google Test trace:
/data0/somelongdirectorytoavoidrpathissues/src/kudu/src/kudu/rpc/rpc-test.cc:267: Connecting to unix:/tmp/dist-test-task7mlu4p/test-tmp/rpc-test-ed596b22355f4d3a8a34a11b499bc854.sock
I20260926 12:15:33.390455 15103 test_util.cc:175] -----------------------------------------------
I20260926 12:15:33.390630 15103 test_util.cc:176] Had fatal failures, leaving test files at /tmp/dist-test-task7mlu4p/test-tmp/rpc-test.6.Parameters_TestRpc.TestCallWithChainCertAndChainCA_SSL_UnixSocket.1790424931977037-15103-0
Full log
Note: This is test shard 7 of 8.
[==========] Running 21 tests from 2 test suites.
[----------] Global test environment set-up.
[----------] 20 tests from Parameters/TestRpc
[ RUN ] Parameters/TestRpc.TestMessengerCreateDestroy/SSL_UnixSocket
WARNING: Logging before InitGoogleLogging() is written to STDERR
I20260926 12:15:32.080837 15103 rpc-test.cc:169] started messenger TestCreateDestroy
[ OK ] Parameters/TestRpc.TestMessengerCreateDestroy/SSL_UnixSocket (53 ms)
[ RUN ] Parameters/TestRpc.TestNegotiationDeadlock/SSL_UnixSocket
W20260926 12:15:33.215212 15103 thread.cc:636] client-negotiator [worker] (thread pool) Time spent creating pthread: real 1.123s user 0.003s sys 0.000s
W20260926 12:15:33.215655 15103 thread.cc:602] client-negotiator [worker] (thread pool) Time spent starting thread: real 1.123s user 0.003s sys 0.002s
I20260926 12:15:33.260275 15125 acceptor_pool.cc:254] collecting diagnostics on the listening RPC socket unix:/tmp/dist-test-task7mlu4p/test-tmp/rpc-test-b405aff050ae4b68b6f0775abd29dcc8.sock every 8 connection(s)
I20260926 12:15:33.261732 15126 acceptor_pool.cc:254] collecting diagnostics on the listening RPC socket unix:/tmp/dist-test-task7mlu4p/test-tmp/rpc-test-b405aff050ae4b68b6f0775abd29dcc8.sock every 8 connection(s)
[ OK ] Parameters/TestRpc.TestNegotiationDeadlock/SSL_UnixSocket (1243 ms)
[ RUN ] Parameters/TestRpc.TestCallWithChainCertAndChainCA/SSL_UnixSocket
I20260926 12:15:33.360626 15141 acceptor_pool.cc:254] collecting diagnostics on the listening RPC socket unix:/tmp/dist-test-task7mlu4p/test-tmp/rpc-test-ed596b22355f4d3a8a34a11b499bc854.sock every 8 connection(s)
I20260926 12:15:33.362888 15142 acceptor_pool.cc:254] collecting diagnostics on the listening RPC socket unix:/tmp/dist-test-task7mlu4p/test-tmp/rpc-test-ed596b22355f4d3a8a34a11b499bc854.sock every 8 connection(s)
/data0/somelongdirectorytoavoidrpathissues/src/kudu/src/kudu/rpc/rpc-test.cc:270: Failure
Failed
Bad status: Runtime error: could not verify certificate chain (error with cert: subject=CN = localhost, ST = sadfjas, C = AS, emailAddress = sdflkdsajf, O = lskdfjlsad, OU = sldfkja, issuer=C = AS, ST = ASDfkjdhf, L = lskdjf, O = saldfja, OU = skdjf, CN = localhost, emailAddress = sadjflkadsj): : certificate has expired
Google Test trace:
/data0/somelongdirectorytoavoidrpathissues/src/kudu/src/kudu/rpc/rpc-test.cc:267: Connecting to unix:/tmp/dist-test-task7mlu4p/test-tmp/rpc-test-ed596b22355f4d3a8a34a11b499bc854.sock
I20260926 12:15:33.390455 15103 test_util.cc:175] -----------------------------------------------
I20260926 12:15:33.390630 15103 test_util.cc:176] Had fatal failures, leaving test files at /tmp/dist-test-task7mlu4p/test-tmp/rpc-test.6.Parameters_TestRpc.TestCallWithChainCertAndChainCA_SSL_UnixSocket.1790424931977037-15103-0
[ FAILED ] Parameters/TestRpc.TestCallWithChainCertAndChainCA/SSL_UnixSocket, where GetParam() = (true, true) (61 ms)
[ RUN ] Parameters/TestRpc.TestCallWithPasswordProtectedKey/SSL_UnixSocket
I20260926 12:15:33.430002 15166 acceptor_pool.cc:254] collecting diagnostics on the listening RPC socket unix:/tmp/dist-test-task7mlu4p/test-tmp/rpc-test-67dba1f24eda4f3cb40586db436c8dc2.sock every 8 connection(s)
I20260926 12:15:33.430738 15167 acceptor_pool.cc:254] collecting diagnostics on the listening RPC socket unix:/tmp/dist-test-task7mlu4p/test-tmp/rpc-test-67dba1f24eda4f3cb40586db436c8dc2.sock every 8 connection(s)
W20260926 12:15:33.473439 15163 connection.cc:196] Error closing socket: Network error: TlsSocket::Close: Broken pipe
[ OK ] Parameters/TestRpc.TestCallWithPasswordProtectedKey/SSL_UnixSocket (89 ms)
[ RUN ] Parameters/TestRpc.TestCallToBadServer/SSL_UnixSocket
I20260926 12:15:33.526222 15103 rpc-test.cc:394] Status: Network error: Client connection negotiation failed: client connection to 0.0.0.0:0: connect: Connection refused (error 111)
I20260926 12:15:33.527725 15103 rpc-test.cc:394] Status: Network error: Client connection negotiation failed: client connection to 0.0.0.0:0: connect: Connection refused (error 111)
I20260926 12:15:33.529150 15103 rpc-test.cc:394] Status: Network error: Client connection negotiation failed: client connection to 0.0.0.0:0: connect: Connection refused (error 111)
I20260926 12:15:33.530547 15103 rpc-test.cc:394] Status: Network error: Client connection negotiation failed: client connection to 0.0.0.0:0: connect: Connection refused (error 111)
I20260926 12:15:33.532047 15103 rpc-test.cc:394] Status: Network error: Client connection negotiation failed: client connection to 0.0.0.0:0: connect: Connection refused (error 111)
[ OK ] Parameters/TestRpc.TestCallToBadServer/SSL_UnixSocket (55 ms)
[ RUN ] Parameters/TestRpc.TestWrongService/SSL_UnixSocket
I20260926 12:15:33.576025 15201 acceptor_pool.cc:254] collecting diagnostics on the listening RPC socket unix:/tmp/dist-test-task7mlu4p/test-tmp/rpc-test-918ceabf273c4a1db430229aacba49d3.sock every 8 connection(s)
I20260926 12:15:33.576879 15202 acceptor_pool.cc:254] collecting diagnostics on the listening RPC socket unix:/tmp/dist-test-task7mlu4p/test-tmp/rpc-test-918ceabf273c4a1db430229aacba49d3.sock every 8 connection(s)
I20260926 12:15:33.609838 15198 messenger.cc:345] service WrongServiceName not registered on TestServer
W20260926 12:15:33.613201 15198 connection.cc:196] Error closing socket: Network error: TlsSocket::Close: Broken pipe
[ OK ] Parameters/TestRpc.TestWrongService/SSL_UnixSocket (82 ms)
[ RUN ] Parameters/TestRpc.TestConnectionKeepalive/SSL_UnixSocket
I20260926 12:15:33.635152 15224 acceptor_pool.cc:254] collecting diagnostics on the listening RPC socket unix:/tmp/dist-test-task7mlu4p/test-tmp/rpc-test-b704d3d0df1746489dc4b9247aca0270.sock every 8 connection(s)
I20260926 12:15:33.635964 15225 acceptor_pool.cc:254] collecting diagnostics on the listening RPC socket unix:/tmp/dist-test-task7mlu4p/test-tmp/rpc-test-b704d3d0df1746489dc4b9247aca0270.sock every 8 connection(s)
I20260926 12:15:33.639142 15103 rpc-test.cc:488] Connecting to unix:/tmp/dist-test-task7mlu4p/test-tmp/rpc-test-b704d3d0df1746489dc4b9247aca0270.sock
W20260926 12:15:34.122638 15237 connection.cc:196] Error closing socket: Network error: TlsSocket::Close: Broken pipe
[ OK ] Parameters/TestRpc.TestConnectionKeepalive/SSL_UnixSocket (1064 ms)
[ RUN ] Parameters/TestRpc.TestClientConnectionMetrics/SSL_UnixSocket
I20260926 12:15:34.712993 15249 acceptor_pool.cc:254] collecting diagnostics on the listening RPC socket unix:/tmp/dist-test-task7mlu4p/test-tmp/rpc-test-26dbafb4c8364b22871c860043cf02ca.sock every 8 connection(s)
I20260926 12:15:34.713819 15250 acceptor_pool.cc:254] collecting diagnostics on the listening RPC socket unix:/tmp/dist-test-task7mlu4p/test-tmp/rpc-test-26dbafb4c8364b22871c860043cf02ca.sock every 8 connection(s)
I20260926 12:15:34.717337 15103 rpc-test.cc:569] Connecting to unix:/tmp/dist-test-task7mlu4p/test-tmp/rpc-test-26dbafb4c8364b22871c860043cf02ca.sock
W20260926 12:17:56.015625 15246 connection.cc:196] Error closing socket: Network error: TlsSocket::Close: Broken pipe
[ OK ] Parameters/TestRpc.TestClientConnectionMetrics/SSL_UnixSocket (141343 ms)
[ RUN ] Parameters/TestRpc.TestCredentialsPolicy/SSL_UnixSocket
I20260926 12:17:56.099255 15286 acceptor_pool.cc:254] collecting diagnostics on the listening RPC socket unix:/tmp/dist-test-task7mlu4p/test-tmp/rpc-test-95ac6e0d0ee14eb18048748e82d5b17c.sock every 8 connection(s)
I20260926 12:17:56.100068 15287 acceptor_pool.cc:254] collecting diagnostics on the listening RPC socket unix:/tmp/dist-test-task7mlu4p/test-tmp/rpc-test-95ac6e0d0ee14eb18048748e82d5b17c.sock every 8 connection(s)
I20260926 12:17:56.103396 15103 rpc-test.cc:700] Connecting to unix:/tmp/dist-test-task7mlu4p/test-tmp/rpc-test-95ac6e0d0ee14eb18048748e82d5b17c.sock
W20260926 12:17:56.165488 15285 connection.cc:196] Error closing socket: Network error: TlsSocket::Close: Broken pipe
W20260926 12:17:56.181068 15285 connection.cc:196] Error closing socket: Network error: TlsSocket::Close: Broken pipe
[ OK ] Parameters/TestRpc.TestCredentialsPolicy/SSL_UnixSocket (161 ms)
[ RUN ] Parameters/TestRpc.TestCallLongerThanKeepalive/SSL_UnixSocket
I20260926 12:17:56.212446 15311 acceptor_pool.cc:254] collecting diagnostics on the listening RPC socket unix:/tmp/dist-test-task7mlu4p/test-tmp/rpc-test-4e31909980034ec28c594b9256398899.sock every 8 connection(s)
I20260926 12:17:56.213164 15312 acceptor_pool.cc:254] collecting diagnostics on the listening RPC socket unix:/tmp/dist-test-task7mlu4p/test-tmp/rpc-test-4e31909980034ec28c594b9256398899.sock every 8 connection(s)
I20260926 12:17:56.241466 15315 rpc-test-base.h:222] got call: sleep_micros: 3000000 deferred: true
I20260926 12:17:59.245818 15315 rpcz_store.cc:275] Call kudu.rpc.GenericCalculatorService.Sleep from unix:<unnamed> (request call id 0) took 3004 ms. Trace:
I20260926 12:17:59.246183 15315 rpcz_store.cc:276] 0926 12:17:56.241270 (+ 0us) service_pool.cc:170] Inserting onto call queue
0926 12:17:56.241401 (+ 131us) service_pool.cc:227] Handling call
0926 12:17:59.245763 (+3004362us) inbound_call.cc:173] Queueing success response
Metrics: {}
W20260926 12:17:59.250835 15308 connection.cc:196] Error closing socket: Network error: TlsSocket::Close: Broken pipe
[ OK ] Parameters/TestRpc.TestCallLongerThanKeepalive/SSL_UnixSocket (3067 ms)
[ RUN ] Parameters/TestRpc.TestRpcSidecar/SSL_UnixSocket
I20260926 12:17:59.275238 15336 acceptor_pool.cc:254] collecting diagnostics on the listening RPC socket unix:/tmp/dist-test-task7mlu4p/test-tmp/rpc-test-eb68598393d144e9948cc7c79ad6c890.sock every 8 connection(s)
I20260926 12:17:59.275995 15337 acceptor_pool.cc:254] collecting diagnostics on the listening RPC socket unix:/tmp/dist-test-task7mlu4p/test-tmp/rpc-test-eb68598393d144e9948cc7c79ad6c890.sock every 8 connection(s)
[ OK ] Parameters/TestRpc.TestRpcSidecar/SSL_UnixSocket (531 ms)
[ RUN ] Parameters/TestRpc.TestRpcSidecarLimits/SSL_UnixSocket
I20260926 12:18:17.270702 15363 acceptor_pool.cc:254] collecting diagnostics on the listening RPC socket unix:/tmp/dist-test-task7mlu4p/test-tmp/rpc-test-83e6d67bc82a41c18bb106afc625c346.sock every 8 connection(s)
I20260926 12:18:17.271627 15364 acceptor_pool.cc:254] collecting diagnostics on the listening RPC socket unix:/tmp/dist-test-task7mlu4p/test-tmp/rpc-test-83e6d67bc82a41c18bb106afc625c346.sock every 8 connection(s)
W20260926 12:18:17.288072 15103 serialization.cc:72] Serialized kudu.rpc_test.PushStringsRequestPB (2147483654 bytes) is larger than the maximum configured RPC message size (52428800 bytes). Sending anyway, but peer may reject the data.
W20260926 12:18:17.299938 15360 connection.cc:535] server connection from unix:<unnamed> recv error: Network error: RPC frame had a length of 2147483714, but we only support messages up to 52428800 bytes long.
W20260926 12:18:17.300441 15360 connection.cc:158] shutting down server connection from unix:<unnamed> with pending inbound data: 4/2147483714 bytes received; last active 0 ns ago: status Network error: RPC frame had a length of 2147483714, but we only support messages up to 52428800 bytes long.
W20260926 12:18:17.302049 15376 connection.cc:196] Error closing socket: Network error: TlsSocket::Close: Broken pipe
[ OK ] Parameters/TestRpc.TestRpcSidecarLimits/SSL_UnixSocket (18231 ms)
[ RUN ] Parameters/TestRpc.TestCallTimeoutDoesntAffectNegotiation/SSL_UnixSocket
I20260926 12:18:18.045252 15388 acceptor_pool.cc:254] collecting diagnostics on the listening RPC socket unix:/tmp/dist-test-task7mlu4p/test-tmp/rpc-test-9e4c1ad006eb4c14a77ac3478b13243a.sock every 8 connection(s)
I20260926 12:18:18.046021 15389 acceptor_pool.cc:254] collecting diagnostics on the listening RPC socket unix:/tmp/dist-test-task7mlu4p/test-tmp/rpc-test-9e4c1ad006eb4c14a77ac3478b13243a.sock every 8 connection(s)
W20260926 12:18:18.076610 15384 negotiation.cc:266] Injecting 500ms delay in negotiation
I20260926 12:18:18.126158 15103 rpc-test-base.h:595] status: Timed out: connection negotiation to unix:/tmp/dist-test-task7mlu4p/test-tmp/rpc-test-9e4c1ad006eb4c14a77ac3478b13243a.sock for RPC Sleep timed out after 0.050s (ON_OUTBOUND_QUEUE), seconds elapsed: 0.0505583
W20260926 12:18:18.588559 15385 connection.cc:196] Error closing socket: Network error: TlsSocket::Close: Broken pipe
[ OK ] Parameters/TestRpc.TestCallTimeoutDoesntAffectNegotiation/SSL_UnixSocket (573 ms)
[ RUN ] Parameters/TestRpc.TestRpcHandlerLatencyMetric/SSL_UnixSocket
I20260926 12:18:18.649881 15413 acceptor_pool.cc:254] collecting diagnostics on the listening RPC socket unix:/tmp/dist-test-task7mlu4p/test-tmp/rpc-test-82172202767849efb49ae5c98214bfe6.sock every 8 connection(s)
I20260926 12:18:18.650638 15414 acceptor_pool.cc:254] collecting diagnostics on the listening RPC socket unix:/tmp/dist-test-task7mlu4p/test-tmp/rpc-test-82172202767849efb49ae5c98214bfe6.sock every 8 connection(s)
I20260926 12:18:18.699877 15103 rpc-test.cc:1236] Sleep() min lat: 21650
I20260926 12:18:18.700116 15103 rpc-test.cc:1237] Sleep() mean lat: 21650
I20260926 12:18:18.700309 15103 rpc-test.cc:1238] Sleep() max lat: 21650
I20260926 12:18:18.700474 15103 rpc-test.cc:1239] Sleep() #calls: 1
[ OK ] Parameters/TestRpc.TestRpcHandlerLatencyMetric/SSL_UnixSocket (114 ms)
[ RUN ] Parameters/TestRpc.TimedOutOnResponseMetricServiceQueue/SSL_UnixSocket
I20260926 12:18:18.738381 15439 acceptor_pool.cc:254] collecting diagnostics on the listening RPC socket unix:/tmp/dist-test-task7mlu4p/test-tmp/rpc-test-ba286e0835d1491b821a2205a100815e.sock every 8 connection(s)
I20260926 12:18:18.739118 15440 acceptor_pool.cc:254] collecting diagnostics on the listening RPC socket unix:/tmp/dist-test-task7mlu4p/test-tmp/rpc-test-ba286e0835d1491b821a2205a100815e.sock every 8 connection(s)
W20260926 12:18:18.816566 15441 rpcz_store.cc:267] Call kudu.rpc_test.CalculatorService.Sleep from unix:<unnamed> (request call id 2) took 20 ms (client timeout 20 ms). Trace:
W20260926 12:18:18.817013 15441 rpcz_store.cc:269] 0926 12:18:18.795977 (+ 0us) service_pool.cc:170] Inserting onto call queue
0926 12:18:18.816406 (+ 20429us) service_pool.cc:214] Skipping call since client already timed out
0926 12:18:18.816513 (+ 107us) inbound_call.cc:173] Queueing failure response
Metrics: {}
W20260926 12:18:18.819551 15436 connection.cc:196] Error closing socket: Network error: TlsSocket::Close: Broken pipe
[ OK ] Parameters/TestRpc.TimedOutOnResponseMetricServiceQueue/SSL_UnixSocket (116 ms)
[ RUN ] Parameters/TestRpc.RpcPendingConnectionsMetric/SSL_UnixSocket
I20260926 12:18:18.834910 15462 acceptor_pool.cc:254] collecting diagnostics on the listening RPC socket 0.0.0.0:46031 every 8 connection(s)
I20260926 12:18:18.835794 15463 acceptor_pool.cc:254] collecting diagnostics on the listening RPC socket 0.0.0.0:46031 every 8 connection(s)
W20260926 12:18:18.841035 15458 negotiation.cc:337] Failed RPC negotiation. Trace:
0926 12:18:18.839880 (+ 0us) reactor.cc:625] Submitting negotiation task for server connection from 127.0.0.1:60688 (local address 127.0.0.1:46031)
0926 12:18:18.840250 (+ 370us) server_negotiation.cc:206] Beginning negotiation
0926 12:18:18.840267 (+ 17us) server_negotiation.cc:399] Waiting for connection header
0926 12:18:18.840490 (+ 223us) negotiation.cc:327] Negotiation complete: Network error: Server connection negotiation failed: server connection from 127.0.0.1:60688: BlockingRecv error: recv got EOF from 127.0.0.1:60688 (error 108)
Metrics: {"server-negotiator.queue_time_us":94}
[ OK ] Parameters/TestRpc.RpcPendingConnectionsMetric/SSL_UnixSocket (30 ms)
[ RUN ] Parameters/TestRpc.TestRpcContextClientDeadline/SSL_UnixSocket
I20260926 12:18:18.916172 15478 acceptor_pool.cc:254] collecting diagnostics on the listening RPC socket unix:/tmp/dist-test-task7mlu4p/test-tmp/rpc-test-aedd0638c4fe4fd8b5d3aba1ae023108.sock every 8 connection(s)
I20260926 12:18:18.916818 15479 acceptor_pool.cc:254] collecting diagnostics on the listening RPC socket unix:/tmp/dist-test-task7mlu4p/test-tmp/rpc-test-aedd0638c4fe4fd8b5d3aba1ae023108.sock every 8 connection(s)
W20260926 12:18:18.984045 15475 connection.cc:196] Error closing socket: Network error: TlsSocket::Close: Broken pipe
[ OK ] Parameters/TestRpc.TestRpcContextClientDeadline/SSL_UnixSocket (133 ms)
[ RUN ] Parameters/TestRpc.TestApplicationFeatureFlagUnsupportedServer/SSL_UnixSocket
I20260926 12:18:19.015698 15503 acceptor_pool.cc:254] collecting diagnostics on the listening RPC socket unix:/tmp/dist-test-task7mlu4p/test-tmp/rpc-test-9638c7ab0e654856bdccd3b984534f31.sock every 8 connection(s)
I20260926 12:18:19.016446 15504 acceptor_pool.cc:254] collecting diagnostics on the listening RPC socket unix:/tmp/dist-test-task7mlu4p/test-tmp/rpc-test-9638c7ab0e654856bdccd3b984534f31.sock every 8 connection(s)
W20260926 12:18:19.063617 15500 connection.cc:196] Error closing socket: Network error: TlsSocket::Close: Broken pipe
[ OK ] Parameters/TestRpc.TestApplicationFeatureFlagUnsupportedServer/SSL_UnixSocket (79 ms)
[ RUN ] Parameters/TestRpc.TestCancellationAsync/SSL_UnixSocket
I20260926 12:18:19.089018 15528 acceptor_pool.cc:254] collecting diagnostics on the listening RPC socket unix:/tmp/dist-test-task7mlu4p/test-tmp/rpc-test-985c10a171454fd28b030718ad85ce11.sock every 8 connection(s)
I20260926 12:18:19.089672 15529 acceptor_pool.cc:254] collecting diagnostics on the listening RPC socket unix:/tmp/dist-test-task7mlu4p/test-tmp/rpc-test-985c10a171454fd28b030718ad85ce11.sock every 8 connection(s)
I20260926 12:18:19.093024 15103 rpc-test.cc:1716] Connecting to unix:/tmp/dist-test-task7mlu4p/test-tmp/rpc-test-985c10a171454fd28b030718ad85ce11.sock
I20260926 12:18:19.124306 15103 test_util.cc:268] Using random seed: -737690053
I20260926 12:18:19.353526 15532 rpc-test-base.h:240] got call: sleep_micros: 500 pattern: 4294967295 num_repetitions: 2097152 sidecar_idx: 0
I20260926 12:18:19.568694 15532 rpc-test-base.h:240] got call: sleep_micros: 500 pattern: 4294967295 num_repetitions: 2097152 sidecar_idx: 0
I20260926 12:18:19.789143 15532 rpc-test-base.h:240] got call: sleep_micros: 500 pattern: 4294967295 num_repetitions: 2097152 sidecar_idx: 0
I20260926 12:18:19.991204 15531 rpc-test-base.h:240] got call: sleep_micros: 500 pattern: 4294967295 num_repetitions: 2097152 sidecar_idx: 0
I20260926 12:18:20.228629 15531 rpc-test-base.h:240] got call: sleep_micros: 500 pattern: 4294967295 num_repetitions: 2097152 sidecar_idx: 0
I20260926 12:18:20.441016 15531 rpc-test-base.h:240] got call: sleep_micros: 500 pattern: 4294967295 num_repetitions: 2097152 sidecar_idx: 0
I20260926 12:18:20.652968 15531 rpc-test-base.h:240] got call: sleep_micros: 500 pattern: 4294967295 num_repetitions: 2097152 sidecar_idx: 0
I20260926 12:18:20.858345 15532 rpc-test-base.h:240] got call: sleep_micros: 500 pattern: 4294967295 num_repetitions: 2097152 sidecar_idx: 0
I20260926 12:18:21.055595 15531 rpc-test-base.h:240] got call: sleep_micros: 500 pattern: 4294967295 num_repetitions: 2097152 sidecar_idx: 0
W20260926 12:18:21.079809 15525 connection.cc:196] Error closing socket: Network error: TlsSocket::Close: Broken pipe
W20260926 12:18:21.096632 15525 connection.cc:441] server connection from unix:<unnamed> torn down before Call kudu.rpc.GenericCalculatorService.SleepWithSidecar from unix:<unnamed> (request call id 8) could send its response
W20260926 12:18:21.194723 15525 connection.cc:441] server connection from unix:<unnamed> torn down before Call kudu.rpc.GenericCalculatorService.SleepWithSidecar from unix:<unnamed> (request call id 9) could send its response
[ OK ] Parameters/TestRpc.TestCancellationAsync/SSL_UnixSocket (2136 ms)
[ RUN ] Parameters/TestRpc.TestPerformanceBySocketType/SSL_UnixSocket
I20260926 12:18:21.295357 15553 acceptor_pool.cc:254] collecting diagnostics on the listening RPC socket unix:/tmp/dist-test-task7mlu4p/test-tmp/rpc-test-1e1d165c2d104e6f917314a57878e0f2.sock every 8 connection(s)
I20260926 12:18:21.296092 15554 acceptor_pool.cc:254] collecting diagnostics on the listening RPC socket unix:/tmp/dist-test-task7mlu4p/test-tmp/rpc-test-1e1d165c2d104e6f917314a57878e0f2.sock every 8 connection(s)
I20260926 12:18:21.299177 15103 rpc-test.cc:1846] Connecting to unix:/tmp/dist-test-task7mlu4p/test-tmp/rpc-test-1e1d165c2d104e6f917314a57878e0f2.sock
I20260926 12:18:42.990231 15103 rpc-test.cc:1859] Sending 1024MB via ssl-enabled unix socket: real 21.674s user 19.104s sys 13.391s
I20260926 12:19:04.821403 15103 rpc-test.cc:1859] Sending 1024MB via ssl-enabled unix socket: real 21.831s user 19.512s sys 13.288s
I20260926 12:19:26.497076 15103 rpc-test.cc:1859] Sending 1024MB via ssl-enabled unix socket: real 21.675s user 19.407s sys 13.118s
I20260926 12:19:48.311983 15103 rpc-test.cc:1859] Sending 1024MB via ssl-enabled unix socket: real 21.814s user 19.387s sys 13.450s
I20260926 12:20:10.107937 15103 rpc-test.cc:1859] Sending 1024MB via ssl-enabled unix socket: real 21.795s user 19.623s sys 13.075s
W20260926 12:20:10.114109 15550 connection.cc:196] Error closing socket: Network error: TlsSocket::Close: Broken pipe
[ OK ] Parameters/TestRpc.TestPerformanceBySocketType/SSL_UnixSocket (108921 ms)
[----------] 20 tests from Parameters/TestRpc (278094 ms total)
[----------] 1 test from Parameters/TestRpcSocketTxRxQueue
[ RUN ] Parameters/TestRpcSocketTxRxQueue.AcceptorRxQueueSizeMetric/0
I20260926 12:20:10.148579 15589 acceptor_pool.cc:254] collecting diagnostics on the listening RPC socket 0.0.0.0:45669 every 1 connection(s)
I20260926 12:20:10.149427 15590 acceptor_pool.cc:254] collecting diagnostics on the listening RPC socket 0.0.0.0:45669 every 1 connection(s)
W20260926 12:20:10.155349 15585 negotiation.cc:337] Failed RPC negotiation. Trace:
0926 12:20:10.153483 (+ 0us) reactor.cc:625] Submitting negotiation task for server connection from 127.0.0.1:50254 (local address 127.0.0.1:45669)
0926 12:20:10.153951 (+ 468us) server_negotiation.cc:206] Beginning negotiation
0926 12:20:10.153972 (+ 21us) server_negotiation.cc:399] Waiting for connection header
0926 12:20:10.154294 (+ 322us) negotiation.cc:327] Negotiation complete: Network error: Server connection negotiation failed: server connection from 127.0.0.1:50254: BlockingRecv error: recv got EOF from 127.0.0.1:50254 (error 108)
Metrics: {"server-negotiator.queue_time_us":118}
[ OK ] Parameters/TestRpcSocketTxRxQueue.AcceptorRxQueueSizeMetric/0 (35 ms)
[----------] 1 test from Parameters/TestRpcSocketTxRxQueue (36 ms total)
[----------] Global test environment tear-down
[==========] 21 tests from 2 test suites ran. (278131 ms total)
[ PASSED ] 20 tests.
[ FAILED ] 1 test, listed below:
[ FAILED ] Parameters/TestRpc.TestCallWithChainCertAndChainCA/SSL_UnixSocket, where GetParam() = (true, true)
1 FAILED TEST