Diagnosed failure
Parameters/TestRpc.TestCallWithChainCertAndChainCA/SSL_UnixSocket: /data0/somelongdirectorytoavoidrpathissues/src/kudu/src/kudu/rpc/rpc-test.cc:270: Failure
Failed
Bad status: Runtime error: could not verify certificate chain (error with cert: subject=CN = localhost, ST = sadfjas, C = AS, emailAddress = sdflkdsajf, O = lskdfjlsad, OU = sldfkja, issuer=C = AS, ST = ASDfkjdhf, L = lskdjf, O = saldfja, OU = skdjf, CN = localhost, emailAddress = sadjflkadsj): : certificate has expired
Google Test trace:
/data0/somelongdirectorytoavoidrpathissues/src/kudu/src/kudu/rpc/rpc-test.cc:267: Connecting to unix:/tmp/dist-test-taskUz23eN/test-tmp/rpc-test-795f7fc440164b0ebc5838914200e65d.sock
I20260925 16:41:40.985739 11664 test_util.cc:175] -----------------------------------------------
I20260925 16:41:40.985958 11664 test_util.cc:176] Had fatal failures, leaving test files at /tmp/dist-test-taskUz23eN/test-tmp/rpc-test.6.Parameters_TestRpc.TestCallWithChainCertAndChainCA_SSL_UnixSocket.1790354499615253-11664-0
Full log
Note: This is test shard 7 of 8.
[==========] Running 21 tests from 2 test suites.
[----------] Global test environment set-up.
[----------] 20 tests from Parameters/TestRpc
[ RUN ] Parameters/TestRpc.TestMessengerCreateDestroy/SSL_UnixSocket
WARNING: Logging before InitGoogleLogging() is written to STDERR
I20260925 16:41:39.708920 11664 rpc-test.cc:169] started messenger TestCreateDestroy
[ OK ] Parameters/TestRpc.TestMessengerCreateDestroy/SSL_UnixSocket (1165 ms)
[ RUN ] Parameters/TestRpc.TestNegotiationDeadlock/SSL_UnixSocket
I20260925 16:41:40.866264 11686 acceptor_pool.cc:254] collecting diagnostics on the listening RPC socket unix:/tmp/dist-test-taskUz23eN/test-tmp/rpc-test-d1f1b5cf05794e37a9d1bdaeed5e6cad.sock every 8 connection(s)
I20260925 16:41:40.867823 11687 acceptor_pool.cc:254] collecting diagnostics on the listening RPC socket unix:/tmp/dist-test-taskUz23eN/test-tmp/rpc-test-d1f1b5cf05794e37a9d1bdaeed5e6cad.sock every 8 connection(s)
[ OK ] Parameters/TestRpc.TestNegotiationDeadlock/SSL_UnixSocket (95 ms)
[ RUN ] Parameters/TestRpc.TestCallWithChainCertAndChainCA/SSL_UnixSocket
I20260925 16:41:40.956809 11702 acceptor_pool.cc:254] collecting diagnostics on the listening RPC socket unix:/tmp/dist-test-taskUz23eN/test-tmp/rpc-test-795f7fc440164b0ebc5838914200e65d.sock every 8 connection(s)
I20260925 16:41:40.958976 11703 acceptor_pool.cc:254] collecting diagnostics on the listening RPC socket unix:/tmp/dist-test-taskUz23eN/test-tmp/rpc-test-795f7fc440164b0ebc5838914200e65d.sock every 8 connection(s)
/data0/somelongdirectorytoavoidrpathissues/src/kudu/src/kudu/rpc/rpc-test.cc:270: Failure
Failed
Bad status: Runtime error: could not verify certificate chain (error with cert: subject=CN = localhost, ST = sadfjas, C = AS, emailAddress = sdflkdsajf, O = lskdfjlsad, OU = sldfkja, issuer=C = AS, ST = ASDfkjdhf, L = lskdjf, O = saldfja, OU = skdjf, CN = localhost, emailAddress = sadjflkadsj): : certificate has expired
Google Test trace:
/data0/somelongdirectorytoavoidrpathissues/src/kudu/src/kudu/rpc/rpc-test.cc:267: Connecting to unix:/tmp/dist-test-taskUz23eN/test-tmp/rpc-test-795f7fc440164b0ebc5838914200e65d.sock
I20260925 16:41:40.985739 11664 test_util.cc:175] -----------------------------------------------
I20260925 16:41:40.985958 11664 test_util.cc:176] Had fatal failures, leaving test files at /tmp/dist-test-taskUz23eN/test-tmp/rpc-test.6.Parameters_TestRpc.TestCallWithChainCertAndChainCA_SSL_UnixSocket.1790354499615253-11664-0
[ FAILED ] Parameters/TestRpc.TestCallWithChainCertAndChainCA/SSL_UnixSocket, where GetParam() = (true, true) (58 ms)
[ RUN ] Parameters/TestRpc.TestCallWithPasswordProtectedKey/SSL_UnixSocket
I20260925 16:41:41.016784 11727 acceptor_pool.cc:254] collecting diagnostics on the listening RPC socket unix:/tmp/dist-test-taskUz23eN/test-tmp/rpc-test-b1918a9fdcee45f1b0767f1ebe7c9603.sock every 8 connection(s)
I20260925 16:41:41.017524 11728 acceptor_pool.cc:254] collecting diagnostics on the listening RPC socket unix:/tmp/dist-test-taskUz23eN/test-tmp/rpc-test-b1918a9fdcee45f1b0767f1ebe7c9603.sock every 8 connection(s)
W20260925 16:41:41.059748 11724 connection.cc:196] Error closing socket: Network error: TlsSocket::Close: Broken pipe
[ OK ] Parameters/TestRpc.TestCallWithPasswordProtectedKey/SSL_UnixSocket (80 ms)
[ RUN ] Parameters/TestRpc.TestCallToBadServer/SSL_UnixSocket
I20260925 16:41:41.088482 11664 rpc-test.cc:394] Status: Network error: Client connection negotiation failed: client connection to 0.0.0.0:0: connect: Connection refused (error 111)
I20260925 16:41:41.090088 11664 rpc-test.cc:394] Status: Network error: Client connection negotiation failed: client connection to 0.0.0.0:0: connect: Connection refused (error 111)
I20260925 16:41:41.091585 11664 rpc-test.cc:394] Status: Network error: Client connection negotiation failed: client connection to 0.0.0.0:0: connect: Connection refused (error 111)
I20260925 16:41:41.093048 11664 rpc-test.cc:394] Status: Network error: Client connection negotiation failed: client connection to 0.0.0.0:0: connect: Connection refused (error 111)
I20260925 16:41:41.094528 11664 rpc-test.cc:394] Status: Network error: Client connection negotiation failed: client connection to 0.0.0.0:0: connect: Connection refused (error 111)
[ OK ] Parameters/TestRpc.TestCallToBadServer/SSL_UnixSocket (30 ms)
[ RUN ] Parameters/TestRpc.TestWrongService/SSL_UnixSocket
I20260925 16:41:41.123293 11762 acceptor_pool.cc:254] collecting diagnostics on the listening RPC socket unix:/tmp/dist-test-taskUz23eN/test-tmp/rpc-test-d500464f18dd48ea8bd0a967a6ebcb59.sock every 8 connection(s)
I20260925 16:41:41.124233 11763 acceptor_pool.cc:254] collecting diagnostics on the listening RPC socket unix:/tmp/dist-test-taskUz23eN/test-tmp/rpc-test-d500464f18dd48ea8bd0a967a6ebcb59.sock every 8 connection(s)
I20260925 16:41:41.153251 11759 messenger.cc:345] service WrongServiceName not registered on TestServer
[ OK ] Parameters/TestRpc.TestWrongService/SSL_UnixSocket (66 ms)
[ RUN ] Parameters/TestRpc.TestConnectionKeepalive/SSL_UnixSocket
I20260925 16:41:41.205399 11785 acceptor_pool.cc:254] collecting diagnostics on the listening RPC socket unix:/tmp/dist-test-taskUz23eN/test-tmp/rpc-test-aac2b76f99bc432786600d2ebc7a9c36.sock every 8 connection(s)
I20260925 16:41:41.206105 11786 acceptor_pool.cc:254] collecting diagnostics on the listening RPC socket unix:/tmp/dist-test-taskUz23eN/test-tmp/rpc-test-aac2b76f99bc432786600d2ebc7a9c36.sock every 8 connection(s)
I20260925 16:41:41.209272 11664 rpc-test.cc:488] Connecting to unix:/tmp/dist-test-taskUz23eN/test-tmp/rpc-test-aac2b76f99bc432786600d2ebc7a9c36.sock
W20260925 16:41:41.667624 11798 connection.cc:196] Error closing socket: Network error: TlsSocket::Close: Broken pipe
[ OK ] Parameters/TestRpc.TestConnectionKeepalive/SSL_UnixSocket (1084 ms)
[ RUN ] Parameters/TestRpc.TestClientConnectionMetrics/SSL_UnixSocket
I20260925 16:41:42.266285 11810 acceptor_pool.cc:254] collecting diagnostics on the listening RPC socket unix:/tmp/dist-test-taskUz23eN/test-tmp/rpc-test-a52aa4677f0c43218b604e063c5aa3b4.sock every 8 connection(s)
I20260925 16:41:42.267045 11811 acceptor_pool.cc:254] collecting diagnostics on the listening RPC socket unix:/tmp/dist-test-taskUz23eN/test-tmp/rpc-test-a52aa4677f0c43218b604e063c5aa3b4.sock every 8 connection(s)
I20260925 16:41:42.270159 11664 rpc-test.cc:569] Connecting to unix:/tmp/dist-test-taskUz23eN/test-tmp/rpc-test-a52aa4677f0c43218b604e063c5aa3b4.sock
W20260925 16:44:02.038285 11807 connection.cc:196] Error closing socket: Network error: TlsSocket::Close: Broken pipe
[ OK ] Parameters/TestRpc.TestClientConnectionMetrics/SSL_UnixSocket (139797 ms)
[ RUN ] Parameters/TestRpc.TestCredentialsPolicy/SSL_UnixSocket
I20260925 16:44:02.061161 11847 acceptor_pool.cc:254] collecting diagnostics on the listening RPC socket unix:/tmp/dist-test-taskUz23eN/test-tmp/rpc-test-c1ac1fa28a104d839c8fbe6e210b4781.sock every 8 connection(s)
I20260925 16:44:02.062027 11848 acceptor_pool.cc:254] collecting diagnostics on the listening RPC socket unix:/tmp/dist-test-taskUz23eN/test-tmp/rpc-test-c1ac1fa28a104d839c8fbe6e210b4781.sock every 8 connection(s)
I20260925 16:44:02.065250 11664 rpc-test.cc:700] Connecting to unix:/tmp/dist-test-taskUz23eN/test-tmp/rpc-test-c1ac1fa28a104d839c8fbe6e210b4781.sock
W20260925 16:44:02.103957 11846 connection.cc:196] Error closing socket: Network error: TlsSocket::Close: Broken pipe
[ OK ] Parameters/TestRpc.TestCredentialsPolicy/SSL_UnixSocket (78 ms)
[ RUN ] Parameters/TestRpc.TestCallLongerThanKeepalive/SSL_UnixSocket
I20260925 16:44:02.165619 11872 acceptor_pool.cc:254] collecting diagnostics on the listening RPC socket unix:/tmp/dist-test-taskUz23eN/test-tmp/rpc-test-84f1b741efcf4e80a341cbe8288fd4d3.sock every 8 connection(s)
I20260925 16:44:02.166345 11873 acceptor_pool.cc:254] collecting diagnostics on the listening RPC socket unix:/tmp/dist-test-taskUz23eN/test-tmp/rpc-test-84f1b741efcf4e80a341cbe8288fd4d3.sock every 8 connection(s)
I20260925 16:44:02.202673 11876 rpc-test-base.h:222] got call: sleep_micros: 3000000 deferred: true
I20260925 16:44:05.207010 11876 rpcz_store.cc:275] Call kudu.rpc.GenericCalculatorService.Sleep from unix:<unnamed> (request call id 0) took 3004 ms. Trace:
I20260925 16:44:05.207365 11876 rpcz_store.cc:276] 0925 16:44:02.202517 (+ 0us) service_pool.cc:170] Inserting onto call queue
0925 16:44:02.202619 (+ 102us) service_pool.cc:227] Handling call
0925 16:44:05.206937 (+3004318us) inbound_call.cc:173] Queueing success response
Metrics: {}
[ OK ] Parameters/TestRpc.TestCallLongerThanKeepalive/SSL_UnixSocket (3092 ms)
[ RUN ] Parameters/TestRpc.TestRpcSidecar/SSL_UnixSocket
I20260925 16:44:05.262828 11897 acceptor_pool.cc:254] collecting diagnostics on the listening RPC socket unix:/tmp/dist-test-taskUz23eN/test-tmp/rpc-test-f73d35baa93049e4882394f12a025cea.sock every 8 connection(s)
I20260925 16:44:05.263585 11898 acceptor_pool.cc:254] collecting diagnostics on the listening RPC socket unix:/tmp/dist-test-taskUz23eN/test-tmp/rpc-test-f73d35baa93049e4882394f12a025cea.sock every 8 connection(s)
W20260925 16:44:05.817622 11894 connection.cc:196] Error closing socket: Network error: TlsSocket::Close: Broken pipe
[ OK ] Parameters/TestRpc.TestRpcSidecar/SSL_UnixSocket (605 ms)
[ RUN ] Parameters/TestRpc.TestRpcSidecarLimits/SSL_UnixSocket
I20260925 16:44:22.766741 11924 acceptor_pool.cc:254] collecting diagnostics on the listening RPC socket unix:/tmp/dist-test-taskUz23eN/test-tmp/rpc-test-81e424c1a91e415db4f40bdd9fb83b46.sock every 8 connection(s)
I20260925 16:44:22.767843 11925 acceptor_pool.cc:254] collecting diagnostics on the listening RPC socket unix:/tmp/dist-test-taskUz23eN/test-tmp/rpc-test-81e424c1a91e415db4f40bdd9fb83b46.sock every 8 connection(s)
W20260925 16:44:22.795574 11664 serialization.cc:72] Serialized kudu.rpc_test.PushStringsRequestPB (2147483654 bytes) is larger than the maximum configured RPC message size (52428800 bytes). Sending anyway, but peer may reject the data.
W20260925 16:44:22.805292 11921 connection.cc:535] server connection from unix:<unnamed> recv error: Network error: RPC frame had a length of 2147483714, but we only support messages up to 52428800 bytes long.
W20260925 16:44:22.805653 11921 connection.cc:158] shutting down server connection from unix:<unnamed> with pending inbound data: 4/2147483714 bytes received; last active 0 ns ago: status Network error: RPC frame had a length of 2147483714, but we only support messages up to 52428800 bytes long.
W20260925 16:44:22.806345 11937 connection.cc:698] client connection to unix:/tmp/dist-test-taskUz23eN/test-tmp/rpc-test-81e424c1a91e415db4f40bdd9fb83b46.sock send error: Network error: failed to write to TLS socket: Broken pipe
W20260925 16:44:22.806885 11937 connection.cc:196] Error closing socket: Network error: TlsSocket::Close: Success
[ OK ] Parameters/TestRpc.TestRpcSidecarLimits/SSL_UnixSocket (17626 ms)
[ RUN ] Parameters/TestRpc.TestCallTimeoutDoesntAffectNegotiation/SSL_UnixSocket
I20260925 16:44:23.470685 11949 acceptor_pool.cc:254] collecting diagnostics on the listening RPC socket unix:/tmp/dist-test-taskUz23eN/test-tmp/rpc-test-e8ef6fe40ac54737b7462c864241ad8a.sock every 8 connection(s)
I20260925 16:44:23.471426 11950 acceptor_pool.cc:254] collecting diagnostics on the listening RPC socket unix:/tmp/dist-test-taskUz23eN/test-tmp/rpc-test-e8ef6fe40ac54737b7462c864241ad8a.sock every 8 connection(s)
W20260925 16:44:23.486996 11945 negotiation.cc:266] Injecting 500ms delay in negotiation
I20260925 16:44:23.537129 11664 rpc-test-base.h:595] status: Timed out: connection negotiation to unix:/tmp/dist-test-taskUz23eN/test-tmp/rpc-test-e8ef6fe40ac54737b7462c864241ad8a.sock for RPC Sleep timed out after 0.050s (ON_OUTBOUND_QUEUE), seconds elapsed: 0.050963
W20260925 16:44:23.999681 11946 connection.cc:196] Error closing socket: Network error: TlsSocket::Close: Broken pipe
[ OK ] Parameters/TestRpc.TestCallTimeoutDoesntAffectNegotiation/SSL_UnixSocket (555 ms)
[ RUN ] Parameters/TestRpc.TestRpcHandlerLatencyMetric/SSL_UnixSocket
I20260925 16:44:24.029940 11974 acceptor_pool.cc:254] collecting diagnostics on the listening RPC socket unix:/tmp/dist-test-taskUz23eN/test-tmp/rpc-test-1ad00f1e34b24127883616618c9c6166.sock every 8 connection(s)
I20260925 16:44:24.030607 11975 acceptor_pool.cc:254] collecting diagnostics on the listening RPC socket unix:/tmp/dist-test-taskUz23eN/test-tmp/rpc-test-1ad00f1e34b24127883616618c9c6166.sock every 8 connection(s)
I20260925 16:44:24.084424 11664 rpc-test.cc:1236] Sleep() min lat: 21569
I20260925 16:44:24.084649 11664 rpc-test.cc:1237] Sleep() mean lat: 21569
I20260925 16:44:24.084807 11664 rpc-test.cc:1238] Sleep() max lat: 21569
I20260925 16:44:24.084915 11664 rpc-test.cc:1239] Sleep() #calls: 1
W20260925 16:44:24.092422 11971 connection.cc:196] Error closing socket: Network error: TlsSocket::Close: Broken pipe
[ OK ] Parameters/TestRpc.TestRpcHandlerLatencyMetric/SSL_UnixSocket (93 ms)
[ RUN ] Parameters/TestRpc.TimedOutOnResponseMetricServiceQueue/SSL_UnixSocket
I20260925 16:44:24.115967 12000 acceptor_pool.cc:254] collecting diagnostics on the listening RPC socket unix:/tmp/dist-test-taskUz23eN/test-tmp/rpc-test-cd633550a23b4e1babafa76d43dcea5c.sock every 8 connection(s)
I20260925 16:44:24.116674 12001 acceptor_pool.cc:254] collecting diagnostics on the listening RPC socket unix:/tmp/dist-test-taskUz23eN/test-tmp/rpc-test-cd633550a23b4e1babafa76d43dcea5c.sock every 8 connection(s)
W20260925 16:44:24.194787 12002 rpcz_store.cc:267] Call kudu.rpc_test.CalculatorService.Sleep from unix:<unnamed> (request call id 2) took 20 ms (client timeout 20 ms). Trace:
W20260925 16:44:24.195180 12002 rpcz_store.cc:269] 0925 16:44:24.174144 (+ 0us) service_pool.cc:170] Inserting onto call queue
0925 16:44:24.194523 (+ 20379us) service_pool.cc:214] Skipping call since client already timed out
0925 16:44:24.194692 (+ 169us) inbound_call.cc:173] Queueing failure response
Metrics: {}
W20260925 16:44:24.197767 11997 connection.cc:196] Error closing socket: Network error: TlsSocket::Close: Broken pipe
[ OK ] Parameters/TestRpc.TimedOutOnResponseMetricServiceQueue/SSL_UnixSocket (103 ms)
[ RUN ] Parameters/TestRpc.RpcPendingConnectionsMetric/SSL_UnixSocket
I20260925 16:44:24.212116 12023 acceptor_pool.cc:254] collecting diagnostics on the listening RPC socket 0.0.0.0:39501 every 8 connection(s)
I20260925 16:44:24.212857 12024 acceptor_pool.cc:254] collecting diagnostics on the listening RPC socket 0.0.0.0:39501 every 8 connection(s)
W20260925 16:44:24.218057 12019 negotiation.cc:337] Failed RPC negotiation. Trace:
0925 16:44:24.216600 (+ 0us) reactor.cc:625] Submitting negotiation task for server connection from 127.0.0.1:49230 (local address 127.0.0.1:39501)
0925 16:44:24.217010 (+ 410us) server_negotiation.cc:206] Beginning negotiation
0925 16:44:24.217028 (+ 18us) server_negotiation.cc:399] Waiting for connection header
0925 16:44:24.217280 (+ 252us) negotiation.cc:327] Negotiation complete: Network error: Server connection negotiation failed: server connection from 127.0.0.1:49230: BlockingRecv error: recv got EOF from 127.0.0.1:49230 (error 108)
Metrics: {"server-negotiator.queue_time_us":118}
[ OK ] Parameters/TestRpc.RpcPendingConnectionsMetric/SSL_UnixSocket (29 ms)
[ RUN ] Parameters/TestRpc.TestRpcContextClientDeadline/SSL_UnixSocket
I20260925 16:44:24.260161 12039 acceptor_pool.cc:254] collecting diagnostics on the listening RPC socket unix:/tmp/dist-test-taskUz23eN/test-tmp/rpc-test-af87198aa145409286cafba57c3fea1b.sock every 8 connection(s)
I20260925 16:44:24.260870 12040 acceptor_pool.cc:254] collecting diagnostics on the listening RPC socket unix:/tmp/dist-test-taskUz23eN/test-tmp/rpc-test-af87198aa145409286cafba57c3fea1b.sock every 8 connection(s)
W20260925 16:44:24.323444 12036 connection.cc:196] Error closing socket: Network error: TlsSocket::Close: Broken pipe
[ OK ] Parameters/TestRpc.TestRpcContextClientDeadline/SSL_UnixSocket (96 ms)
[ RUN ] Parameters/TestRpc.TestApplicationFeatureFlagUnsupportedServer/SSL_UnixSocket
I20260925 16:44:24.353523 12064 acceptor_pool.cc:254] collecting diagnostics on the listening RPC socket unix:/tmp/dist-test-taskUz23eN/test-tmp/rpc-test-a44e86dbbf15453e90378f61732c8590.sock every 8 connection(s)
I20260925 16:44:24.354195 12065 acceptor_pool.cc:254] collecting diagnostics on the listening RPC socket unix:/tmp/dist-test-taskUz23eN/test-tmp/rpc-test-a44e86dbbf15453e90378f61732c8590.sock every 8 connection(s)
[ OK ] Parameters/TestRpc.TestApplicationFeatureFlagUnsupportedServer/SSL_UnixSocket (68 ms)
[ RUN ] Parameters/TestRpc.TestCancellationAsync/SSL_UnixSocket
I20260925 16:44:24.421347 12089 acceptor_pool.cc:254] collecting diagnostics on the listening RPC socket unix:/tmp/dist-test-taskUz23eN/test-tmp/rpc-test-0b1e40ac365649ecaeb448a003d1a0d8.sock every 8 connection(s)
I20260925 16:44:24.422053 12090 acceptor_pool.cc:254] collecting diagnostics on the listening RPC socket unix:/tmp/dist-test-taskUz23eN/test-tmp/rpc-test-0b1e40ac365649ecaeb448a003d1a0d8.sock every 8 connection(s)
I20260925 16:44:24.425153 11664 rpc-test.cc:1716] Connecting to unix:/tmp/dist-test-taskUz23eN/test-tmp/rpc-test-0b1e40ac365649ecaeb448a003d1a0d8.sock
I20260925 16:44:24.461501 11664 test_util.cc:268] Using random seed: 1842091176
I20260925 16:44:24.678733 12093 rpc-test-base.h:240] got call: sleep_micros: 500 pattern: 4294967295 num_repetitions: 2097152 sidecar_idx: 0
I20260925 16:44:24.863978 12092 rpc-test-base.h:240] got call: sleep_micros: 500 pattern: 4294967295 num_repetitions: 2097152 sidecar_idx: 0
I20260925 16:44:25.106194 12092 rpc-test-base.h:240] got call: sleep_micros: 500 pattern: 4294967295 num_repetitions: 2097152 sidecar_idx: 0
I20260925 16:44:25.312611 12092 rpc-test-base.h:240] got call: sleep_micros: 500 pattern: 4294967295 num_repetitions: 2097152 sidecar_idx: 0
I20260925 16:44:25.515345 12093 rpc-test-base.h:240] got call: sleep_micros: 500 pattern: 4294967295 num_repetitions: 2097152 sidecar_idx: 0
I20260925 16:44:25.730677 12092 rpc-test-base.h:240] got call: sleep_micros: 500 pattern: 4294967295 num_repetitions: 2097152 sidecar_idx: 0
I20260925 16:44:25.949478 12093 rpc-test-base.h:240] got call: sleep_micros: 500 pattern: 4294967295 num_repetitions: 2097152 sidecar_idx: 0
I20260925 16:44:26.151139 12093 rpc-test-base.h:240] got call: sleep_micros: 500 pattern: 4294967295 num_repetitions: 2097152 sidecar_idx: 0
I20260925 16:44:26.344437 12092 rpc-test-base.h:240] got call: sleep_micros: 500 pattern: 4294967295 num_repetitions: 2097152 sidecar_idx: 0
W20260925 16:44:26.359994 12086 connection.cc:196] Error closing socket: Network error: TlsSocket::Close: Broken pipe
W20260925 16:44:26.389106 12086 connection.cc:441] server connection from unix:<unnamed> torn down before Call kudu.rpc.GenericCalculatorService.SleepWithSidecar from unix:<unnamed> (request call id 8) could send its response
W20260925 16:44:26.500414 12086 connection.cc:441] server connection from unix:<unnamed> torn down before Call kudu.rpc.GenericCalculatorService.SleepWithSidecar from unix:<unnamed> (request call id 9) could send its response
[ OK ] Parameters/TestRpc.TestCancellationAsync/SSL_UnixSocket (2113 ms)
[ RUN ] Parameters/TestRpc.TestPerformanceBySocketType/SSL_UnixSocket
I20260925 16:44:26.603965 12114 acceptor_pool.cc:254] collecting diagnostics on the listening RPC socket unix:/tmp/dist-test-taskUz23eN/test-tmp/rpc-test-a03591dbca6e4bd8a0aa952ccbcd1d13.sock every 8 connection(s)
I20260925 16:44:26.604698 12115 acceptor_pool.cc:254] collecting diagnostics on the listening RPC socket unix:/tmp/dist-test-taskUz23eN/test-tmp/rpc-test-a03591dbca6e4bd8a0aa952ccbcd1d13.sock every 8 connection(s)
I20260925 16:44:26.607963 11664 rpc-test.cc:1846] Connecting to unix:/tmp/dist-test-taskUz23eN/test-tmp/rpc-test-a03591dbca6e4bd8a0aa952ccbcd1d13.sock
I20260925 16:44:47.895148 11664 rpc-test.cc:1859] Sending 1024MB via ssl-enabled unix socket: real 21.264s user 19.044s sys 12.838s
I20260925 16:45:09.196527 11664 rpc-test.cc:1859] Sending 1024MB via ssl-enabled unix socket: real 21.301s user 19.222s sys 12.801s
I20260925 16:45:30.659304 11664 rpc-test.cc:1859] Sending 1024MB via ssl-enabled unix socket: real 21.462s user 19.003s sys 13.178s
I20260925 16:45:51.577211 11664 rpc-test.cc:1859] Sending 1024MB via ssl-enabled unix socket: real 20.917s user 18.714s sys 12.484s
I20260925 16:46:12.627046 11664 rpc-test.cc:1859] Sending 1024MB via ssl-enabled unix socket: real 21.049s user 18.995s sys 12.454s
W20260925 16:46:12.632597 12111 connection.cc:196] Error closing socket: Network error: TlsSocket::Close: Broken pipe
[ OK ] Parameters/TestRpc.TestPerformanceBySocketType/SSL_UnixSocket (106132 ms)
[----------] 20 tests from Parameters/TestRpc (272977 ms total)
[----------] 1 test from Parameters/TestRpcSocketTxRxQueue
[ RUN ] Parameters/TestRpcSocketTxRxQueue.AcceptorRxQueueSizeMetric/0
I20260925 16:46:12.660074 12150 acceptor_pool.cc:254] collecting diagnostics on the listening RPC socket 0.0.0.0:46439 every 1 connection(s)
I20260925 16:46:12.660914 12151 acceptor_pool.cc:254] collecting diagnostics on the listening RPC socket 0.0.0.0:46439 every 1 connection(s)
W20260925 16:46:12.665937 12146 negotiation.cc:337] Failed RPC negotiation. Trace:
0925 16:46:12.664624 (+ 0us) reactor.cc:625] Submitting negotiation task for server connection from 127.0.0.1:44800 (local address 127.0.0.1:46439)
0925 16:46:12.665065 (+ 441us) server_negotiation.cc:206] Beginning negotiation
0925 16:46:12.665089 (+ 24us) server_negotiation.cc:399] Waiting for connection header
0925 16:46:12.665310 (+ 221us) negotiation.cc:327] Negotiation complete: Network error: Server connection negotiation failed: server connection from 127.0.0.1:44800: BlockingRecv error: recv got EOF from 127.0.0.1:44800 (error 108)
Metrics: {"server-negotiator.queue_time_us":115}
[ OK ] Parameters/TestRpcSocketTxRxQueue.AcceptorRxQueueSizeMetric/0 (30 ms)
[----------] 1 test from Parameters/TestRpcSocketTxRxQueue (30 ms total)
[----------] Global test environment tear-down
[==========] 21 tests from 2 test suites ran. (273008 ms total)
[ PASSED ] 20 tests.
[ FAILED ] 1 test, listed below:
[ FAILED ] Parameters/TestRpc.TestCallWithChainCertAndChainCA/SSL_UnixSocket, where GetParam() = (true, true)
1 FAILED TEST