Diagnosed failure

Parameters/TestRpc.TestCallWithChainCertAndChainCA/SSL_UnixSocket: /data0/somelongdirectorytoavoidrpathissues/src/kudu/src/kudu/rpc/rpc-test.cc:270: Failure
Failed
Bad status: Runtime error: could not verify certificate chain (error with cert: subject=CN = localhost, ST = sadfjas, C = AS, emailAddress = sdflkdsajf, O = lskdfjlsad, OU = sldfkja, issuer=C = AS, ST = ASDfkjdhf, L = lskdjf, O = saldfja, OU = skdjf, CN = localhost, emailAddress = sadjflkadsj): : certificate has expired
Google Test trace:
/data0/somelongdirectorytoavoidrpathissues/src/kudu/src/kudu/rpc/rpc-test.cc:267: Connecting to unix:/tmp/dist-test-taskEWBsQL/test-tmp/rpc-test-c418d748d2d04ecdb8bef069b7b28f5e.sock
I20260923 19:39:54.137701 12070 test_util.cc:175] -----------------------------------------------
I20260923 19:39:54.137759 12070 test_util.cc:176] Had fatal failures, leaving test files at /tmp/dist-test-taskEWBsQL/test-tmp/rpc-test.6.Parameters_TestRpc.TestCallWithChainCertAndChainCA_SSL_UnixSocket.1790192394057484-12070-0

Full log

Note: This is test shard 7 of 8.
[==========] Running 21 tests from 2 test suites.
[----------] Global test environment set-up.
[----------] 20 tests from Parameters/TestRpc
[ RUN      ] Parameters/TestRpc.TestMessengerCreateDestroy/SSL_UnixSocket
WARNING: Logging before InitGoogleLogging() is written to STDERR
I20260923 19:39:54.088649 12070 rpc-test.cc:169] started messenger TestCreateDestroy
[       OK ] Parameters/TestRpc.TestMessengerCreateDestroy/SSL_UnixSocket (25 ms)
[ RUN      ] Parameters/TestRpc.TestNegotiationDeadlock/SSL_UnixSocket
I20260923 19:39:54.102568 12090 acceptor_pool.cc:254] collecting diagnostics on the listening RPC socket unix:/tmp/dist-test-taskEWBsQL/test-tmp/rpc-test-730882d67db04d33b0dc242327c0361b.sock every 8 connection(s)
I20260923 19:39:54.102617 12091 acceptor_pool.cc:254] collecting diagnostics on the listening RPC socket unix:/tmp/dist-test-taskEWBsQL/test-tmp/rpc-test-730882d67db04d33b0dc242327c0361b.sock every 8 connection(s)
[       OK ] Parameters/TestRpc.TestNegotiationDeadlock/SSL_UnixSocket (23 ms)
[ RUN      ] Parameters/TestRpc.TestCallWithChainCertAndChainCA/SSL_UnixSocket
I20260923 19:39:54.132385 12106 acceptor_pool.cc:254] collecting diagnostics on the listening RPC socket unix:/tmp/dist-test-taskEWBsQL/test-tmp/rpc-test-c418d748d2d04ecdb8bef069b7b28f5e.sock every 8 connection(s)
I20260923 19:39:54.132434 12107 acceptor_pool.cc:254] collecting diagnostics on the listening RPC socket unix:/tmp/dist-test-taskEWBsQL/test-tmp/rpc-test-c418d748d2d04ecdb8bef069b7b28f5e.sock every 8 connection(s)
/data0/somelongdirectorytoavoidrpathissues/src/kudu/src/kudu/rpc/rpc-test.cc:270: Failure
Failed
Bad status: Runtime error: could not verify certificate chain (error with cert: subject=CN = localhost, ST = sadfjas, C = AS, emailAddress = sdflkdsajf, O = lskdfjlsad, OU = sldfkja, issuer=C = AS, ST = ASDfkjdhf, L = lskdjf, O = saldfja, OU = skdjf, CN = localhost, emailAddress = sadjflkadsj): : certificate has expired
Google Test trace:
/data0/somelongdirectorytoavoidrpathissues/src/kudu/src/kudu/rpc/rpc-test.cc:267: Connecting to unix:/tmp/dist-test-taskEWBsQL/test-tmp/rpc-test-c418d748d2d04ecdb8bef069b7b28f5e.sock
I20260923 19:39:54.137701 12070 test_util.cc:175] -----------------------------------------------
I20260923 19:39:54.137759 12070 test_util.cc:176] Had fatal failures, leaving test files at /tmp/dist-test-taskEWBsQL/test-tmp/rpc-test.6.Parameters_TestRpc.TestCallWithChainCertAndChainCA_SSL_UnixSocket.1790192394057484-12070-0
[  FAILED  ] Parameters/TestRpc.TestCallWithChainCertAndChainCA/SSL_UnixSocket, where GetParam() = (true, true) (24 ms)
[ RUN      ] Parameters/TestRpc.TestCallWithPasswordProtectedKey/SSL_UnixSocket
I20260923 19:39:54.145138 12131 acceptor_pool.cc:254] collecting diagnostics on the listening RPC socket unix:/tmp/dist-test-taskEWBsQL/test-tmp/rpc-test-6dacf43dadbf4816a11fca3c062de57b.sock every 8 connection(s)
I20260923 19:39:54.145159 12132 acceptor_pool.cc:254] collecting diagnostics on the listening RPC socket unix:/tmp/dist-test-taskEWBsQL/test-tmp/rpc-test-6dacf43dadbf4816a11fca3c062de57b.sock every 8 connection(s)
W20260923 19:39:54.158836 12128 connection.cc:196] Error closing socket: Network error: TlsSocket::Close: Broken pipe
[       OK ] Parameters/TestRpc.TestCallWithPasswordProtectedKey/SSL_UnixSocket (22 ms)
[ RUN      ] Parameters/TestRpc.TestCallToBadServer/SSL_UnixSocket
I20260923 19:39:54.197542 12070 rpc-test.cc:394] Status: Network error: Client connection negotiation failed: client connection to 0.0.0.0:0: connect: Connection refused (error 111)
I20260923 19:39:54.198074 12070 rpc-test.cc:394] Status: Network error: Client connection negotiation failed: client connection to 0.0.0.0:0: connect: Connection refused (error 111)
I20260923 19:39:54.198553 12070 rpc-test.cc:394] Status: Network error: Client connection negotiation failed: client connection to 0.0.0.0:0: connect: Connection refused (error 111)
I20260923 19:39:54.199008 12070 rpc-test.cc:394] Status: Network error: Client connection negotiation failed: client connection to 0.0.0.0:0: connect: Connection refused (error 111)
I20260923 19:39:54.199478 12070 rpc-test.cc:394] Status: Network error: Client connection negotiation failed: client connection to 0.0.0.0:0: connect: Connection refused (error 111)
[       OK ] Parameters/TestRpc.TestCallToBadServer/SSL_UnixSocket (39 ms)
[ RUN      ] Parameters/TestRpc.TestWrongService/SSL_UnixSocket
I20260923 19:39:54.209213 12166 acceptor_pool.cc:254] collecting diagnostics on the listening RPC socket unix:/tmp/dist-test-taskEWBsQL/test-tmp/rpc-test-ea7fb3bf17534e04979809ca81c3e6c0.sock every 8 connection(s)
I20260923 19:39:54.209322 12167 acceptor_pool.cc:254] collecting diagnostics on the listening RPC socket unix:/tmp/dist-test-taskEWBsQL/test-tmp/rpc-test-ea7fb3bf17534e04979809ca81c3e6c0.sock every 8 connection(s)
I20260923 19:39:54.227931 12163 messenger.cc:345] service WrongServiceName not registered on TestServer
[       OK ] Parameters/TestRpc.TestWrongService/SSL_UnixSocket (29 ms)
[ RUN      ] Parameters/TestRpc.TestConnectionKeepalive/SSL_UnixSocket
I20260923 19:39:54.262458 12189 acceptor_pool.cc:254] collecting diagnostics on the listening RPC socket unix:/tmp/dist-test-taskEWBsQL/test-tmp/rpc-test-4855b64db3dc4fc9b326972e86b24e2f.sock every 8 connection(s)
I20260923 19:39:54.262494 12190 acceptor_pool.cc:254] collecting diagnostics on the listening RPC socket unix:/tmp/dist-test-taskEWBsQL/test-tmp/rpc-test-4855b64db3dc4fc9b326972e86b24e2f.sock every 8 connection(s)
I20260923 19:39:54.262813 12070 rpc-test.cc:488] Connecting to unix:/tmp/dist-test-taskEWBsQL/test-tmp/rpc-test-4855b64db3dc4fc9b326972e86b24e2f.sock
W20260923 19:39:54.732359 12202 connection.cc:196] Error closing socket: Network error: TlsSocket::Close: Broken pipe
[       OK ] Parameters/TestRpc.TestConnectionKeepalive/SSL_UnixSocket (1049 ms)
[ RUN      ] Parameters/TestRpc.TestClientConnectionMetrics/SSL_UnixSocket
I20260923 19:39:55.290199 12214 acceptor_pool.cc:254] collecting diagnostics on the listening RPC socket unix:/tmp/dist-test-taskEWBsQL/test-tmp/rpc-test-8f32f080418f4bdf800fd08a1b4d5793.sock every 8 connection(s)
I20260923 19:39:55.290324 12215 acceptor_pool.cc:254] collecting diagnostics on the listening RPC socket unix:/tmp/dist-test-taskEWBsQL/test-tmp/rpc-test-8f32f080418f4bdf800fd08a1b4d5793.sock every 8 connection(s)
I20260923 19:39:55.290578 12070 rpc-test.cc:569] Connecting to unix:/tmp/dist-test-taskEWBsQL/test-tmp/rpc-test-8f32f080418f4bdf800fd08a1b4d5793.sock
W20260923 19:40:05.203634 12211 connection.cc:196] Error closing socket: Network error: TlsSocket::Close: Broken pipe
[       OK ] Parameters/TestRpc.TestClientConnectionMetrics/SSL_UnixSocket (9925 ms)
[ RUN      ] Parameters/TestRpc.TestCredentialsPolicy/SSL_UnixSocket
I20260923 19:40:05.238906 12238 acceptor_pool.cc:254] collecting diagnostics on the listening RPC socket unix:/tmp/dist-test-taskEWBsQL/test-tmp/rpc-test-3a736b3f350f4cccb3a7246569c1635f.sock every 8 connection(s)
I20260923 19:40:05.238946 12237 acceptor_pool.cc:254] collecting diagnostics on the listening RPC socket unix:/tmp/dist-test-taskEWBsQL/test-tmp/rpc-test-3a736b3f350f4cccb3a7246569c1635f.sock every 8 connection(s)
I20260923 19:40:05.239197 12070 rpc-test.cc:700] Connecting to unix:/tmp/dist-test-taskEWBsQL/test-tmp/rpc-test-3a736b3f350f4cccb3a7246569c1635f.sock
W20260923 19:40:05.264143 12236 connection.cc:196] Error closing socket: Network error: TlsSocket::Close: Broken pipe
[       OK ] Parameters/TestRpc.TestCredentialsPolicy/SSL_UnixSocket (65 ms)
[ RUN      ] Parameters/TestRpc.TestCallLongerThanKeepalive/SSL_UnixSocket
I20260923 19:40:05.295549 12262 acceptor_pool.cc:254] collecting diagnostics on the listening RPC socket unix:/tmp/dist-test-taskEWBsQL/test-tmp/rpc-test-824750dbb7354200b8b7320090635ad5.sock every 8 connection(s)
I20260923 19:40:05.295567 12263 acceptor_pool.cc:254] collecting diagnostics on the listening RPC socket unix:/tmp/dist-test-taskEWBsQL/test-tmp/rpc-test-824750dbb7354200b8b7320090635ad5.sock every 8 connection(s)
I20260923 19:40:05.339825 12266 rpc-test-base.h:222] got call: sleep_micros: 3000000 deferred: true
I20260923 19:40:08.340749 12266 rpcz_store.cc:275] Call kudu.rpc.GenericCalculatorService.Sleep from unix:<unnamed> (request call id 0) took 3001 ms. Trace:
I20260923 19:40:08.340864 12266 rpcz_store.cc:276] 0923 19:40:05.339743 (+     0us) service_pool.cc:170] Inserting onto call queue
0923 19:40:05.339801 (+    58us) service_pool.cc:227] Handling call
0923 19:40:08.340729 (+3000928us) inbound_call.cc:173] Queueing success response
Metrics: {}
[       OK ] Parameters/TestRpc.TestCallLongerThanKeepalive/SSL_UnixSocket (3073 ms)
[ RUN      ] Parameters/TestRpc.TestRpcSidecar/SSL_UnixSocket
I20260923 19:40:08.375070 12287 acceptor_pool.cc:254] collecting diagnostics on the listening RPC socket unix:/tmp/dist-test-taskEWBsQL/test-tmp/rpc-test-7ea421a28c314f82afd6b96e976031b3.sock every 8 connection(s)
I20260923 19:40:08.375110 12288 acceptor_pool.cc:254] collecting diagnostics on the listening RPC socket unix:/tmp/dist-test-taskEWBsQL/test-tmp/rpc-test-7ea421a28c314f82afd6b96e976031b3.sock every 8 connection(s)
W20260923 19:40:08.463562 12284 connection.cc:196] Error closing socket: Network error: TlsSocket::Close: Broken pipe
[       OK ] Parameters/TestRpc.TestRpcSidecar/SSL_UnixSocket (120 ms)
[ RUN      ] Parameters/TestRpc.TestRpcSidecarLimits/SSL_UnixSocket
I20260923 19:40:10.125380 12312 acceptor_pool.cc:254] collecting diagnostics on the listening RPC socket unix:/tmp/dist-test-taskEWBsQL/test-tmp/rpc-test-a50ec84f62a14ae19daeb230943265ed.sock every 8 connection(s)
I20260923 19:40:10.125411 12313 acceptor_pool.cc:254] collecting diagnostics on the listening RPC socket unix:/tmp/dist-test-taskEWBsQL/test-tmp/rpc-test-a50ec84f62a14ae19daeb230943265ed.sock every 8 connection(s)
W20260923 19:40:10.150103 12070 serialization.cc:72] Serialized kudu.rpc_test.PushStringsRequestPB (2147483654 bytes) is larger than the maximum configured RPC message size (52428800 bytes). Sending anyway, but peer may reject the data.
W20260923 19:40:10.154084 12309 connection.cc:535] server connection from unix:<unnamed> recv error: Network error: RPC frame had a length of 2147483714, but we only support messages up to 52428800 bytes long.
W20260923 19:40:10.154170 12309 connection.cc:158] shutting down server connection from unix:<unnamed> with pending inbound data: 4/2147483714 bytes received; last active 0 ns ago: status Network error: RPC frame had a length of 2147483714, but we only support messages up to 52428800 bytes long.
W20260923 19:40:10.154469 12325 connection.cc:196] Error closing socket: Network error: TlsSocket::Close: Broken pipe
I20260923 19:40:10.177464 12337 acceptor_pool.cc:254] collecting diagnostics on the listening RPC socket unix:/tmp/dist-test-taskEWBsQL/test-tmp/rpc-test-a50ec84f62a14ae19daeb230943265ed.sock every 8 connection(s)
I20260923 19:40:10.178143 12338 acceptor_pool.cc:254] collecting diagnostics on the listening RPC socket unix:/tmp/dist-test-taskEWBsQL/test-tmp/rpc-test-a50ec84f62a14ae19daeb230943265ed.sock every 8 connection(s)
W20260923 19:40:14.846269 12334 connection.cc:577] server connection from unix:<unnamed>: received bad data: 'Corruption: Invalid packet: message had a length of 2147483710, but we only support messages up to 2147483647 bytes
'
W20260923 19:40:14.846699 12350 connection.cc:196] Error closing socket: Network error: TlsSocket::Close: Broken pipe
[       OK ] Parameters/TestRpc.TestRpcSidecarLimits/SSL_UnixSocket (6384 ms)
[ RUN      ] Parameters/TestRpc.TestCallTimeoutDoesntAffectNegotiation/SSL_UnixSocket
I20260923 19:40:14.891881 12362 acceptor_pool.cc:254] collecting diagnostics on the listening RPC socket unix:/tmp/dist-test-taskEWBsQL/test-tmp/rpc-test-31c7923bca3a402c89fbcdaf64296cc1.sock every 8 connection(s)
I20260923 19:40:14.891939 12363 acceptor_pool.cc:254] collecting diagnostics on the listening RPC socket unix:/tmp/dist-test-taskEWBsQL/test-tmp/rpc-test-31c7923bca3a402c89fbcdaf64296cc1.sock every 8 connection(s)
W20260923 19:40:14.900756 12358 negotiation.cc:266] Injecting 500ms delay in negotiation
I20260923 19:40:14.951220 12070 rpc-test-base.h:595] status: Timed out: connection negotiation to unix:/tmp/dist-test-taskEWBsQL/test-tmp/rpc-test-31c7923bca3a402c89fbcdaf64296cc1.sock for RPC Sleep timed out after 0.050s (ON_OUTBOUND_QUEUE), seconds elapsed: 0.050851
W20260923 19:40:15.405685 12359 connection.cc:196] Error closing socket: Network error: TlsSocket::Close: Broken pipe
[       OK ] Parameters/TestRpc.TestCallTimeoutDoesntAffectNegotiation/SSL_UnixSocket (557 ms)
[ RUN      ] Parameters/TestRpc.TestRpcHandlerLatencyMetric/SSL_UnixSocket
I20260923 19:40:15.436637 12387 acceptor_pool.cc:254] collecting diagnostics on the listening RPC socket unix:/tmp/dist-test-taskEWBsQL/test-tmp/rpc-test-e762200939b4453889c08383a42ff281.sock every 8 connection(s)
I20260923 19:40:15.436679 12388 acceptor_pool.cc:254] collecting diagnostics on the listening RPC socket unix:/tmp/dist-test-taskEWBsQL/test-tmp/rpc-test-e762200939b4453889c08383a42ff281.sock every 8 connection(s)
I20260923 19:40:15.491259 12070 rpc-test.cc:1236] Sleep() min lat: 20378
I20260923 19:40:15.491330 12070 rpc-test.cc:1237] Sleep() mean lat: 20378
I20260923 19:40:15.491357 12070 rpc-test.cc:1238] Sleep() max lat: 20378
I20260923 19:40:15.491371 12070 rpc-test.cc:1239] Sleep() #calls: 1
[       OK ] Parameters/TestRpc.TestRpcHandlerLatencyMetric/SSL_UnixSocket (86 ms)
[ RUN      ] Parameters/TestRpc.TimedOutOnResponseMetricServiceQueue/SSL_UnixSocket
I20260923 19:40:15.499655 12413 acceptor_pool.cc:254] collecting diagnostics on the listening RPC socket unix:/tmp/dist-test-taskEWBsQL/test-tmp/rpc-test-4661deeffa3545a4bc569385211d5f30.sock every 8 connection(s)
I20260923 19:40:15.499716 12414 acceptor_pool.cc:254] collecting diagnostics on the listening RPC socket unix:/tmp/dist-test-taskEWBsQL/test-tmp/rpc-test-4661deeffa3545a4bc569385211d5f30.sock every 8 connection(s)
W20260923 19:40:15.551818 12415 rpcz_store.cc:267] Call kudu.rpc_test.CalculatorService.Sleep from unix:<unnamed> (request call id 2) took 20 ms (client timeout 20 ms). Trace:
W20260923 19:40:15.551939 12415 rpcz_store.cc:269] 0923 19:40:15.531466 (+     0us) service_pool.cc:170] Inserting onto call queue
0923 19:40:15.551749 (+ 20283us) service_pool.cc:214] Skipping call since client already timed out
0923 19:40:15.551780 (+    31us) inbound_call.cc:173] Queueing failure response
Metrics: {}
W20260923 19:40:15.552788 12410 connection.cc:196] Error closing socket: Network error: TlsSocket::Close: Broken pipe
[       OK ] Parameters/TestRpc.TimedOutOnResponseMetricServiceQueue/SSL_UnixSocket (60 ms)
[ RUN      ] Parameters/TestRpc.RpcPendingConnectionsMetric/SSL_UnixSocket
I20260923 19:40:15.556640 12436 acceptor_pool.cc:254] collecting diagnostics on the listening RPC socket 0.0.0.0:41717 every 8 connection(s)
I20260923 19:40:15.556717 12437 acceptor_pool.cc:254] collecting diagnostics on the listening RPC socket 0.0.0.0:41717 every 8 connection(s)
W20260923 19:40:15.557790 12432 negotiation.cc:337] Failed RPC negotiation. Trace:
0923 19:40:15.557407 (+     0us) reactor.cc:625] Submitting negotiation task for server connection from 127.0.0.1:43700 (local address 127.0.0.1:41717)
0923 19:40:15.557492 (+    85us) server_negotiation.cc:206] Beginning negotiation
0923 19:40:15.557495 (+     3us) server_negotiation.cc:399] Waiting for connection header
0923 19:40:15.557595 (+   100us) negotiation.cc:327] Negotiation complete: Network error: Server connection negotiation failed: server connection from 127.0.0.1:43700: BlockingRecv error: recv got EOF from 127.0.0.1:43700 (error 108)
Metrics: {"server-negotiator.queue_time_us":24}
[       OK ] Parameters/TestRpc.RpcPendingConnectionsMetric/SSL_UnixSocket (14 ms)
[ RUN      ] Parameters/TestRpc.TestRpcContextClientDeadline/SSL_UnixSocket
I20260923 19:40:15.589592 12452 acceptor_pool.cc:254] collecting diagnostics on the listening RPC socket unix:/tmp/dist-test-taskEWBsQL/test-tmp/rpc-test-032d66ecdabc45e78643338cc1e1bfd9.sock every 8 connection(s)
I20260923 19:40:15.589613 12453 acceptor_pool.cc:254] collecting diagnostics on the listening RPC socket unix:/tmp/dist-test-taskEWBsQL/test-tmp/rpc-test-032d66ecdabc45e78643338cc1e1bfd9.sock every 8 connection(s)
W20260923 19:40:15.629909 12449 connection.cc:196] Error closing socket: Network error: TlsSocket::Close: Broken pipe
[       OK ] Parameters/TestRpc.TestRpcContextClientDeadline/SSL_UnixSocket (62 ms)
[ RUN      ] Parameters/TestRpc.TestApplicationFeatureFlagUnsupportedServer/SSL_UnixSocket
I20260923 19:40:15.645468 12477 acceptor_pool.cc:254] collecting diagnostics on the listening RPC socket unix:/tmp/dist-test-taskEWBsQL/test-tmp/rpc-test-18614f411c90449b8da31c5b66f223bf.sock every 8 connection(s)
I20260923 19:40:15.645533 12478 acceptor_pool.cc:254] collecting diagnostics on the listening RPC socket unix:/tmp/dist-test-taskEWBsQL/test-tmp/rpc-test-18614f411c90449b8da31c5b66f223bf.sock every 8 connection(s)
W20260923 19:40:15.668421 12474 connection.cc:196] Error closing socket: Network error: TlsSocket::Close: Broken pipe
[       OK ] Parameters/TestRpc.TestApplicationFeatureFlagUnsupportedServer/SSL_UnixSocket (38 ms)
[ RUN      ] Parameters/TestRpc.TestCancellationAsync/SSL_UnixSocket
I20260923 19:40:15.676127 12502 acceptor_pool.cc:254] collecting diagnostics on the listening RPC socket unix:/tmp/dist-test-taskEWBsQL/test-tmp/rpc-test-167350cd03034a66a14afc33ad2c79d3.sock every 8 connection(s)
I20260923 19:40:15.676169 12503 acceptor_pool.cc:254] collecting diagnostics on the listening RPC socket unix:/tmp/dist-test-taskEWBsQL/test-tmp/rpc-test-167350cd03034a66a14afc33ad2c79d3.sock every 8 connection(s)
I20260923 19:40:15.676466 12070 rpc-test.cc:1716] Connecting to unix:/tmp/dist-test-taskEWBsQL/test-tmp/rpc-test-167350cd03034a66a14afc33ad2c79d3.sock
I20260923 19:40:15.696573 12070 test_util.cc:268] Using random seed: -1492883782
I20260923 19:40:15.717001 12506 rpc-test-base.h:240] got call: sleep_micros: 500 pattern: 4294967295 num_repetitions: 2097152 sidecar_idx: 0
I20260923 19:40:15.733554 12505 rpc-test-base.h:240] got call: sleep_micros: 500 pattern: 4294967295 num_repetitions: 2097152 sidecar_idx: 0
I20260923 19:40:15.750142 12506 rpc-test-base.h:240] got call: sleep_micros: 500 pattern: 4294967295 num_repetitions: 2097152 sidecar_idx: 0
I20260923 19:40:15.766659 12505 rpc-test-base.h:240] got call: sleep_micros: 500 pattern: 4294967295 num_repetitions: 2097152 sidecar_idx: 0
I20260923 19:40:15.783162 12506 rpc-test-base.h:240] got call: sleep_micros: 500 pattern: 4294967295 num_repetitions: 2097152 sidecar_idx: 0
I20260923 19:40:15.799256 12505 rpc-test-base.h:240] got call: sleep_micros: 500 pattern: 4294967295 num_repetitions: 2097152 sidecar_idx: 0
I20260923 19:40:15.813926 12506 rpc-test-base.h:240] got call: sleep_micros: 500 pattern: 4294967295 num_repetitions: 2097152 sidecar_idx: 0
I20260923 19:40:15.828824 12505 rpc-test-base.h:240] got call: sleep_micros: 500 pattern: 4294967295 num_repetitions: 2097152 sidecar_idx: 0
W20260923 19:40:15.830442 12499 connection.cc:196] Error closing socket: Network error: TlsSocket::Close: Broken pipe
W20260923 19:40:15.837618 12499 connection.cc:441] server connection from unix:<unnamed> torn down before Call kudu.rpc.GenericCalculatorService.SleepWithSidecar from unix:<unnamed> (request call id 8) could send its response
W20260923 19:40:15.846997 12499 connection.cc:441] server connection from unix:<unnamed> torn down before Call kudu.rpc.GenericCalculatorService.SleepWithSidecar from unix:<unnamed> (request call id 9) could send its response
[       OK ] Parameters/TestRpc.TestCancellationAsync/SSL_UnixSocket (178 ms)
[ RUN      ] Parameters/TestRpc.TestPerformanceBySocketType/SSL_UnixSocket
I20260923 19:40:15.860890 12527 acceptor_pool.cc:254] collecting diagnostics on the listening RPC socket unix:/tmp/dist-test-taskEWBsQL/test-tmp/rpc-test-e1b4f7aec7b446cfa7b0fda57411582f.sock every 8 connection(s)
I20260923 19:40:15.860934 12528 acceptor_pool.cc:254] collecting diagnostics on the listening RPC socket unix:/tmp/dist-test-taskEWBsQL/test-tmp/rpc-test-e1b4f7aec7b446cfa7b0fda57411582f.sock every 8 connection(s)
I20260923 19:40:15.861267 12070 rpc-test.cc:1846] Connecting to unix:/tmp/dist-test-taskEWBsQL/test-tmp/rpc-test-e1b4f7aec7b446cfa7b0fda57411582f.sock
I20260923 19:40:17.364763 12070 rpc-test.cc:1859] Sending 1024MB via ssl-enabled unix socket: real 1.491s	user 1.908s	sys 0.817s
I20260923 19:40:18.863157 12070 rpc-test.cc:1859] Sending 1024MB via ssl-enabled unix socket: real 1.498s	user 1.836s	sys 0.882s
I20260923 19:40:20.361353 12070 rpc-test.cc:1859] Sending 1024MB via ssl-enabled unix socket: real 1.498s	user 1.991s	sys 0.739s
I20260923 19:40:21.846586 12070 rpc-test.cc:1859] Sending 1024MB via ssl-enabled unix socket: real 1.485s	user 1.780s	sys 0.916s
I20260923 19:40:23.330906 12070 rpc-test.cc:1859] Sending 1024MB via ssl-enabled unix socket: real 1.484s	user 1.839s	sys 0.854s
W20260923 19:40:23.331944 12524 connection.cc:196] Error closing socket: Network error: TlsSocket::Close: Broken pipe
[       OK ] Parameters/TestRpc.TestPerformanceBySocketType/SSL_UnixSocket (7484 ms)
[----------] 20 tests from Parameters/TestRpc (29268 ms total)

[----------] 1 test from Parameters/TestRpcSocketTxRxQueue
[ RUN      ] Parameters/TestRpcSocketTxRxQueue.AcceptorRxQueueSizeMetric/0
I20260923 19:40:23.343725 12552 acceptor_pool.cc:254] collecting diagnostics on the listening RPC socket 0.0.0.0:34267 every 1 connection(s)
I20260923 19:40:23.343791 12553 acceptor_pool.cc:254] collecting diagnostics on the listening RPC socket 0.0.0.0:34267 every 1 connection(s)
W20260923 19:40:23.344746 12548 negotiation.cc:337] Failed RPC negotiation. Trace:
0923 19:40:23.344464 (+     0us) reactor.cc:625] Submitting negotiation task for server connection from 127.0.0.1:38598 (local address 127.0.0.1:34267)
0923 19:40:23.344576 (+   112us) server_negotiation.cc:206] Beginning negotiation
0923 19:40:23.344579 (+     3us) server_negotiation.cc:399] Waiting for connection header
0923 19:40:23.344674 (+    95us) negotiation.cc:327] Negotiation complete: Network error: Server connection negotiation failed: server connection from 127.0.0.1:38598: BlockingRecv error: recv got EOF from 127.0.0.1:38598 (error 108)
Metrics: {"server-negotiator.queue_time_us":42}
[       OK ] Parameters/TestRpcSocketTxRxQueue.AcceptorRxQueueSizeMetric/0 (13 ms)
[----------] 1 test from Parameters/TestRpcSocketTxRxQueue (13 ms total)

[----------] Global test environment tear-down
[==========] 21 tests from 2 test suites ran. (29282 ms total)
[  PASSED  ] 20 tests.
[  FAILED  ] 1 test, listed below:
[  FAILED  ] Parameters/TestRpc.TestCallWithChainCertAndChainCA/SSL_UnixSocket, where GetParam() = (true, true)

 1 FAILED TEST