Diagnosed failure

Parameters/TestRpc.TestCallWithChainCertAndChainCA/SSL_TCP: /data0/somelongdirectorytoavoidrpathissues/src/kudu/src/kudu/rpc/rpc-test.cc:270: Failure
Failed
Bad status: Runtime error: could not verify certificate chain (error with cert: subject=CN = localhost, ST = sadfjas, C = AS, emailAddress = sdflkdsajf, O = lskdfjlsad, OU = sldfkja, issuer=C = AS, ST = ASDfkjdhf, L = lskdjf, O = saldfja, OU = skdjf, CN = localhost, emailAddress = sadjflkadsj): : certificate has expired
Google Test trace:
/data0/somelongdirectorytoavoidrpathissues/src/kudu/src/kudu/rpc/rpc-test.cc:267: Connecting to 0.0.0.0:39295
I20260926 07:26:00.064030  3936 test_util.cc:175] -----------------------------------------------
I20260926 07:26:00.064082  3936 test_util.cc:176] Had fatal failures, leaving test files at /tmp/dist-test-taskVEtVSU/test-tmp/rpc-test.5.Parameters_TestRpc.TestCallWithChainCertAndChainCA_SSL_TCP.1790407560002636-3936-0

Full log

Note: This is test shard 6 of 8.
[==========] Running 21 tests from 2 test suites.
[----------] Global test environment set-up.
[----------] 20 tests from Parameters/TestRpc
[ RUN      ] Parameters/TestRpc.TestMessengerCreateDestroy/SSL_TCP
WARNING: Logging before InitGoogleLogging() is written to STDERR
I20260926 07:26:00.028563  3936 rpc-test.cc:169] started messenger TestCreateDestroy
[       OK ] Parameters/TestRpc.TestMessengerCreateDestroy/SSL_TCP (20 ms)
[ RUN      ] Parameters/TestRpc.TestNegotiationDeadlock/SSL_TCP
I20260926 07:26:00.040584  3956 acceptor_pool.cc:254] collecting diagnostics on the listening RPC socket 0.0.0.0:43643 every 8 connection(s)
I20260926 07:26:00.040639  3957 acceptor_pool.cc:254] collecting diagnostics on the listening RPC socket 0.0.0.0:43643 every 8 connection(s)
[       OK ] Parameters/TestRpc.TestNegotiationDeadlock/SSL_TCP (20 ms)
[ RUN      ] Parameters/TestRpc.TestCallWithChainCertAndChainCA/SSL_TCP
I20260926 07:26:00.058831  3972 acceptor_pool.cc:254] collecting diagnostics on the listening RPC socket 0.0.0.0:39295 every 8 connection(s)
I20260926 07:26:00.058877  3973 acceptor_pool.cc:254] collecting diagnostics on the listening RPC socket 0.0.0.0:39295 every 8 connection(s)
/data0/somelongdirectorytoavoidrpathissues/src/kudu/src/kudu/rpc/rpc-test.cc:270: Failure
Failed
Bad status: Runtime error: could not verify certificate chain (error with cert: subject=CN = localhost, ST = sadfjas, C = AS, emailAddress = sdflkdsajf, O = lskdfjlsad, OU = sldfkja, issuer=C = AS, ST = ASDfkjdhf, L = lskdjf, O = saldfja, OU = skdjf, CN = localhost, emailAddress = sadjflkadsj): : certificate has expired
Google Test trace:
/data0/somelongdirectorytoavoidrpathissues/src/kudu/src/kudu/rpc/rpc-test.cc:267: Connecting to 0.0.0.0:39295
I20260926 07:26:00.064030  3936 test_util.cc:175] -----------------------------------------------
I20260926 07:26:00.064082  3936 test_util.cc:176] Had fatal failures, leaving test files at /tmp/dist-test-taskVEtVSU/test-tmp/rpc-test.5.Parameters_TestRpc.TestCallWithChainCertAndChainCA_SSL_TCP.1790407560002636-3936-0
[  FAILED  ] Parameters/TestRpc.TestCallWithChainCertAndChainCA/SSL_TCP, where GetParam() = (true, false) (12 ms)
[ RUN      ] Parameters/TestRpc.TestCallWithPasswordProtectedKey/SSL_TCP
I20260926 07:26:00.074141  3997 acceptor_pool.cc:254] collecting diagnostics on the listening RPC socket 0.0.0.0:42417 every 8 connection(s)
I20260926 07:26:00.074178  3998 acceptor_pool.cc:254] collecting diagnostics on the listening RPC socket 0.0.0.0:42417 every 8 connection(s)
[       OK ] Parameters/TestRpc.TestCallWithPasswordProtectedKey/SSL_TCP (24 ms)
[ RUN      ] Parameters/TestRpc.TestCallToBadServer/SSL_TCP
I20260926 07:26:00.095063  3936 rpc-test.cc:394] Status: Network error: Client connection negotiation failed: client connection to 0.0.0.0:0: connect: Connection refused (error 111)
I20260926 07:26:00.095515  3936 rpc-test.cc:394] Status: Network error: Client connection negotiation failed: client connection to 0.0.0.0:0: connect: Connection refused (error 111)
I20260926 07:26:00.095903  3936 rpc-test.cc:394] Status: Network error: Client connection negotiation failed: client connection to 0.0.0.0:0: connect: Connection refused (error 111)
I20260926 07:26:00.096272  3936 rpc-test.cc:394] Status: Network error: Client connection negotiation failed: client connection to 0.0.0.0:0: connect: Connection refused (error 111)
I20260926 07:26:00.096637  3936 rpc-test.cc:394] Status: Network error: Client connection negotiation failed: client connection to 0.0.0.0:0: connect: Connection refused (error 111)
[       OK ] Parameters/TestRpc.TestCallToBadServer/SSL_TCP (8 ms)
[ RUN      ] Parameters/TestRpc.TestWrongService/SSL_TCP
I20260926 07:26:00.116919  4032 acceptor_pool.cc:254] collecting diagnostics on the listening RPC socket 0.0.0.0:44683 every 8 connection(s)
I20260926 07:26:00.116959  4033 acceptor_pool.cc:254] collecting diagnostics on the listening RPC socket 0.0.0.0:44683 every 8 connection(s)
I20260926 07:26:00.138866  4031 messenger.cc:345] service WrongServiceName not registered on TestServer
[       OK ] Parameters/TestRpc.TestWrongService/SSL_TCP (44 ms)
[ RUN      ] Parameters/TestRpc.TestConnectionKeepalive/SSL_TCP
I20260926 07:26:00.150952  4055 acceptor_pool.cc:254] collecting diagnostics on the listening RPC socket 0.0.0.0:42801 every 8 connection(s)
I20260926 07:26:00.151005  4056 acceptor_pool.cc:254] collecting diagnostics on the listening RPC socket 0.0.0.0:42801 every 8 connection(s)
I20260926 07:26:00.151248  3936 rpc-test.cc:488] Connecting to 0.0.0.0:42801
[       OK ] Parameters/TestRpc.TestConnectionKeepalive/SSL_TCP (1050 ms)
[ RUN      ] Parameters/TestRpc.TestClientConnectionMetrics/SSL_TCP
I20260926 07:26:01.219589  4080 acceptor_pool.cc:254] collecting diagnostics on the listening RPC socket 0.0.0.0:37367 every 8 connection(s)
I20260926 07:26:01.219627  4081 acceptor_pool.cc:254] collecting diagnostics on the listening RPC socket 0.0.0.0:37367 every 8 connection(s)
I20260926 07:26:01.219934  3936 rpc-test.cc:569] Connecting to 0.0.0.0:37367
[       OK ] Parameters/TestRpc.TestClientConnectionMetrics/SSL_TCP (14800 ms)
[ RUN      ] Parameters/TestRpc.TestCredentialsPolicy/SSL_TCP
I20260926 07:26:16.013530  4103 acceptor_pool.cc:254] collecting diagnostics on the listening RPC socket 0.0.0.0:44791 every 8 connection(s)
I20260926 07:26:16.013577  4104 acceptor_pool.cc:254] collecting diagnostics on the listening RPC socket 0.0.0.0:44791 every 8 connection(s)
I20260926 07:26:16.013845  3936 rpc-test.cc:700] Connecting to 0.0.0.0:44791
[       OK ] Parameters/TestRpc.TestCredentialsPolicy/SSL_TCP (43 ms)
[ RUN      ] Parameters/TestRpc.TestCallLongerThanKeepalive/SSL_TCP
I20260926 07:26:16.056382  4128 acceptor_pool.cc:254] collecting diagnostics on the listening RPC socket 0.0.0.0:40955 every 8 connection(s)
I20260926 07:26:16.056418  4129 acceptor_pool.cc:254] collecting diagnostics on the listening RPC socket 0.0.0.0:40955 every 8 connection(s)
I20260926 07:26:16.075855  4132 rpc-test-base.h:222] got call: sleep_micros: 3000000 deferred: true
I20260926 07:26:19.076731  4132 rpcz_store.cc:275] Call kudu.rpc.GenericCalculatorService.Sleep from 127.0.0.1:42166 (request call id 0) took 3000 ms. Trace:
I20260926 07:26:19.076872  4132 rpcz_store.cc:276] 0926 07:26:16.075766 (+     0us) service_pool.cc:170] Inserting onto call queue
0926 07:26:16.075826 (+    60us) service_pool.cc:227] Handling call
0926 07:26:19.076686 (+3000860us) inbound_call.cc:173] Queueing success response
Metrics: {}
[       OK ] Parameters/TestRpc.TestCallLongerThanKeepalive/SSL_TCP (3043 ms)
[ RUN      ] Parameters/TestRpc.TestRpcSidecar/SSL_TCP
I20260926 07:26:19.107573  4153 acceptor_pool.cc:254] collecting diagnostics on the listening RPC socket 0.0.0.0:45669 every 8 connection(s)
I20260926 07:26:19.107606  4154 acceptor_pool.cc:254] collecting diagnostics on the listening RPC socket 0.0.0.0:45669 every 8 connection(s)
[       OK ] Parameters/TestRpc.TestRpcSidecar/SSL_TCP (89 ms)
[ RUN      ] Parameters/TestRpc.TestRpcSidecarLimits/SSL_TCP
I20260926 07:26:20.901544  4178 acceptor_pool.cc:254] collecting diagnostics on the listening RPC socket 0.0.0.0:39489 every 8 connection(s)
I20260926 07:26:20.901592  4179 acceptor_pool.cc:254] collecting diagnostics on the listening RPC socket 0.0.0.0:39489 every 8 connection(s)
W20260926 07:26:20.910797  3936 serialization.cc:72] Serialized kudu.rpc_test.PushStringsRequestPB (2147483654 bytes) is larger than the maximum configured RPC message size (52428800 bytes). Sending anyway, but peer may reject the data.
W20260926 07:26:20.914527  4176 connection.cc:535] server connection from 127.0.0.1:49462 recv error: Network error: RPC frame had a length of 2147483714, but we only support messages up to 52428800 bytes long.
W20260926 07:26:20.914585  4176 connection.cc:158] shutting down server connection from 127.0.0.1:49462 with pending inbound data: 4/2147483714 bytes received; last active 0 ns ago: status Network error: RPC frame had a length of 2147483714, but we only support messages up to 52428800 bytes long.
W20260926 07:26:20.914870  4191 connection.cc:196] Error closing socket: Network error: TlsSocket::Close: Connection reset by peer
I20260926 07:26:20.942056  4203 acceptor_pool.cc:254] collecting diagnostics on the listening RPC socket 0.0.0.0:39005 every 8 connection(s)
I20260926 07:26:20.942076  4204 acceptor_pool.cc:254] collecting diagnostics on the listening RPC socket 0.0.0.0:39005 every 8 connection(s)
W20260926 07:26:25.210175  4202 connection.cc:577] server connection from 127.0.0.1:50880: received bad data: 'Corruption: Invalid packet: message had a length of 2147483710, but we only support messages up to 2147483647 bytes
'
[       OK ] Parameters/TestRpc.TestRpcSidecarLimits/SSL_TCP (6042 ms)
[ RUN      ] Parameters/TestRpc.TestCallTimeoutDoesntAffectNegotiation/SSL_TCP
I20260926 07:26:25.228483  4228 acceptor_pool.cc:254] collecting diagnostics on the listening RPC socket 0.0.0.0:39035 every 8 connection(s)
I20260926 07:26:25.228497  4229 acceptor_pool.cc:254] collecting diagnostics on the listening RPC socket 0.0.0.0:39035 every 8 connection(s)
W20260926 07:26:25.240628  4224 negotiation.cc:266] Injecting 500ms delay in negotiation
I20260926 07:26:25.291033  3936 rpc-test-base.h:595] status: Timed out: connection negotiation to 0.0.0.0:39035 for RPC Sleep timed out after 0.050s (ON_OUTBOUND_QUEUE), seconds elapsed: 0.0509082
[       OK ] Parameters/TestRpc.TestCallTimeoutDoesntAffectNegotiation/SSL_TCP (534 ms)
[ RUN      ] Parameters/TestRpc.TestRpcHandlerLatencyMetric/SSL_TCP
I20260926 07:26:25.774992  4253 acceptor_pool.cc:254] collecting diagnostics on the listening RPC socket 0.0.0.0:38571 every 8 connection(s)
I20260926 07:26:25.775034  4254 acceptor_pool.cc:254] collecting diagnostics on the listening RPC socket 0.0.0.0:38571 every 8 connection(s)
I20260926 07:26:25.845041  3936 rpc-test.cc:1236] Sleep() min lat: 20383
I20260926 07:26:25.845111  3936 rpc-test.cc:1237] Sleep() mean lat: 20383
I20260926 07:26:25.845139  3936 rpc-test.cc:1238] Sleep() max lat: 20383
I20260926 07:26:25.845151  3936 rpc-test.cc:1239] Sleep() #calls: 1
[       OK ] Parameters/TestRpc.TestRpcHandlerLatencyMetric/SSL_TCP (99 ms)
[ RUN      ] Parameters/TestRpc.TimedOutOnResponseMetricServiceQueue/SSL_TCP
I20260926 07:26:25.871433  4279 acceptor_pool.cc:254] collecting diagnostics on the listening RPC socket 0.0.0.0:34357 every 8 connection(s)
I20260926 07:26:25.871464  4280 acceptor_pool.cc:254] collecting diagnostics on the listening RPC socket 0.0.0.0:34357 every 8 connection(s)
W20260926 07:26:25.935098  4281 rpcz_store.cc:267] Call kudu.rpc_test.CalculatorService.Sleep from 127.0.0.1:53414 (request call id 2) took 20 ms (client timeout 20 ms). Trace:
W20260926 07:26:25.935211  4281 rpcz_store.cc:269] 0926 07:26:25.914681 (+     0us) service_pool.cc:170] Inserting onto call queue
0926 07:26:25.935056 (+ 20375us) service_pool.cc:214] Skipping call since client already timed out
0926 07:26:25.935082 (+    26us) inbound_call.cc:173] Queueing failure response
Metrics: {}
[       OK ] Parameters/TestRpc.TimedOutOnResponseMetricServiceQueue/SSL_TCP (89 ms)
[ RUN      ] Parameters/TestRpc.RpcPendingConnectionsMetric/SSL_TCP
I20260926 07:26:25.939344  4302 acceptor_pool.cc:254] collecting diagnostics on the listening RPC socket 0.0.0.0:36231 every 8 connection(s)
I20260926 07:26:25.939425  4303 acceptor_pool.cc:254] collecting diagnostics on the listening RPC socket 0.0.0.0:36231 every 8 connection(s)
W20260926 07:26:25.940454  4298 negotiation.cc:337] Failed RPC negotiation. Trace:
0926 07:26:25.940103 (+     0us) reactor.cc:625] Submitting negotiation task for server connection from 127.0.0.1:43250 (local address 127.0.0.1:36231)
0926 07:26:25.940182 (+    79us) server_negotiation.cc:206] Beginning negotiation
0926 07:26:25.940185 (+     3us) server_negotiation.cc:399] Waiting for connection header
0926 07:26:25.940266 (+    81us) negotiation.cc:327] Negotiation complete: Network error: Server connection negotiation failed: server connection from 127.0.0.1:43250: BlockingRecv error: recv got EOF from 127.0.0.1:43250 (error 108)
Metrics: {"server-negotiator.queue_time_us":19}
[       OK ] Parameters/TestRpc.RpcPendingConnectionsMetric/SSL_TCP (14 ms)
[ RUN      ] Parameters/TestRpc.TestRpcContextClientDeadline/SSL_TCP
I20260926 07:26:25.957326  4318 acceptor_pool.cc:254] collecting diagnostics on the listening RPC socket 0.0.0.0:35669 every 8 connection(s)
I20260926 07:26:25.957376  4319 acceptor_pool.cc:254] collecting diagnostics on the listening RPC socket 0.0.0.0:35669 every 8 connection(s)
[       OK ] Parameters/TestRpc.TestRpcContextClientDeadline/SSL_TCP (55 ms)
[ RUN      ] Parameters/TestRpc.TestApplicationFeatureFlagUnsupportedServer/SSL_TCP
I20260926 07:26:26.017274  4343 acceptor_pool.cc:254] collecting diagnostics on the listening RPC socket 0.0.0.0:35545 every 8 connection(s)
I20260926 07:26:26.017325  4344 acceptor_pool.cc:254] collecting diagnostics on the listening RPC socket 0.0.0.0:35545 every 8 connection(s)
[       OK ] Parameters/TestRpc.TestApplicationFeatureFlagUnsupportedServer/SSL_TCP (29 ms)
[ RUN      ] Parameters/TestRpc.TestCancellationAsync/SSL_TCP
I20260926 07:26:26.046917  4368 acceptor_pool.cc:254] collecting diagnostics on the listening RPC socket 0.0.0.0:36459 every 8 connection(s)
I20260926 07:26:26.046972  4369 acceptor_pool.cc:254] collecting diagnostics on the listening RPC socket 0.0.0.0:36459 every 8 connection(s)
I20260926 07:26:26.047262  3936 rpc-test.cc:1716] Connecting to 0.0.0.0:36459
I20260926 07:26:26.056342  3936 test_util.cc:268] Using random seed: -1070888812
I20260926 07:26:26.076040  4372 rpc-test-base.h:240] got call: sleep_micros: 500 pattern: 4294967295 num_repetitions: 2097152 sidecar_idx: 0
I20260926 07:26:26.096091  4371 rpc-test-base.h:240] got call: sleep_micros: 500 pattern: 4294967295 num_repetitions: 2097152 sidecar_idx: 0
I20260926 07:26:26.112826  4372 rpc-test-base.h:240] got call: sleep_micros: 500 pattern: 4294967295 num_repetitions: 2097152 sidecar_idx: 0
I20260926 07:26:26.130296  4371 rpc-test-base.h:240] got call: sleep_micros: 500 pattern: 4294967295 num_repetitions: 2097152 sidecar_idx: 0
I20260926 07:26:26.150677  4372 rpc-test-base.h:240] got call: sleep_micros: 500 pattern: 4294967295 num_repetitions: 2097152 sidecar_idx: 0
I20260926 07:26:26.175653  4372 rpc-test-base.h:240] got call: sleep_micros: 500 pattern: 4294967295 num_repetitions: 2097152 sidecar_idx: 0
I20260926 07:26:26.200675  4372 rpc-test-base.h:240] got call: sleep_micros: 500 pattern: 4294967295 num_repetitions: 2097152 sidecar_idx: 0
W20260926 07:26:26.218561  4365 connection.cc:441] server connection from 127.0.0.1:56366 torn down before Call kudu.rpc.GenericCalculatorService.SleepWithSidecar from 127.0.0.1:56366 (request call id 9) could send its response
[       OK ] Parameters/TestRpc.TestCancellationAsync/SSL_TCP (182 ms)
[ RUN      ] Parameters/TestRpc.TestPerformanceBySocketType/SSL_TCP
I20260926 07:26:26.234428  4393 acceptor_pool.cc:254] collecting diagnostics on the listening RPC socket 0.0.0.0:35655 every 8 connection(s)
I20260926 07:26:26.234453  4394 acceptor_pool.cc:254] collecting diagnostics on the listening RPC socket 0.0.0.0:35655 every 8 connection(s)
I20260926 07:26:26.234762  3936 rpc-test.cc:1846] Connecting to 0.0.0.0:35655
I20260926 07:26:28.420625  3936 rpc-test.cc:1859] Sending 1024MB via ssl-enabled tcp socket: real 2.177s	user 2.269s	sys 1.580s
I20260926 07:26:30.622865  3936 rpc-test.cc:1859] Sending 1024MB via ssl-enabled tcp socket: real 2.202s	user 2.336s	sys 1.587s
I20260926 07:26:32.852221  3936 rpc-test.cc:1859] Sending 1024MB via ssl-enabled tcp socket: real 2.229s	user 2.198s	sys 1.769s
I20260926 07:26:34.995405  3936 rpc-test.cc:1859] Sending 1024MB via ssl-enabled tcp socket: real 2.143s	user 2.129s	sys 1.657s
I20260926 07:26:37.176813  3936 rpc-test.cc:1859] Sending 1024MB via ssl-enabled tcp socket: real 2.181s	user 2.126s	sys 1.753s
[       OK ] Parameters/TestRpc.TestPerformanceBySocketType/SSL_TCP (10958 ms)
[----------] 20 tests from Parameters/TestRpc (37169 ms total)

[----------] 1 test from Parameters/TestRpcSocketTxRxQueue
[ RUN      ] Parameters/TestRpcSocketTxRxQueue.OverCapacity/0
W20260926 07:26:37.448318  4428 negotiation.cc:337] Failed RPC negotiation. Trace:
0926 07:26:37.183276 (+     0us) reactor.cc:625] Submitting negotiation task for client connection to 0.0.0.0:40939 (local address 127.0.0.1:56286)
0926 07:26:37.183385 (+   109us) negotiation.cc:107] Waiting for socket to connect
0926 07:26:37.183397 (+    12us) client_negotiation.cc:174] Beginning negotiation
0926 07:26:37.183466 (+    69us) client_negotiation.cc:252] Sending NEGOTIATE NegotiatePB request
0926 07:26:37.448145 (+264679us) negotiation.cc:327] Negotiation complete: Network error: Client connection negotiation failed: client connection to 0.0.0.0:40939: BlockingRecv error: recv error from unknown peer: Transport endpoint is not connected (error 107)
Metrics: {"client-negotiator.queue_time_us":46}
W20260926 07:26:37.448418  4410 negotiation.cc:337] Failed RPC negotiation. Trace:
0926 07:26:37.181144 (+     0us) reactor.cc:625] Submitting negotiation task for client connection to 0.0.0.0:40939 (local address 127.0.0.1:56262)
0926 07:26:37.181231 (+    87us) negotiation.cc:107] Waiting for socket to connect
0926 07:26:37.181244 (+    13us) client_negotiation.cc:174] Beginning negotiation
0926 07:26:37.181340 (+    96us) client_negotiation.cc:252] Sending NEGOTIATE NegotiatePB request
0926 07:26:37.448166 (+266826us) negotiation.cc:327] Negotiation complete: Network error: Client connection negotiation failed: client connection to 0.0.0.0:40939: BlockingRecv error: recv error from unknown peer: Transport endpoint is not connected (error 107)
Metrics: {"client-negotiator.queue_time_us":24}
W20260926 07:26:37.448458  4455 negotiation.cc:337] Failed RPC negotiation. Trace:
0926 07:26:37.186634 (+     0us) reactor.cc:625] Submitting negotiation task for client connection to 0.0.0.0:40939 (local address 127.0.0.1:56316)
0926 07:26:37.186742 (+   108us) negotiation.cc:107] Waiting for socket to connect
0926 07:26:37.186753 (+    11us) client_negotiation.cc:174] Beginning negotiation
0926 07:26:37.186845 (+    92us) client_negotiation.cc:252] Sending NEGOTIATE NegotiatePB request
0926 07:26:37.448376 (+261531us) negotiation.cc:327] Negotiation complete: Network error: Client connection negotiation failed: client connection to 0.0.0.0:40939: BlockingRecv error: recv error from unknown peer: Transport endpoint is not connected (error 107)
Metrics: {"client-negotiator.queue_time_us":48}
W20260926 07:26:37.448628  4446 negotiation.cc:337] Failed RPC negotiation. Trace:
0926 07:26:37.185527 (+     0us) reactor.cc:625] Submitting negotiation task for client connection to 0.0.0.0:40939 (local address 127.0.0.1:56300)
0926 07:26:37.185635 (+   108us) negotiation.cc:107] Waiting for socket to connect
0926 07:26:37.185647 (+    12us) client_negotiation.cc:174] Beginning negotiation
0926 07:26:37.185716 (+    69us) client_negotiation.cc:252] Sending NEGOTIATE NegotiatePB request
0926 07:26:37.448254 (+262538us) negotiation.cc:327] Negotiation complete: Network error: Client connection negotiation failed: client connection to 0.0.0.0:40939: BlockingRecv error: recv error from unknown peer: Transport endpoint is not connected (error 107)
Metrics: {"client-negotiator.queue_time_us":47}
W20260926 07:26:37.448340  4419 negotiation.cc:337] Failed RPC negotiation. Trace:
0926 07:26:37.182176 (+     0us) reactor.cc:625] Submitting negotiation task for client connection to 0.0.0.0:40939 (local address 127.0.0.1:56270)
0926 07:26:37.182290 (+   114us) negotiation.cc:107] Waiting for socket to connect
0926 07:26:37.182302 (+    12us) client_negotiation.cc:174] Beginning negotiation
0926 07:26:37.182376 (+    74us) client_negotiation.cc:252] Sending NEGOTIATE NegotiatePB request
0926 07:26:37.448166 (+265790us) negotiation.cc:327] Negotiation complete: Network error: Client connection negotiation failed: client connection to 0.0.0.0:40939: BlockingRecv error: recv error from unknown peer: Transport endpoint is not connected (error 107)
Metrics: {"client-negotiator.queue_time_us":45}
W20260926 07:26:37.448800  4437 negotiation.cc:337] Failed RPC negotiation. Trace:
0926 07:26:37.184400 (+     0us) reactor.cc:625] Submitting negotiation task for client connection to 0.0.0.0:40939 (local address 127.0.0.1:56290)
0926 07:26:37.184511 (+   111us) negotiation.cc:107] Waiting for socket to connect
0926 07:26:37.184523 (+    12us) client_negotiation.cc:174] Beginning negotiation
0926 07:26:37.184592 (+    69us) client_negotiation.cc:252] Sending NEGOTIATE NegotiatePB request
0926 07:26:37.448156 (+263564us) negotiation.cc:327] Negotiation complete: Network error: Client connection negotiation failed: client connection to 0.0.0.0:40939: BlockingRecv error: recv error from unknown peer: Transport endpoint is not connected (error 107)
Metrics: {"client-negotiator.queue_time_us":48}
[       OK ] Parameters/TestRpcSocketTxRxQueue.OverCapacity/0 (1050 ms)
[----------] 1 test from Parameters/TestRpcSocketTxRxQueue (1050 ms total)

[----------] Global test environment tear-down
[==========] 21 tests from 2 test suites ran. (38220 ms total)
[  PASSED  ] 20 tests.
[  FAILED  ] 1 test, listed below:
[  FAILED  ] Parameters/TestRpc.TestCallWithChainCertAndChainCA/SSL_TCP, where GetParam() = (true, false)

 1 FAILED TEST