Diagnosed failure
Parameters/TestRpc.TestCallWithChainCertAndChainCA/SSL_UnixSocket: /data0/somelongdirectorytoavoidrpathissues/src/kudu/src/kudu/rpc/rpc-test.cc:270: Failure
Failed
Bad status: Runtime error: could not verify certificate chain (error with cert: subject=CN = localhost, ST = sadfjas, C = AS, emailAddress = sdflkdsajf, O = lskdfjlsad, OU = sldfkja, issuer=C = AS, ST = ASDfkjdhf, L = lskdjf, O = saldfja, OU = skdjf, CN = localhost, emailAddress = sadjflkadsj): : certificate has expired
Google Test trace:
/data0/somelongdirectorytoavoidrpathissues/src/kudu/src/kudu/rpc/rpc-test.cc:267: Connecting to unix:/tmp/dist-test-taskNJnqbX/test-tmp/rpc-test-f45221da335446c1ae8333a07dda9f74.sock
I20260929 22:46:03.333071 18746 test_util.cc:175] -----------------------------------------------
I20260929 22:46:03.333120 18746 test_util.cc:176] Had fatal failures, leaving test files at /tmp/dist-test-taskNJnqbX/test-tmp/rpc-test.6.Parameters_TestRpc.TestCallWithChainCertAndChainCA_SSL_UnixSocket.1790721963262566-18746-0
Full log
Note: This is test shard 7 of 8.
[==========] Running 21 tests from 2 test suites.
[----------] Global test environment set-up.
[----------] 20 tests from Parameters/TestRpc
[ RUN ] Parameters/TestRpc.TestMessengerCreateDestroy/SSL_UnixSocket
WARNING: Logging before InitGoogleLogging() is written to STDERR
I20260929 22:46:03.282274 18746 rpc-test.cc:169] started messenger TestCreateDestroy
[ OK ] Parameters/TestRpc.TestMessengerCreateDestroy/SSL_UnixSocket (18 ms)
[ RUN ] Parameters/TestRpc.TestNegotiationDeadlock/SSL_UnixSocket
I20260929 22:46:03.297643 18766 acceptor_pool.cc:254] collecting diagnostics on the listening RPC socket unix:/tmp/dist-test-taskNJnqbX/test-tmp/rpc-test-78463a60e2474cc6bcfd29b38695dc6b.sock every 8 connection(s)
I20260929 22:46:03.297693 18767 acceptor_pool.cc:254] collecting diagnostics on the listening RPC socket unix:/tmp/dist-test-taskNJnqbX/test-tmp/rpc-test-78463a60e2474cc6bcfd29b38695dc6b.sock every 8 connection(s)
[ OK ] Parameters/TestRpc.TestNegotiationDeadlock/SSL_UnixSocket (21 ms)
[ RUN ] Parameters/TestRpc.TestCallWithChainCertAndChainCA/SSL_UnixSocket
I20260929 22:46:03.328944 18783 acceptor_pool.cc:254] collecting diagnostics on the listening RPC socket unix:/tmp/dist-test-taskNJnqbX/test-tmp/rpc-test-f45221da335446c1ae8333a07dda9f74.sock every 8 connection(s)
I20260929 22:46:03.328917 18782 acceptor_pool.cc:254] collecting diagnostics on the listening RPC socket unix:/tmp/dist-test-taskNJnqbX/test-tmp/rpc-test-f45221da335446c1ae8333a07dda9f74.sock every 8 connection(s)
/data0/somelongdirectorytoavoidrpathissues/src/kudu/src/kudu/rpc/rpc-test.cc:270: Failure
Failed
Bad status: Runtime error: could not verify certificate chain (error with cert: subject=CN = localhost, ST = sadfjas, C = AS, emailAddress = sdflkdsajf, O = lskdfjlsad, OU = sldfkja, issuer=C = AS, ST = ASDfkjdhf, L = lskdjf, O = saldfja, OU = skdjf, CN = localhost, emailAddress = sadjflkadsj): : certificate has expired
Google Test trace:
/data0/somelongdirectorytoavoidrpathissues/src/kudu/src/kudu/rpc/rpc-test.cc:267: Connecting to unix:/tmp/dist-test-taskNJnqbX/test-tmp/rpc-test-f45221da335446c1ae8333a07dda9f74.sock
I20260929 22:46:03.333071 18746 test_util.cc:175] -----------------------------------------------
I20260929 22:46:03.333120 18746 test_util.cc:176] Had fatal failures, leaving test files at /tmp/dist-test-taskNJnqbX/test-tmp/rpc-test.6.Parameters_TestRpc.TestCallWithChainCertAndChainCA_SSL_UnixSocket.1790721963262566-18746-0
[ FAILED ] Parameters/TestRpc.TestCallWithChainCertAndChainCA/SSL_UnixSocket, where GetParam() = (true, true) (28 ms)
[ RUN ] Parameters/TestRpc.TestCallWithPasswordProtectedKey/SSL_UnixSocket
I20260929 22:46:03.347293 18807 acceptor_pool.cc:254] collecting diagnostics on the listening RPC socket unix:/tmp/dist-test-taskNJnqbX/test-tmp/rpc-test-76e2d5ae2aa040c4bdc74524a639d504.sock every 8 connection(s)
I20260929 22:46:03.347352 18808 acceptor_pool.cc:254] collecting diagnostics on the listening RPC socket unix:/tmp/dist-test-taskNJnqbX/test-tmp/rpc-test-76e2d5ae2aa040c4bdc74524a639d504.sock every 8 connection(s)
W20260929 22:46:03.360879 18804 connection.cc:196] Error closing socket: Network error: TlsSocket::Close: Broken pipe
[ OK ] Parameters/TestRpc.TestCallWithPasswordProtectedKey/SSL_UnixSocket (28 ms)
[ RUN ] Parameters/TestRpc.TestCallToBadServer/SSL_UnixSocket
I20260929 22:46:03.374962 18746 rpc-test.cc:394] Status: Network error: Client connection negotiation failed: client connection to 0.0.0.0:0: connect: Connection refused (error 111)
I20260929 22:46:03.375272 18746 rpc-test.cc:394] Status: Network error: Client connection negotiation failed: client connection to 0.0.0.0:0: connect: Connection refused (error 111)
I20260929 22:46:03.375543 18746 rpc-test.cc:394] Status: Network error: Client connection negotiation failed: client connection to 0.0.0.0:0: connect: Connection refused (error 111)
I20260929 22:46:03.375788 18746 rpc-test.cc:394] Status: Network error: Client connection negotiation failed: client connection to 0.0.0.0:0: connect: Connection refused (error 111)
I20260929 22:46:03.376006 18746 rpc-test.cc:394] Status: Network error: Client connection negotiation failed: client connection to 0.0.0.0:0: connect: Connection refused (error 111)
[ OK ] Parameters/TestRpc.TestCallToBadServer/SSL_UnixSocket (14 ms)
[ RUN ] Parameters/TestRpc.TestWrongService/SSL_UnixSocket
I20260929 22:46:03.391343 18842 acceptor_pool.cc:254] collecting diagnostics on the listening RPC socket unix:/tmp/dist-test-taskNJnqbX/test-tmp/rpc-test-ecba318c2fe94df7a610e0056c22a1a0.sock every 8 connection(s)
I20260929 22:46:03.391393 18843 acceptor_pool.cc:254] collecting diagnostics on the listening RPC socket unix:/tmp/dist-test-taskNJnqbX/test-tmp/rpc-test-ecba318c2fe94df7a610e0056c22a1a0.sock every 8 connection(s)
I20260929 22:46:03.410609 18839 messenger.cc:345] service WrongServiceName not registered on TestServer
W20260929 22:46:03.411316 18839 connection.cc:196] Error closing socket: Network error: TlsSocket::Close: Broken pipe
[ OK ] Parameters/TestRpc.TestWrongService/SSL_UnixSocket (35 ms)
[ RUN ] Parameters/TestRpc.TestConnectionKeepalive/SSL_UnixSocket
I20260929 22:46:03.430912 18865 acceptor_pool.cc:254] collecting diagnostics on the listening RPC socket unix:/tmp/dist-test-taskNJnqbX/test-tmp/rpc-test-fe57359424234624af1dd83cdcf6f228.sock every 8 connection(s)
I20260929 22:46:03.430955 18866 acceptor_pool.cc:254] collecting diagnostics on the listening RPC socket unix:/tmp/dist-test-taskNJnqbX/test-tmp/rpc-test-fe57359424234624af1dd83cdcf6f228.sock every 8 connection(s)
I20260929 22:46:03.431149 18746 rpc-test.cc:488] Connecting to unix:/tmp/dist-test-taskNJnqbX/test-tmp/rpc-test-fe57359424234624af1dd83cdcf6f228.sock
W20260929 22:46:03.913393 18878 connection.cc:196] Error closing socket: Network error: TlsSocket::Close: Broken pipe
[ OK ] Parameters/TestRpc.TestConnectionKeepalive/SSL_UnixSocket (1038 ms)
[ RUN ] Parameters/TestRpc.TestClientConnectionMetrics/SSL_UnixSocket
I20260929 22:46:04.475773 18890 acceptor_pool.cc:254] collecting diagnostics on the listening RPC socket unix:/tmp/dist-test-taskNJnqbX/test-tmp/rpc-test-bd77be4345a847419b15511567c5fa75.sock every 8 connection(s)
I20260929 22:46:04.475814 18891 acceptor_pool.cc:254] collecting diagnostics on the listening RPC socket unix:/tmp/dist-test-taskNJnqbX/test-tmp/rpc-test-bd77be4345a847419b15511567c5fa75.sock every 8 connection(s)
I20260929 22:46:04.475966 18746 rpc-test.cc:569] Connecting to unix:/tmp/dist-test-taskNJnqbX/test-tmp/rpc-test-bd77be4345a847419b15511567c5fa75.sock
W20260929 22:46:12.840622 18887 connection.cc:196] Error closing socket: Network error: TlsSocket::Close: Broken pipe
[ OK ] Parameters/TestRpc.TestClientConnectionMetrics/SSL_UnixSocket (8390 ms)
[ RUN ] Parameters/TestRpc.TestCredentialsPolicy/SSL_UnixSocket
I20260929 22:46:12.851711 18913 acceptor_pool.cc:254] collecting diagnostics on the listening RPC socket unix:/tmp/dist-test-taskNJnqbX/test-tmp/rpc-test-65559594795b4cf382ffcc646eecef11.sock every 8 connection(s)
I20260929 22:46:12.851908 18914 acceptor_pool.cc:254] collecting diagnostics on the listening RPC socket unix:/tmp/dist-test-taskNJnqbX/test-tmp/rpc-test-65559594795b4cf382ffcc646eecef11.sock every 8 connection(s)
I20260929 22:46:12.852010 18746 rpc-test.cc:700] Connecting to unix:/tmp/dist-test-taskNJnqbX/test-tmp/rpc-test-65559594795b4cf382ffcc646eecef11.sock
W20260929 22:46:12.870465 18912 connection.cc:196] Error closing socket: Network error: TlsSocket::Close: Broken pipe
[ OK ] Parameters/TestRpc.TestCredentialsPolicy/SSL_UnixSocket (33 ms)
[ RUN ] Parameters/TestRpc.TestCallLongerThanKeepalive/SSL_UnixSocket
I20260929 22:46:12.905928 18938 acceptor_pool.cc:254] collecting diagnostics on the listening RPC socket unix:/tmp/dist-test-taskNJnqbX/test-tmp/rpc-test-0fa3e322e1c1433bb9f16bd973a7bf39.sock every 8 connection(s)
I20260929 22:46:12.905978 18939 acceptor_pool.cc:254] collecting diagnostics on the listening RPC socket unix:/tmp/dist-test-taskNJnqbX/test-tmp/rpc-test-0fa3e322e1c1433bb9f16bd973a7bf39.sock every 8 connection(s)
I20260929 22:46:12.918740 18942 rpc-test-base.h:222] got call: sleep_micros: 3000000 deferred: true
I20260929 22:46:15.919382 18942 rpcz_store.cc:275] Call kudu.rpc.GenericCalculatorService.Sleep from unix:<unnamed> (request call id 0) took 3000 ms. Trace:
I20260929 22:46:15.919480 18942 rpcz_store.cc:276] 0929 22:46:12.918702 (+ 0us) service_pool.cc:170] Inserting onto call queue
0929 22:46:12.918720 (+ 18us) service_pool.cc:227] Handling call
0929 22:46:15.919365 (+3000645us) inbound_call.cc:173] Queueing success response
Metrics: {}
W20260929 22:46:15.920503 18935 connection.cc:196] Error closing socket: Network error: TlsSocket::Close: Broken pipe
[ OK ] Parameters/TestRpc.TestCallLongerThanKeepalive/SSL_UnixSocket (3046 ms)
[ RUN ] Parameters/TestRpc.TestRpcSidecar/SSL_UnixSocket
I20260929 22:46:15.946249 18963 acceptor_pool.cc:254] collecting diagnostics on the listening RPC socket unix:/tmp/dist-test-taskNJnqbX/test-tmp/rpc-test-61f3f59585564987b22b23f1de83601a.sock every 8 connection(s)
I20260929 22:46:15.946277 18964 acceptor_pool.cc:254] collecting diagnostics on the listening RPC socket unix:/tmp/dist-test-taskNJnqbX/test-tmp/rpc-test-61f3f59585564987b22b23f1de83601a.sock every 8 connection(s)
W20260929 22:46:15.995492 18960 connection.cc:196] Error closing socket: Network error: TlsSocket::Close: Broken pipe
[ OK ] Parameters/TestRpc.TestRpcSidecar/SSL_UnixSocket (74 ms)
[ RUN ] Parameters/TestRpc.TestRpcSidecarLimits/SSL_UnixSocket
I20260929 22:46:17.859156 18988 acceptor_pool.cc:254] collecting diagnostics on the listening RPC socket unix:/tmp/dist-test-taskNJnqbX/test-tmp/rpc-test-5a71d3960e454d64bcb7e92705eebc8f.sock every 8 connection(s)
I20260929 22:46:17.859195 18989 acceptor_pool.cc:254] collecting diagnostics on the listening RPC socket unix:/tmp/dist-test-taskNJnqbX/test-tmp/rpc-test-5a71d3960e454d64bcb7e92705eebc8f.sock every 8 connection(s)
W20260929 22:46:17.871619 18746 serialization.cc:72] Serialized kudu.rpc_test.PushStringsRequestPB (2147483654 bytes) is larger than the maximum configured RPC message size (52428800 bytes). Sending anyway, but peer may reject the data.
W20260929 22:46:17.874619 18985 connection.cc:535] server connection from unix:<unnamed> recv error: Network error: RPC frame had a length of 2147483714, but we only support messages up to 52428800 bytes long.
W20260929 22:46:17.874683 18985 connection.cc:158] shutting down server connection from unix:<unnamed> with pending inbound data: 4/2147483714 bytes received; last active 0 ns ago: status Network error: RPC frame had a length of 2147483714, but we only support messages up to 52428800 bytes long.
W20260929 22:46:17.874861 19001 connection.cc:698] client connection to unix:/tmp/dist-test-taskNJnqbX/test-tmp/rpc-test-5a71d3960e454d64bcb7e92705eebc8f.sock send error: Network error: failed to write to TLS socket: Broken pipe
W20260929 22:46:17.874989 19001 connection.cc:196] Error closing socket: Network error: TlsSocket::Close: Success
I20260929 22:46:17.880640 19013 acceptor_pool.cc:254] collecting diagnostics on the listening RPC socket unix:/tmp/dist-test-taskNJnqbX/test-tmp/rpc-test-5a71d3960e454d64bcb7e92705eebc8f.sock every 8 connection(s)
I20260929 22:46:17.880760 19014 acceptor_pool.cc:254] collecting diagnostics on the listening RPC socket unix:/tmp/dist-test-taskNJnqbX/test-tmp/rpc-test-5a71d3960e454d64bcb7e92705eebc8f.sock every 8 connection(s)
W20260929 22:46:22.443427 19010 connection.cc:577] server connection from unix:<unnamed>: received bad data: 'Corruption: Invalid packet: message had a length of 2147483710, but we only support messages up to 2147483647 bytes
'
W20260929 22:46:22.443773 19026 connection.cc:196] Error closing socket: Network error: TlsSocket::Close: Broken pipe
[ OK ] Parameters/TestRpc.TestRpcSidecarLimits/SSL_UnixSocket (6448 ms)
[ RUN ] Parameters/TestRpc.TestCallTimeoutDoesntAffectNegotiation/SSL_UnixSocket
I20260929 22:46:22.460978 19038 acceptor_pool.cc:254] collecting diagnostics on the listening RPC socket unix:/tmp/dist-test-taskNJnqbX/test-tmp/rpc-test-725e805cd8c04bc883d44c8ce9864006.sock every 8 connection(s)
I20260929 22:46:22.461033 19039 acceptor_pool.cc:254] collecting diagnostics on the listening RPC socket unix:/tmp/dist-test-taskNJnqbX/test-tmp/rpc-test-725e805cd8c04bc883d44c8ce9864006.sock every 8 connection(s)
W20260929 22:46:22.466212 19034 negotiation.cc:266] Injecting 500ms delay in negotiation
I20260929 22:46:22.516510 18746 rpc-test-base.h:595] status: Timed out: connection negotiation to unix:/tmp/dist-test-taskNJnqbX/test-tmp/rpc-test-725e805cd8c04bc883d44c8ce9864006.sock for RPC Sleep timed out after 0.050s (ON_OUTBOUND_QUEUE), seconds elapsed: 0.0505604
[ OK ] Parameters/TestRpc.TestCallTimeoutDoesntAffectNegotiation/SSL_UnixSocket (525 ms)
[ RUN ] Parameters/TestRpc.TestRpcHandlerLatencyMetric/SSL_UnixSocket
I20260929 22:46:22.986737 19063 acceptor_pool.cc:254] collecting diagnostics on the listening RPC socket unix:/tmp/dist-test-taskNJnqbX/test-tmp/rpc-test-0d2fd7779c0f4020b39926ceaf50b3a0.sock every 8 connection(s)
I20260929 22:46:22.986779 19064 acceptor_pool.cc:254] collecting diagnostics on the listening RPC socket unix:/tmp/dist-test-taskNJnqbX/test-tmp/rpc-test-0d2fd7779c0f4020b39926ceaf50b3a0.sock every 8 connection(s)
I20260929 22:46:23.016383 18746 rpc-test.cc:1236] Sleep() min lat: 20275
I20260929 22:46:23.016466 18746 rpc-test.cc:1237] Sleep() mean lat: 20275
I20260929 22:46:23.016492 18746 rpc-test.cc:1238] Sleep() max lat: 20275
I20260929 22:46:23.016506 18746 rpc-test.cc:1239] Sleep() #calls: 1
[ OK ] Parameters/TestRpc.TestRpcHandlerLatencyMetric/SSL_UnixSocket (46 ms)
[ RUN ] Parameters/TestRpc.TimedOutOnResponseMetricServiceQueue/SSL_UnixSocket
I20260929 22:46:23.043388 19089 acceptor_pool.cc:254] collecting diagnostics on the listening RPC socket unix:/tmp/dist-test-taskNJnqbX/test-tmp/rpc-test-29b5af1cba5b46b787d79d205d2fc901.sock every 8 connection(s)
I20260929 22:46:23.043440 19090 acceptor_pool.cc:254] collecting diagnostics on the listening RPC socket unix:/tmp/dist-test-taskNJnqbX/test-tmp/rpc-test-29b5af1cba5b46b787d79d205d2fc901.sock every 8 connection(s)
W20260929 22:46:23.102051 19091 rpcz_store.cc:267] Call kudu.rpc_test.CalculatorService.Sleep from unix:<unnamed> (request call id 2) took 20 ms (client timeout 20 ms). Trace:
W20260929 22:46:23.102133 19091 rpcz_store.cc:269] 0929 22:46:23.081764 (+ 0us) service_pool.cc:170] Inserting onto call queue
0929 22:46:23.102023 (+ 20259us) service_pool.cc:214] Skipping call since client already timed out
0929 22:46:23.102033 (+ 10us) inbound_call.cc:173] Queueing failure response
Metrics: {}
[ OK ] Parameters/TestRpc.TimedOutOnResponseMetricServiceQueue/SSL_UnixSocket (85 ms)
[ RUN ] Parameters/TestRpc.RpcPendingConnectionsMetric/SSL_UnixSocket
I20260929 22:46:23.105425 19112 acceptor_pool.cc:254] collecting diagnostics on the listening RPC socket 0.0.0.0:42103 every 8 connection(s)
I20260929 22:46:23.105491 19113 acceptor_pool.cc:254] collecting diagnostics on the listening RPC socket 0.0.0.0:42103 every 8 connection(s)
W20260929 22:46:23.106065 19108 negotiation.cc:337] Failed RPC negotiation. Trace:
0929 22:46:23.105875 (+ 0us) reactor.cc:625] Submitting negotiation task for server connection from 127.0.0.1:57628 (local address 127.0.0.1:42103)
0929 22:46:23.105940 (+ 65us) server_negotiation.cc:206] Beginning negotiation
0929 22:46:23.105942 (+ 2us) server_negotiation.cc:399] Waiting for connection header
0929 22:46:23.106013 (+ 71us) negotiation.cc:327] Negotiation complete: Network error: Server connection negotiation failed: server connection from 127.0.0.1:57628: BlockingRecv error: recv got EOF from 127.0.0.1:57628 (error 108)
Metrics: {"server-negotiator.queue_time_us":36}
[ OK ] Parameters/TestRpc.RpcPendingConnectionsMetric/SSL_UnixSocket (13 ms)
[ RUN ] Parameters/TestRpc.TestRpcContextClientDeadline/SSL_UnixSocket
I20260929 22:46:23.139742 19128 acceptor_pool.cc:254] collecting diagnostics on the listening RPC socket unix:/tmp/dist-test-taskNJnqbX/test-tmp/rpc-test-95d395280c2d45a9bf3bf80269ed4354.sock every 8 connection(s)
I20260929 22:46:23.139783 19129 acceptor_pool.cc:254] collecting diagnostics on the listening RPC socket unix:/tmp/dist-test-taskNJnqbX/test-tmp/rpc-test-95d395280c2d45a9bf3bf80269ed4354.sock every 8 connection(s)
[ OK ] Parameters/TestRpc.TestRpcContextClientDeadline/SSL_UnixSocket (54 ms)
[ RUN ] Parameters/TestRpc.TestApplicationFeatureFlagUnsupportedServer/SSL_UnixSocket
I20260929 22:46:23.190286 19153 acceptor_pool.cc:254] collecting diagnostics on the listening RPC socket unix:/tmp/dist-test-taskNJnqbX/test-tmp/rpc-test-87e618ce8da44367a25ea8f99de87feb.sock every 8 connection(s)
I20260929 22:46:23.190335 19154 acceptor_pool.cc:254] collecting diagnostics on the listening RPC socket unix:/tmp/dist-test-taskNJnqbX/test-tmp/rpc-test-87e618ce8da44367a25ea8f99de87feb.sock every 8 connection(s)
[ OK ] Parameters/TestRpc.TestApplicationFeatureFlagUnsupportedServer/SSL_UnixSocket (61 ms)
[ RUN ] Parameters/TestRpc.TestCancellationAsync/SSL_UnixSocket
I20260929 22:46:23.255493 19178 acceptor_pool.cc:254] collecting diagnostics on the listening RPC socket unix:/tmp/dist-test-taskNJnqbX/test-tmp/rpc-test-9ae0917edf6a42219b2d1cc7ce771c55.sock every 8 connection(s)
I20260929 22:46:23.255535 19179 acceptor_pool.cc:254] collecting diagnostics on the listening RPC socket unix:/tmp/dist-test-taskNJnqbX/test-tmp/rpc-test-9ae0917edf6a42219b2d1cc7ce771c55.sock every 8 connection(s)
I20260929 22:46:23.255753 18746 rpc-test.cc:1716] Connecting to unix:/tmp/dist-test-taskNJnqbX/test-tmp/rpc-test-9ae0917edf6a42219b2d1cc7ce771c55.sock
I20260929 22:46:23.268339 18746 test_util.cc:268] Using random seed: -206289423
I20260929 22:46:23.285501 19182 rpc-test-base.h:240] got call: sleep_micros: 500 pattern: 4294967295 num_repetitions: 2097152 sidecar_idx: 0
I20260929 22:46:23.299223 19182 rpc-test-base.h:240] got call: sleep_micros: 500 pattern: 4294967295 num_repetitions: 2097152 sidecar_idx: 0
I20260929 22:46:23.312844 19182 rpc-test-base.h:240] got call: sleep_micros: 500 pattern: 4294967295 num_repetitions: 2097152 sidecar_idx: 0
I20260929 22:46:23.326303 19182 rpc-test-base.h:240] got call: sleep_micros: 500 pattern: 4294967295 num_repetitions: 2097152 sidecar_idx: 0
I20260929 22:46:23.340014 19182 rpc-test-base.h:240] got call: sleep_micros: 500 pattern: 4294967295 num_repetitions: 2097152 sidecar_idx: 0
I20260929 22:46:23.353418 19182 rpc-test-base.h:240] got call: sleep_micros: 500 pattern: 4294967295 num_repetitions: 2097152 sidecar_idx: 0
I20260929 22:46:23.366245 19182 rpc-test-base.h:240] got call: sleep_micros: 500 pattern: 4294967295 num_repetitions: 2097152 sidecar_idx: 0
I20260929 22:46:23.376955 19182 rpc-test-base.h:240] got call: sleep_micros: 500 pattern: 4294967295 num_repetitions: 2097152 sidecar_idx: 0
W20260929 22:46:23.378285 19175 connection.cc:196] Error closing socket: Network error: TlsSocket::Close: Broken pipe
W20260929 22:46:23.379945 19175 connection.cc:441] server connection from unix:<unnamed> torn down before Call kudu.rpc.GenericCalculatorService.SleepWithSidecar from unix:<unnamed> (request call id 9) could send its response
[ OK ] Parameters/TestRpc.TestCancellationAsync/SSL_UnixSocket (146 ms)
[ RUN ] Parameters/TestRpc.TestPerformanceBySocketType/SSL_UnixSocket
I20260929 22:46:23.412786 19203 acceptor_pool.cc:254] collecting diagnostics on the listening RPC socket unix:/tmp/dist-test-taskNJnqbX/test-tmp/rpc-test-1a3e8e3587e54734a6ad57c8a16a0055.sock every 8 connection(s)
I20260929 22:46:23.412835 19204 acceptor_pool.cc:254] collecting diagnostics on the listening RPC socket unix:/tmp/dist-test-taskNJnqbX/test-tmp/rpc-test-1a3e8e3587e54734a6ad57c8a16a0055.sock every 8 connection(s)
I20260929 22:46:23.412997 18746 rpc-test.cc:1846] Connecting to unix:/tmp/dist-test-taskNJnqbX/test-tmp/rpc-test-1a3e8e3587e54734a6ad57c8a16a0055.sock
I20260929 22:46:24.691874 18746 rpc-test.cc:1859] Sending 1024MB via ssl-enabled unix socket: real 1.274s user 1.396s sys 0.892s
I20260929 22:46:25.869143 18746 rpc-test.cc:1859] Sending 1024MB via ssl-enabled unix socket: real 1.177s user 1.255s sys 0.871s
I20260929 22:46:27.069932 18746 rpc-test.cc:1859] Sending 1024MB via ssl-enabled unix socket: real 1.201s user 1.385s sys 0.797s
I20260929 22:46:28.272030 18746 rpc-test.cc:1859] Sending 1024MB via ssl-enabled unix socket: real 1.202s user 1.329s sys 0.852s
I20260929 22:46:29.450614 18746 rpc-test.cc:1859] Sending 1024MB via ssl-enabled unix socket: real 1.178s user 1.268s sys 0.869s
[ OK ] Parameters/TestRpc.TestPerformanceBySocketType/SSL_UnixSocket (6071 ms)
[----------] 20 tests from Parameters/TestRpc (26187 ms total)
[----------] 1 test from Parameters/TestRpcSocketTxRxQueue
[ RUN ] Parameters/TestRpcSocketTxRxQueue.AcceptorRxQueueSizeMetric/0
I20260929 22:46:29.457690 19228 acceptor_pool.cc:254] collecting diagnostics on the listening RPC socket 0.0.0.0:34707 every 1 connection(s)
I20260929 22:46:29.457774 19229 acceptor_pool.cc:254] collecting diagnostics on the listening RPC socket 0.0.0.0:34707 every 1 connection(s)
W20260929 22:46:29.458303 19224 negotiation.cc:337] Failed RPC negotiation. Trace:
0929 22:46:29.458161 (+ 0us) reactor.cc:625] Submitting negotiation task for server connection from 127.0.0.1:51424 (local address 127.0.0.1:34707)
0929 22:46:29.458202 (+ 41us) server_negotiation.cc:206] Beginning negotiation
0929 22:46:29.458204 (+ 2us) server_negotiation.cc:399] Waiting for connection header
0929 22:46:29.458274 (+ 70us) negotiation.cc:327] Negotiation complete: Network error: Server connection negotiation failed: server connection from 127.0.0.1:51424: BlockingRecv error: recv got EOF from 127.0.0.1:51424 (error 108)
Metrics: {"server-negotiator.queue_time_us":15}
[ OK ] Parameters/TestRpcSocketTxRxQueue.AcceptorRxQueueSizeMetric/0 (7 ms)
[----------] 1 test from Parameters/TestRpcSocketTxRxQueue (7 ms total)
[----------] Global test environment tear-down
[==========] 21 tests from 2 test suites ran. (26195 ms total)
[ PASSED ] 20 tests.
[ FAILED ] 1 test, listed below:
[ FAILED ] Parameters/TestRpc.TestCallWithChainCertAndChainCA/SSL_UnixSocket, where GetParam() = (true, true)
1 FAILED TEST