Diagnosed failure

Parameters/TestRpc.TestCallWithChainCertAndChainCA/SSL_TCP: /data0/somelongdirectorytoavoidrpathissues/src/kudu/src/kudu/rpc/rpc-test.cc:270: Failure
Failed
Bad status: Runtime error: could not verify certificate chain (error with cert: subject=CN = localhost, ST = sadfjas, C = AS, emailAddress = sdflkdsajf, O = lskdfjlsad, OU = sldfkja, issuer=C = AS, ST = ASDfkjdhf, L = lskdjf, O = saldfja, OU = skdjf, CN = localhost, emailAddress = sadjflkadsj): : certificate has expired
Google Test trace:
/data0/somelongdirectorytoavoidrpathissues/src/kudu/src/kudu/rpc/rpc-test.cc:267: Connecting to 0.0.0.0:35851
I20260926 03:36:41.285571  2335 test_util.cc:175] -----------------------------------------------
I20260926 03:36:41.285782  2335 test_util.cc:176] Had fatal failures, leaving test files at /tmp/dist-test-taskD6XCa4/test-tmp/rpc-test.5.Parameters_TestRpc.TestCallWithChainCertAndChainCA_SSL_TCP.1790393801150439-2335-0

Full log

Note: This is test shard 6 of 8.
[==========] Running 21 tests from 2 test suites.
[----------] Global test environment set-up.
[----------] 20 tests from Parameters/TestRpc
[ RUN      ] Parameters/TestRpc.TestMessengerCreateDestroy/SSL_TCP
WARNING: Logging before InitGoogleLogging() is written to STDERR
I20260926 03:36:41.199476  2335 rpc-test.cc:169] started messenger TestCreateDestroy
[       OK ] Parameters/TestRpc.TestMessengerCreateDestroy/SSL_TCP (33 ms)
[ RUN      ] Parameters/TestRpc.TestNegotiationDeadlock/SSL_TCP
I20260926 03:36:41.213264  2355 acceptor_pool.cc:254] collecting diagnostics on the listening RPC socket 0.0.0.0:45485 every 8 connection(s)
I20260926 03:36:41.213586  2356 acceptor_pool.cc:254] collecting diagnostics on the listening RPC socket 0.0.0.0:45485 every 8 connection(s)
[       OK ] Parameters/TestRpc.TestNegotiationDeadlock/SSL_TCP (35 ms)
[ RUN      ] Parameters/TestRpc.TestCallWithChainCertAndChainCA/SSL_TCP
I20260926 03:36:41.272204  2371 acceptor_pool.cc:254] collecting diagnostics on the listening RPC socket 0.0.0.0:35851 every 8 connection(s)
I20260926 03:36:41.272575  2372 acceptor_pool.cc:254] collecting diagnostics on the listening RPC socket 0.0.0.0:35851 every 8 connection(s)
/data0/somelongdirectorytoavoidrpathissues/src/kudu/src/kudu/rpc/rpc-test.cc:270: Failure
Failed
Bad status: Runtime error: could not verify certificate chain (error with cert: subject=CN = localhost, ST = sadfjas, C = AS, emailAddress = sdflkdsajf, O = lskdfjlsad, OU = sldfkja, issuer=C = AS, ST = ASDfkjdhf, L = lskdjf, O = saldfja, OU = skdjf, CN = localhost, emailAddress = sadjflkadsj): : certificate has expired
Google Test trace:
/data0/somelongdirectorytoavoidrpathissues/src/kudu/src/kudu/rpc/rpc-test.cc:267: Connecting to 0.0.0.0:35851
I20260926 03:36:41.285571  2335 test_util.cc:175] -----------------------------------------------
I20260926 03:36:41.285782  2335 test_util.cc:176] Had fatal failures, leaving test files at /tmp/dist-test-taskD6XCa4/test-tmp/rpc-test.5.Parameters_TestRpc.TestCallWithChainCertAndChainCA_SSL_TCP.1790393801150439-2335-0
[  FAILED  ] Parameters/TestRpc.TestCallWithChainCertAndChainCA/SSL_TCP, where GetParam() = (true, false) (47 ms)
[ RUN      ] Parameters/TestRpc.TestCallWithPasswordProtectedKey/SSL_TCP
I20260926 03:36:41.300944  2396 acceptor_pool.cc:254] collecting diagnostics on the listening RPC socket 0.0.0.0:40353 every 8 connection(s)
I20260926 03:36:41.301302  2397 acceptor_pool.cc:254] collecting diagnostics on the listening RPC socket 0.0.0.0:40353 every 8 connection(s)
[       OK ] Parameters/TestRpc.TestCallWithPasswordProtectedKey/SSL_TCP (53 ms)
[ RUN      ] Parameters/TestRpc.TestCallToBadServer/SSL_TCP
I20260926 03:36:41.351781  2335 rpc-test.cc:394] Status: Network error: Client connection negotiation failed: client connection to 0.0.0.0:0: connect: Connection refused (error 111)
I20260926 03:36:41.353132  2335 rpc-test.cc:394] Status: Network error: Client connection negotiation failed: client connection to 0.0.0.0:0: connect: Connection refused (error 111)
I20260926 03:36:41.353947  2335 rpc-test.cc:394] Status: Network error: Client connection negotiation failed: client connection to 0.0.0.0:0: connect: Connection refused (error 111)
I20260926 03:36:41.354588  2335 rpc-test.cc:394] Status: Network error: Client connection negotiation failed: client connection to 0.0.0.0:0: connect: Connection refused (error 111)
I20260926 03:36:41.355147  2335 rpc-test.cc:394] Status: Network error: Client connection negotiation failed: client connection to 0.0.0.0:0: connect: Connection refused (error 111)
[       OK ] Parameters/TestRpc.TestCallToBadServer/SSL_TCP (17 ms)
[ RUN      ] Parameters/TestRpc.TestWrongService/SSL_TCP
I20260926 03:36:41.365940  2431 acceptor_pool.cc:254] collecting diagnostics on the listening RPC socket 0.0.0.0:46149 every 8 connection(s)
I20260926 03:36:41.366226  2432 acceptor_pool.cc:254] collecting diagnostics on the listening RPC socket 0.0.0.0:46149 every 8 connection(s)
I20260926 03:36:41.390419  2429 messenger.cc:345] service WrongServiceName not registered on TestServer
[       OK ] Parameters/TestRpc.TestWrongService/SSL_TCP (39 ms)
[ RUN      ] Parameters/TestRpc.TestConnectionKeepalive/SSL_TCP
I20260926 03:36:41.409049  2454 acceptor_pool.cc:254] collecting diagnostics on the listening RPC socket 0.0.0.0:33943 every 8 connection(s)
I20260926 03:36:41.409504  2455 acceptor_pool.cc:254] collecting diagnostics on the listening RPC socket 0.0.0.0:33943 every 8 connection(s)
I20260926 03:36:41.410766  2335 rpc-test.cc:488] Connecting to 0.0.0.0:33943
[       OK ] Parameters/TestRpc.TestConnectionKeepalive/SSL_TCP (1047 ms)
[ RUN      ] Parameters/TestRpc.TestClientConnectionMetrics/SSL_TCP
I20260926 03:36:42.475955  2479 acceptor_pool.cc:254] collecting diagnostics on the listening RPC socket 0.0.0.0:43079 every 8 connection(s)
I20260926 03:36:42.476249  2480 acceptor_pool.cc:254] collecting diagnostics on the listening RPC socket 0.0.0.0:43079 every 8 connection(s)
I20260926 03:36:42.477226  2335 rpc-test.cc:569] Connecting to 0.0.0.0:43079
[       OK ] Parameters/TestRpc.TestClientConnectionMetrics/SSL_TCP (20294 ms)
[ RUN      ] Parameters/TestRpc.TestCredentialsPolicy/SSL_TCP
I20260926 03:37:02.753226  2502 acceptor_pool.cc:254] collecting diagnostics on the listening RPC socket 0.0.0.0:39649 every 8 connection(s)
I20260926 03:37:02.753491  2503 acceptor_pool.cc:254] collecting diagnostics on the listening RPC socket 0.0.0.0:39649 every 8 connection(s)
I20260926 03:37:02.754572  2335 rpc-test.cc:700] Connecting to 0.0.0.0:39649
[       OK ] Parameters/TestRpc.TestCredentialsPolicy/SSL_TCP (67 ms)
[ RUN      ] Parameters/TestRpc.TestCallLongerThanKeepalive/SSL_TCP
I20260926 03:37:02.839884  2527 acceptor_pool.cc:254] collecting diagnostics on the listening RPC socket 0.0.0.0:39355 every 8 connection(s)
I20260926 03:37:02.840557  2528 acceptor_pool.cc:254] collecting diagnostics on the listening RPC socket 0.0.0.0:39355 every 8 connection(s)
I20260926 03:37:02.894650  2531 rpc-test-base.h:222] got call: sleep_micros: 3000000 deferred: true
I20260926 03:37:05.896562  2531 rpcz_store.cc:275] Call kudu.rpc.GenericCalculatorService.Sleep from 127.0.0.1:56756 (request call id 0) took 3002 ms. Trace:
I20260926 03:37:05.896783  2531 rpcz_store.cc:276] 0926 03:37:02.894485 (+     0us) service_pool.cc:170] Inserting onto call queue
0926 03:37:02.894590 (+   105us) service_pool.cc:227] Handling call
0926 03:37:05.896488 (+3001898us) inbound_call.cc:173] Queueing success response
Metrics: {}
[       OK ] Parameters/TestRpc.TestCallLongerThanKeepalive/SSL_TCP (3097 ms)
[ RUN      ] Parameters/TestRpc.TestRpcSidecar/SSL_TCP
I20260926 03:37:05.917196  2552 acceptor_pool.cc:254] collecting diagnostics on the listening RPC socket 0.0.0.0:40027 every 8 connection(s)
I20260926 03:37:05.917402  2553 acceptor_pool.cc:254] collecting diagnostics on the listening RPC socket 0.0.0.0:40027 every 8 connection(s)
[       OK ] Parameters/TestRpc.TestRpcSidecar/SSL_TCP (127 ms)
[ RUN      ] Parameters/TestRpc.TestRpcSidecarLimits/SSL_TCP
I20260926 03:37:08.644430  2577 acceptor_pool.cc:254] collecting diagnostics on the listening RPC socket 0.0.0.0:46731 every 8 connection(s)
I20260926 03:37:08.644767  2578 acceptor_pool.cc:254] collecting diagnostics on the listening RPC socket 0.0.0.0:46731 every 8 connection(s)
W20260926 03:37:08.657974  2335 serialization.cc:72] Serialized kudu.rpc_test.PushStringsRequestPB (2147483654 bytes) is larger than the maximum configured RPC message size (52428800 bytes). Sending anyway, but peer may reject the data.
W20260926 03:37:08.664565  2574 connection.cc:535] server connection from 127.0.0.1:44730 recv error: Network error: RPC frame had a length of 2147483714, but we only support messages up to 52428800 bytes long.
W20260926 03:37:08.664757  2574 connection.cc:158] shutting down server connection from 127.0.0.1:44730 with pending inbound data: 4/2147483714 bytes received; last active 0 ns ago: status Network error: RPC frame had a length of 2147483714, but we only support messages up to 52428800 bytes long.
W20260926 03:37:08.665372  2590 connection.cc:196] Error closing socket: Network error: TlsSocket::Close: Connection reset by peer
I20260926 03:37:08.702237  2602 acceptor_pool.cc:254] collecting diagnostics on the listening RPC socket 0.0.0.0:46009 every 8 connection(s)
I20260926 03:37:08.702889  2603 acceptor_pool.cc:254] collecting diagnostics on the listening RPC socket 0.0.0.0:46009 every 8 connection(s)
W20260926 03:37:14.058352  2600 connection.cc:577] server connection from 127.0.0.1:52504: received bad data: 'Corruption: Invalid packet: message had a length of 2147483710, but we only support messages up to 2147483647 bytes
'
[       OK ] Parameters/TestRpc.TestRpcSidecarLimits/SSL_TCP (8529 ms)
[ RUN      ] Parameters/TestRpc.TestCallTimeoutDoesntAffectNegotiation/SSL_TCP
I20260926 03:37:14.579945  2627 acceptor_pool.cc:254] collecting diagnostics on the listening RPC socket 0.0.0.0:39641 every 8 connection(s)
I20260926 03:37:14.580298  2628 acceptor_pool.cc:254] collecting diagnostics on the listening RPC socket 0.0.0.0:39641 every 8 connection(s)
W20260926 03:37:14.599130  2623 negotiation.cc:266] Injecting 500ms delay in negotiation
I20260926 03:37:14.649664  2335 rpc-test-base.h:595] status: Timed out: connection negotiation to 0.0.0.0:39641 for RPC Sleep timed out after 0.050s (ON_OUTBOUND_QUEUE), seconds elapsed: 0.0513184
[       OK ] Parameters/TestRpc.TestCallTimeoutDoesntAffectNegotiation/SSL_TCP (549 ms)
[ RUN      ] Parameters/TestRpc.TestRpcHandlerLatencyMetric/SSL_TCP
I20260926 03:37:15.133412  2652 acceptor_pool.cc:254] collecting diagnostics on the listening RPC socket 0.0.0.0:42719 every 8 connection(s)
I20260926 03:37:15.133710  2653 acceptor_pool.cc:254] collecting diagnostics on the listening RPC socket 0.0.0.0:42719 every 8 connection(s)
I20260926 03:37:15.171460  2335 rpc-test.cc:1236] Sleep() min lat: 20790
I20260926 03:37:15.171620  2335 rpc-test.cc:1237] Sleep() mean lat: 20790
I20260926 03:37:15.171674  2335 rpc-test.cc:1238] Sleep() max lat: 20790
I20260926 03:37:15.171695  2335 rpc-test.cc:1239] Sleep() #calls: 1
[       OK ] Parameters/TestRpc.TestRpcHandlerLatencyMetric/SSL_TCP (66 ms)
[ RUN      ] Parameters/TestRpc.TimedOutOnResponseMetricServiceQueue/SSL_TCP
I20260926 03:37:15.190433  2678 acceptor_pool.cc:254] collecting diagnostics on the listening RPC socket 0.0.0.0:42927 every 8 connection(s)
I20260926 03:37:15.190609  2679 acceptor_pool.cc:254] collecting diagnostics on the listening RPC socket 0.0.0.0:42927 every 8 connection(s)
W20260926 03:37:15.275980  2680 rpcz_store.cc:267] Call kudu.rpc_test.CalculatorService.Sleep from 127.0.0.1:33214 (request call id 2) took 20 ms (client timeout 20 ms). Trace:
W20260926 03:37:15.276149  2680 rpcz_store.cc:269] 0926 03:37:15.255428 (+     0us) service_pool.cc:170] Inserting onto call queue
0926 03:37:15.275870 (+ 20442us) service_pool.cc:214] Skipping call since client already timed out
0926 03:37:15.275956 (+    86us) inbound_call.cc:173] Queueing failure response
Metrics: {}
[       OK ] Parameters/TestRpc.TimedOutOnResponseMetricServiceQueue/SSL_TCP (104 ms)
[ RUN      ] Parameters/TestRpc.RpcPendingConnectionsMetric/SSL_TCP
I20260926 03:37:15.287053  2701 acceptor_pool.cc:254] collecting diagnostics on the listening RPC socket 0.0.0.0:40171 every 8 connection(s)
I20260926 03:37:15.287273  2702 acceptor_pool.cc:254] collecting diagnostics on the listening RPC socket 0.0.0.0:40171 every 8 connection(s)
W20260926 03:37:15.299633  2697 negotiation.cc:337] Failed RPC negotiation. Trace:
0926 03:37:15.298481 (+     0us) reactor.cc:625] Submitting negotiation task for server connection from 127.0.0.1:53720 (local address 127.0.0.1:40171)
0926 03:37:15.298907 (+   426us) server_negotiation.cc:206] Beginning negotiation
0926 03:37:15.298914 (+     7us) server_negotiation.cc:399] Waiting for connection header
0926 03:37:15.299162 (+   248us) negotiation.cc:327] Negotiation complete: Network error: Server connection negotiation failed: server connection from 127.0.0.1:53720: BlockingRecv error: recv got EOF from 127.0.0.1:53720 (error 108)
Metrics: {"server-negotiator.queue_time_us":234}
[       OK ] Parameters/TestRpc.RpcPendingConnectionsMetric/SSL_TCP (30 ms)
[ RUN      ] Parameters/TestRpc.TestRpcContextClientDeadline/SSL_TCP
I20260926 03:37:15.344970  2717 acceptor_pool.cc:254] collecting diagnostics on the listening RPC socket 0.0.0.0:33435 every 8 connection(s)
I20260926 03:37:15.345212  2718 acceptor_pool.cc:254] collecting diagnostics on the listening RPC socket 0.0.0.0:33435 every 8 connection(s)
[       OK ] Parameters/TestRpc.TestRpcContextClientDeadline/SSL_TCP (78 ms)
[ RUN      ] Parameters/TestRpc.TestApplicationFeatureFlagUnsupportedServer/SSL_TCP
I20260926 03:37:15.411188  2742 acceptor_pool.cc:254] collecting diagnostics on the listening RPC socket 0.0.0.0:33951 every 8 connection(s)
I20260926 03:37:15.411458  2743 acceptor_pool.cc:254] collecting diagnostics on the listening RPC socket 0.0.0.0:33951 every 8 connection(s)
[       OK ] Parameters/TestRpc.TestApplicationFeatureFlagUnsupportedServer/SSL_TCP (56 ms)
[ RUN      ] Parameters/TestRpc.TestCancellationAsync/SSL_TCP
I20260926 03:37:15.474509  2767 acceptor_pool.cc:254] collecting diagnostics on the listening RPC socket 0.0.0.0:40115 every 8 connection(s)
I20260926 03:37:15.474696  2768 acceptor_pool.cc:254] collecting diagnostics on the listening RPC socket 0.0.0.0:40115 every 8 connection(s)
I20260926 03:37:15.475795  2335 rpc-test.cc:1716] Connecting to 0.0.0.0:40115
I20260926 03:37:15.513664  2335 test_util.cc:268] Using random seed: -1936529648
I20260926 03:37:15.554639  2771 rpc-test-base.h:240] got call: sleep_micros: 500 pattern: 4294967295 num_repetitions: 2097152 sidecar_idx: 0
I20260926 03:37:15.584501  2770 rpc-test-base.h:240] got call: sleep_micros: 500 pattern: 4294967295 num_repetitions: 2097152 sidecar_idx: 0
I20260926 03:37:15.611646  2771 rpc-test-base.h:240] got call: sleep_micros: 500 pattern: 4294967295 num_repetitions: 2097152 sidecar_idx: 0
I20260926 03:37:15.641466  2770 rpc-test-base.h:240] got call: sleep_micros: 500 pattern: 4294967295 num_repetitions: 2097152 sidecar_idx: 0
I20260926 03:37:15.668447  2771 rpc-test-base.h:240] got call: sleep_micros: 500 pattern: 4294967295 num_repetitions: 2097152 sidecar_idx: 0
I20260926 03:37:15.698290  2770 rpc-test-base.h:240] got call: sleep_micros: 500 pattern: 4294967295 num_repetitions: 2097152 sidecar_idx: 0
I20260926 03:37:15.728185  2771 rpc-test-base.h:240] got call: sleep_micros: 500 pattern: 4294967295 num_repetitions: 2097152 sidecar_idx: 0
W20260926 03:37:15.753911  2765 connection.cc:196] Error closing socket: Network error: TlsSocket::Close: Broken pipe
W20260926 03:37:15.762804  2765 connection.cc:441] server connection from 127.0.0.1:60128 torn down before Call kudu.rpc.GenericCalculatorService.SleepWithSidecar from 127.0.0.1:60128 (request call id 7) could send its response
W20260926 03:37:15.777456  2765 connection.cc:441] server connection from 127.0.0.1:60128 torn down before Call kudu.rpc.GenericCalculatorService.SleepWithSidecar from 127.0.0.1:60128 (request call id 8) could send its response
[       OK ] Parameters/TestRpc.TestCancellationAsync/SSL_TCP (333 ms)
[ RUN      ] Parameters/TestRpc.TestPerformanceBySocketType/SSL_TCP
I20260926 03:37:15.801316  2792 acceptor_pool.cc:254] collecting diagnostics on the listening RPC socket 0.0.0.0:37005 every 8 connection(s)
I20260926 03:37:15.801558  2793 acceptor_pool.cc:254] collecting diagnostics on the listening RPC socket 0.0.0.0:37005 every 8 connection(s)
I20260926 03:37:15.802450  2335 rpc-test.cc:1846] Connecting to 0.0.0.0:37005
I20260926 03:37:19.272840  2335 rpc-test.cc:1859] Sending 1024MB via ssl-enabled tcp socket: real 3.457s	user 3.136s	sys 2.666s
I20260926 03:37:22.715051  2335 rpc-test.cc:1859] Sending 1024MB via ssl-enabled tcp socket: real 3.442s	user 3.016s	sys 2.701s
I20260926 03:37:26.129137  2335 rpc-test.cc:1859] Sending 1024MB via ssl-enabled tcp socket: real 3.414s	user 2.959s	sys 2.743s
I20260926 03:37:29.537868  2335 rpc-test.cc:1859] Sending 1024MB via ssl-enabled tcp socket: real 3.409s	user 2.975s	sys 2.698s
I20260926 03:37:32.927042  2335 rpc-test.cc:1859] Sending 1024MB via ssl-enabled tcp socket: real 3.389s	user 2.971s	sys 2.702s
[       OK ] Parameters/TestRpc.TestPerformanceBySocketType/SSL_TCP (17155 ms)
[----------] 20 tests from Parameters/TestRpc (51767 ms total)

[----------] 1 test from Parameters/TestRpcSocketTxRxQueue
[ RUN      ] Parameters/TestRpcSocketTxRxQueue.OverCapacity/0
W20260926 03:37:33.248024  2827 negotiation.cc:337] Failed RPC negotiation. Trace:
0926 03:37:32.952823 (+     0us) reactor.cc:625] Submitting negotiation task for client connection to 0.0.0.0:42185 (local address 127.0.0.1:43792)
0926 03:37:32.953038 (+   215us) negotiation.cc:107] Waiting for socket to connect
0926 03:37:32.953055 (+    17us) client_negotiation.cc:174] Beginning negotiation
0926 03:37:32.953166 (+   111us) client_negotiation.cc:252] Sending NEGOTIATE NegotiatePB request
0926 03:37:33.247177 (+294011us) negotiation.cc:327] Negotiation complete: Network error: Client connection negotiation failed: client connection to 0.0.0.0:42185: BlockingRecv error: recv error from unknown peer: Transport endpoint is not connected (error 107)
Metrics: {"client-negotiator.queue_time_us":74}
W20260926 03:37:33.248164  2836 negotiation.cc:337] Failed RPC negotiation. Trace:
0926 03:37:32.955644 (+     0us) reactor.cc:625] Submitting negotiation task for client connection to 0.0.0.0:42185 (local address 127.0.0.1:43796)
0926 03:37:32.955853 (+   209us) negotiation.cc:107] Waiting for socket to connect
0926 03:37:32.955869 (+    16us) client_negotiation.cc:174] Beginning negotiation
0926 03:37:32.956003 (+   134us) client_negotiation.cc:252] Sending NEGOTIATE NegotiatePB request
0926 03:37:33.247370 (+291367us) negotiation.cc:327] Negotiation complete: Network error: Client connection negotiation failed: client connection to 0.0.0.0:42185: BlockingRecv error: recv error from unknown peer: Transport endpoint is not connected (error 107)
Metrics: {"client-negotiator.queue_time_us":75}
W20260926 03:37:33.248936  2818 negotiation.cc:337] Failed RPC negotiation. Trace:
0926 03:37:32.949917 (+     0us) reactor.cc:625] Submitting negotiation task for client connection to 0.0.0.0:42185 (local address 127.0.0.1:43782)
0926 03:37:32.950137 (+   220us) negotiation.cc:107] Waiting for socket to connect
0926 03:37:32.950155 (+    18us) client_negotiation.cc:174] Beginning negotiation
0926 03:37:32.950271 (+   116us) client_negotiation.cc:252] Sending NEGOTIATE NegotiatePB request
0926 03:37:33.247184 (+296913us) negotiation.cc:327] Negotiation complete: Network error: Client connection negotiation failed: client connection to 0.0.0.0:42185: BlockingRecv error: recv error from unknown peer: Transport endpoint is not connected (error 107)
Metrics: {"client-negotiator.queue_time_us":58}
W20260926 03:37:33.248974  2845 negotiation.cc:337] Failed RPC negotiation. Trace:
0926 03:37:32.958486 (+     0us) reactor.cc:625] Submitting negotiation task for client connection to 0.0.0.0:42185 (local address 127.0.0.1:43800)
0926 03:37:32.958700 (+   214us) negotiation.cc:107] Waiting for socket to connect
0926 03:37:32.958721 (+    21us) client_negotiation.cc:174] Beginning negotiation
0926 03:37:32.958850 (+   129us) client_negotiation.cc:252] Sending NEGOTIATE NegotiatePB request
0926 03:37:33.247527 (+288677us) negotiation.cc:327] Negotiation complete: Network error: Client connection negotiation failed: client connection to 0.0.0.0:42185: BlockingRecv error: recv error from unknown peer: Transport endpoint is not connected (error 107)
Metrics: {"client-negotiator.queue_time_us":67}
W20260926 03:37:33.249119  2854 negotiation.cc:337] Failed RPC negotiation. Trace:
0926 03:37:32.961797 (+     0us) reactor.cc:625] Submitting negotiation task for client connection to 0.0.0.0:42185 (local address 127.0.0.1:43814)
0926 03:37:32.962051 (+   254us) negotiation.cc:107] Waiting for socket to connect
0926 03:37:32.962071 (+    20us) client_negotiation.cc:174] Beginning negotiation
0926 03:37:32.962217 (+   146us) client_negotiation.cc:252] Sending NEGOTIATE NegotiatePB request
0926 03:37:33.247618 (+285401us) negotiation.cc:327] Negotiation complete: Network error: Client connection negotiation failed: client connection to 0.0.0.0:42185: BlockingRecv error: recv error from unknown peer: Transport endpoint is not connected (error 107)
Metrics: {"client-negotiator.queue_time_us":66}
W20260926 03:37:33.249239  2809 negotiation.cc:337] Failed RPC negotiation. Trace:
0926 03:37:32.946811 (+     0us) reactor.cc:625] Submitting negotiation task for client connection to 0.0.0.0:42185 (local address 127.0.0.1:43770)
0926 03:37:32.946987 (+   176us) negotiation.cc:107] Waiting for socket to connect
0926 03:37:32.947008 (+    21us) client_negotiation.cc:174] Beginning negotiation
0926 03:37:32.947140 (+   132us) client_negotiation.cc:252] Sending NEGOTIATE NegotiatePB request
0926 03:37:33.247246 (+300106us) negotiation.cc:327] Negotiation complete: Network error: Client connection negotiation failed: client connection to 0.0.0.0:42185: BlockingRecv error: recv error from unknown peer: Transport endpoint is not connected (error 107)
Metrics: {"client-negotiator.queue_time_us":56}
[       OK ] Parameters/TestRpcSocketTxRxQueue.OverCapacity/0 (1075 ms)
[----------] 1 test from Parameters/TestRpcSocketTxRxQueue (1075 ms total)

[----------] Global test environment tear-down
[==========] 21 tests from 2 test suites ran. (52843 ms total)
[  PASSED  ] 20 tests.
[  FAILED  ] 1 test, listed below:
[  FAILED  ] Parameters/TestRpc.TestCallWithChainCertAndChainCA/SSL_TCP, where GetParam() = (true, false)

 1 FAILED TEST