Diagnosed failure
Parameters/TestRpc.TestCallWithChainCertAndChainCA/SSL_UnixSocket: /data0/somelongdirectorytoavoidrpathissues/src/kudu/src/kudu/rpc/rpc-test.cc:270: Failure
Failed
Bad status: Runtime error: could not verify certificate chain (error with cert: subject=CN = localhost, ST = sadfjas, C = AS, emailAddress = sdflkdsajf, O = lskdfjlsad, OU = sldfkja, issuer=C = AS, ST = ASDfkjdhf, L = lskdjf, O = saldfja, OU = skdjf, CN = localhost, emailAddress = sadjflkadsj): : certificate has expired
Google Test trace:
/data0/somelongdirectorytoavoidrpathissues/src/kudu/src/kudu/rpc/rpc-test.cc:267: Connecting to unix:/tmp/dist-test-taskUBBfL_/test-tmp/rpc-test-7927c56e7dcc4a888d67f429497c0c68.sock
I20260929 16:26:36.871726 383 test_util.cc:175] -----------------------------------------------
I20260929 16:26:36.871791 383 test_util.cc:176] Had fatal failures, leaving test files at /tmp/dist-test-taskUBBfL_/test-tmp/rpc-test.6.Parameters_TestRpc.TestCallWithChainCertAndChainCA_SSL_UnixSocket.1790699196790012-383-0
Full log
Note: This is test shard 7 of 8.
[==========] Running 21 tests from 2 test suites.
[----------] Global test environment set-up.
[----------] 20 tests from Parameters/TestRpc
[ RUN ] Parameters/TestRpc.TestMessengerCreateDestroy/SSL_UnixSocket
WARNING: Logging before InitGoogleLogging() is written to STDERR
I20260929 16:26:36.818065 383 rpc-test.cc:169] started messenger TestCreateDestroy
[ OK ] Parameters/TestRpc.TestMessengerCreateDestroy/SSL_UnixSocket (23 ms)
[ RUN ] Parameters/TestRpc.TestNegotiationDeadlock/SSL_UnixSocket
I20260929 16:26:36.827692 403 acceptor_pool.cc:254] collecting diagnostics on the listening RPC socket unix:/tmp/dist-test-taskUBBfL_/test-tmp/rpc-test-cdd10a8a137b46048e0e40f1274b4979.sock every 8 connection(s)
I20260929 16:26:36.827742 404 acceptor_pool.cc:254] collecting diagnostics on the listening RPC socket unix:/tmp/dist-test-taskUBBfL_/test-tmp/rpc-test-cdd10a8a137b46048e0e40f1274b4979.sock every 8 connection(s)
[ OK ] Parameters/TestRpc.TestNegotiationDeadlock/SSL_UnixSocket (18 ms)
[ RUN ] Parameters/TestRpc.TestCallWithChainCertAndChainCA/SSL_UnixSocket
I20260929 16:26:36.865957 419 acceptor_pool.cc:254] collecting diagnostics on the listening RPC socket unix:/tmp/dist-test-taskUBBfL_/test-tmp/rpc-test-7927c56e7dcc4a888d67f429497c0c68.sock every 8 connection(s)
I20260929 16:26:36.865979 420 acceptor_pool.cc:254] collecting diagnostics on the listening RPC socket unix:/tmp/dist-test-taskUBBfL_/test-tmp/rpc-test-7927c56e7dcc4a888d67f429497c0c68.sock every 8 connection(s)
/data0/somelongdirectorytoavoidrpathissues/src/kudu/src/kudu/rpc/rpc-test.cc:270: Failure
Failed
Bad status: Runtime error: could not verify certificate chain (error with cert: subject=CN = localhost, ST = sadfjas, C = AS, emailAddress = sdflkdsajf, O = lskdfjlsad, OU = sldfkja, issuer=C = AS, ST = ASDfkjdhf, L = lskdjf, O = saldfja, OU = skdjf, CN = localhost, emailAddress = sadjflkadsj): : certificate has expired
Google Test trace:
/data0/somelongdirectorytoavoidrpathissues/src/kudu/src/kudu/rpc/rpc-test.cc:267: Connecting to unix:/tmp/dist-test-taskUBBfL_/test-tmp/rpc-test-7927c56e7dcc4a888d67f429497c0c68.sock
I20260929 16:26:36.871726 383 test_util.cc:175] -----------------------------------------------
I20260929 16:26:36.871791 383 test_util.cc:176] Had fatal failures, leaving test files at /tmp/dist-test-taskUBBfL_/test-tmp/rpc-test.6.Parameters_TestRpc.TestCallWithChainCertAndChainCA_SSL_UnixSocket.1790699196790012-383-0
[ FAILED ] Parameters/TestRpc.TestCallWithChainCertAndChainCA/SSL_UnixSocket, where GetParam() = (true, true) (33 ms)
[ RUN ] Parameters/TestRpc.TestCallWithPasswordProtectedKey/SSL_UnixSocket
I20260929 16:26:36.878180 444 acceptor_pool.cc:254] collecting diagnostics on the listening RPC socket unix:/tmp/dist-test-taskUBBfL_/test-tmp/rpc-test-060812914c2f45759ed6a924afd79641.sock every 8 connection(s)
I20260929 16:26:36.878214 445 acceptor_pool.cc:254] collecting diagnostics on the listening RPC socket unix:/tmp/dist-test-taskUBBfL_/test-tmp/rpc-test-060812914c2f45759ed6a924afd79641.sock every 8 connection(s)
W20260929 16:26:36.891116 441 connection.cc:196] Error closing socket: Network error: TlsSocket::Close: Broken pipe
[ OK ] Parameters/TestRpc.TestCallWithPasswordProtectedKey/SSL_UnixSocket (20 ms)
[ RUN ] Parameters/TestRpc.TestCallToBadServer/SSL_UnixSocket
I20260929 16:26:36.901938 383 rpc-test.cc:394] Status: Network error: Client connection negotiation failed: client connection to 0.0.0.0:0: connect: Connection refused (error 111)
I20260929 16:26:36.902441 383 rpc-test.cc:394] Status: Network error: Client connection negotiation failed: client connection to 0.0.0.0:0: connect: Connection refused (error 111)
I20260929 16:26:36.902812 383 rpc-test.cc:394] Status: Network error: Client connection negotiation failed: client connection to 0.0.0.0:0: connect: Connection refused (error 111)
I20260929 16:26:36.903296 383 rpc-test.cc:394] Status: Network error: Client connection negotiation failed: client connection to 0.0.0.0:0: connect: Connection refused (error 111)
I20260929 16:26:36.903930 383 rpc-test.cc:394] Status: Network error: Client connection negotiation failed: client connection to 0.0.0.0:0: connect: Connection refused (error 111)
[ OK ] Parameters/TestRpc.TestCallToBadServer/SSL_UnixSocket (13 ms)
[ RUN ] Parameters/TestRpc.TestWrongService/SSL_UnixSocket
I20260929 16:26:36.925127 479 acceptor_pool.cc:254] collecting diagnostics on the listening RPC socket unix:/tmp/dist-test-taskUBBfL_/test-tmp/rpc-test-2459f1f8c0c34dd59d93f9824349c867.sock every 8 connection(s)
I20260929 16:26:36.925175 480 acceptor_pool.cc:254] collecting diagnostics on the listening RPC socket unix:/tmp/dist-test-taskUBBfL_/test-tmp/rpc-test-2459f1f8c0c34dd59d93f9824349c867.sock every 8 connection(s)
I20260929 16:26:36.945046 476 messenger.cc:345] service WrongServiceName not registered on TestServer
[ OK ] Parameters/TestRpc.TestWrongService/SSL_UnixSocket (42 ms)
[ RUN ] Parameters/TestRpc.TestConnectionKeepalive/SSL_UnixSocket
I20260929 16:26:36.962494 502 acceptor_pool.cc:254] collecting diagnostics on the listening RPC socket unix:/tmp/dist-test-taskUBBfL_/test-tmp/rpc-test-615952bc2efe4bc792fb87709e10664c.sock every 8 connection(s)
I20260929 16:26:36.962538 503 acceptor_pool.cc:254] collecting diagnostics on the listening RPC socket unix:/tmp/dist-test-taskUBBfL_/test-tmp/rpc-test-615952bc2efe4bc792fb87709e10664c.sock every 8 connection(s)
I20260929 16:26:36.962762 383 rpc-test.cc:488] Connecting to unix:/tmp/dist-test-taskUBBfL_/test-tmp/rpc-test-615952bc2efe4bc792fb87709e10664c.sock
W20260929 16:26:37.449193 515 connection.cc:196] Error closing socket: Network error: TlsSocket::Close: Broken pipe
[ OK ] Parameters/TestRpc.TestConnectionKeepalive/SSL_UnixSocket (1049 ms)
[ RUN ] Parameters/TestRpc.TestClientConnectionMetrics/SSL_UnixSocket
I20260929 16:26:38.018009 527 acceptor_pool.cc:254] collecting diagnostics on the listening RPC socket unix:/tmp/dist-test-taskUBBfL_/test-tmp/rpc-test-7b92774b267d44ad8a46629fb294d748.sock every 8 connection(s)
I20260929 16:26:38.018047 528 acceptor_pool.cc:254] collecting diagnostics on the listening RPC socket unix:/tmp/dist-test-taskUBBfL_/test-tmp/rpc-test-7b92774b267d44ad8a46629fb294d748.sock every 8 connection(s)
I20260929 16:26:38.018285 383 rpc-test.cc:569] Connecting to unix:/tmp/dist-test-taskUBBfL_/test-tmp/rpc-test-7b92774b267d44ad8a46629fb294d748.sock
[ OK ] Parameters/TestRpc.TestClientConnectionMetrics/SSL_UnixSocket (9758 ms)
[ RUN ] Parameters/TestRpc.TestCredentialsPolicy/SSL_UnixSocket
I20260929 16:26:47.780825 550 acceptor_pool.cc:254] collecting diagnostics on the listening RPC socket unix:/tmp/dist-test-taskUBBfL_/test-tmp/rpc-test-d90a9787e11c42b5a3862a5ee93789e2.sock every 8 connection(s)
I20260929 16:26:47.780860 551 acceptor_pool.cc:254] collecting diagnostics on the listening RPC socket unix:/tmp/dist-test-taskUBBfL_/test-tmp/rpc-test-d90a9787e11c42b5a3862a5ee93789e2.sock every 8 connection(s)
I20260929 16:26:47.781105 383 rpc-test.cc:700] Connecting to unix:/tmp/dist-test-taskUBBfL_/test-tmp/rpc-test-d90a9787e11c42b5a3862a5ee93789e2.sock
W20260929 16:26:47.802892 549 connection.cc:196] Error closing socket: Network error: TlsSocket::Close: Broken pipe
[ OK ] Parameters/TestRpc.TestCredentialsPolicy/SSL_UnixSocket (52 ms)
[ RUN ] Parameters/TestRpc.TestCallLongerThanKeepalive/SSL_UnixSocket
I20260929 16:26:47.820151 575 acceptor_pool.cc:254] collecting diagnostics on the listening RPC socket unix:/tmp/dist-test-taskUBBfL_/test-tmp/rpc-test-0f7ac19c38be4591b4f4cf18d88c5dec.sock every 8 connection(s)
I20260929 16:26:47.820214 576 acceptor_pool.cc:254] collecting diagnostics on the listening RPC socket unix:/tmp/dist-test-taskUBBfL_/test-tmp/rpc-test-0f7ac19c38be4591b4f4cf18d88c5dec.sock every 8 connection(s)
I20260929 16:26:47.837574 579 rpc-test-base.h:222] got call: sleep_micros: 3000000 deferred: true
I20260929 16:26:50.838433 579 rpcz_store.cc:275] Call kudu.rpc.GenericCalculatorService.Sleep from unix:<unnamed> (request call id 0) took 3000 ms. Trace:
I20260929 16:26:50.838546 579 rpcz_store.cc:276] 0929 16:26:47.837513 (+ 0us) service_pool.cc:170] Inserting onto call queue
0929 16:26:47.837556 (+ 43us) service_pool.cc:227] Handling call
0929 16:26:50.838415 (+3000859us) inbound_call.cc:173] Queueing success response
Metrics: {}
W20260929 16:26:50.839979 572 connection.cc:196] Error closing socket: Network error: TlsSocket::Close: Broken pipe
[ OK ] Parameters/TestRpc.TestCallLongerThanKeepalive/SSL_UnixSocket (3033 ms)
[ RUN ] Parameters/TestRpc.TestRpcSidecar/SSL_UnixSocket
I20260929 16:26:50.849861 600 acceptor_pool.cc:254] collecting diagnostics on the listening RPC socket unix:/tmp/dist-test-taskUBBfL_/test-tmp/rpc-test-65b8eaebf3434b418df56b640bc755f4.sock every 8 connection(s)
I20260929 16:26:50.849880 601 acceptor_pool.cc:254] collecting diagnostics on the listening RPC socket unix:/tmp/dist-test-taskUBBfL_/test-tmp/rpc-test-65b8eaebf3434b418df56b640bc755f4.sock every 8 connection(s)
W20260929 16:26:50.904794 597 connection.cc:196] Error closing socket: Network error: TlsSocket::Close: Broken pipe
[ OK ] Parameters/TestRpc.TestRpcSidecar/SSL_UnixSocket (64 ms)
[ RUN ] Parameters/TestRpc.TestRpcSidecarLimits/SSL_UnixSocket
I20260929 16:26:52.606086 625 acceptor_pool.cc:254] collecting diagnostics on the listening RPC socket unix:/tmp/dist-test-taskUBBfL_/test-tmp/rpc-test-163acbeb13e44001a209793495451f31.sock every 8 connection(s)
I20260929 16:26:52.606165 626 acceptor_pool.cc:254] collecting diagnostics on the listening RPC socket unix:/tmp/dist-test-taskUBBfL_/test-tmp/rpc-test-163acbeb13e44001a209793495451f31.sock every 8 connection(s)
W20260929 16:26:52.621169 383 serialization.cc:72] Serialized kudu.rpc_test.PushStringsRequestPB (2147483654 bytes) is larger than the maximum configured RPC message size (52428800 bytes). Sending anyway, but peer may reject the data.
W20260929 16:26:52.624567 622 connection.cc:535] server connection from unix:<unnamed> recv error: Network error: RPC frame had a length of 2147483714, but we only support messages up to 52428800 bytes long.
W20260929 16:26:52.624622 622 connection.cc:158] shutting down server connection from unix:<unnamed> with pending inbound data: 4/2147483714 bytes received; last active 0 ns ago: status Network error: RPC frame had a length of 2147483714, but we only support messages up to 52428800 bytes long.
W20260929 16:26:52.624836 638 connection.cc:196] Error closing socket: Network error: TlsSocket::Close: Broken pipe
I20260929 16:26:52.631971 650 acceptor_pool.cc:254] collecting diagnostics on the listening RPC socket unix:/tmp/dist-test-taskUBBfL_/test-tmp/rpc-test-163acbeb13e44001a209793495451f31.sock every 8 connection(s)
I20260929 16:26:52.632241 651 acceptor_pool.cc:254] collecting diagnostics on the listening RPC socket unix:/tmp/dist-test-taskUBBfL_/test-tmp/rpc-test-163acbeb13e44001a209793495451f31.sock every 8 connection(s)
W20260929 16:26:57.318192 647 connection.cc:577] server connection from unix:<unnamed>: received bad data: 'Corruption: Invalid packet: message had a length of 2147483710, but we only support messages up to 2147483647 bytes
'
W20260929 16:26:57.318516 663 connection.cc:196] Error closing socket: Network error: TlsSocket::Close: Broken pipe
[ OK ] Parameters/TestRpc.TestRpcSidecarLimits/SSL_UnixSocket (6415 ms)
[ RUN ] Parameters/TestRpc.TestCallTimeoutDoesntAffectNegotiation/SSL_UnixSocket
I20260929 16:26:57.328599 675 acceptor_pool.cc:254] collecting diagnostics on the listening RPC socket unix:/tmp/dist-test-taskUBBfL_/test-tmp/rpc-test-a0e96db461064dd89185615fc1f26e58.sock every 8 connection(s)
I20260929 16:26:57.328647 676 acceptor_pool.cc:254] collecting diagnostics on the listening RPC socket unix:/tmp/dist-test-taskUBBfL_/test-tmp/rpc-test-a0e96db461064dd89185615fc1f26e58.sock every 8 connection(s)
W20260929 16:26:57.342442 671 negotiation.cc:266] Injecting 500ms delay in negotiation
I20260929 16:26:57.392747 383 rpc-test-base.h:595] status: Timed out: connection negotiation to unix:/tmp/dist-test-taskUBBfL_/test-tmp/rpc-test-a0e96db461064dd89185615fc1f26e58.sock for RPC Sleep timed out after 0.050s (ON_OUTBOUND_QUEUE), seconds elapsed: 0.0507825
[ OK ] Parameters/TestRpc.TestCallTimeoutDoesntAffectNegotiation/SSL_UnixSocket (530 ms)
[ RUN ] Parameters/TestRpc.TestRpcHandlerLatencyMetric/SSL_UnixSocket
I20260929 16:26:57.872146 700 acceptor_pool.cc:254] collecting diagnostics on the listening RPC socket unix:/tmp/dist-test-taskUBBfL_/test-tmp/rpc-test-ac6b8c31999349da8b4b2649bbd77fa7.sock every 8 connection(s)
I20260929 16:26:57.872179 701 acceptor_pool.cc:254] collecting diagnostics on the listening RPC socket unix:/tmp/dist-test-taskUBBfL_/test-tmp/rpc-test-ac6b8c31999349da8b4b2649bbd77fa7.sock every 8 connection(s)
I20260929 16:26:57.911293 383 rpc-test.cc:1236] Sleep() min lat: 20352
I20260929 16:26:57.911360 383 rpc-test.cc:1237] Sleep() mean lat: 20352
I20260929 16:26:57.911386 383 rpc-test.cc:1238] Sleep() max lat: 20352
I20260929 16:26:57.911398 383 rpc-test.cc:1239] Sleep() #calls: 1
W20260929 16:26:57.912132 697 connection.cc:196] Error closing socket: Network error: TlsSocket::Close: Broken pipe
[ OK ] Parameters/TestRpc.TestRpcHandlerLatencyMetric/SSL_UnixSocket (61 ms)
[ RUN ] Parameters/TestRpc.TimedOutOnResponseMetricServiceQueue/SSL_UnixSocket
I20260929 16:26:57.925024 726 acceptor_pool.cc:254] collecting diagnostics on the listening RPC socket unix:/tmp/dist-test-taskUBBfL_/test-tmp/rpc-test-9adf432932d24a87a8067318e3965b08.sock every 8 connection(s)
I20260929 16:26:57.925068 727 acceptor_pool.cc:254] collecting diagnostics on the listening RPC socket unix:/tmp/dist-test-taskUBBfL_/test-tmp/rpc-test-9adf432932d24a87a8067318e3965b08.sock every 8 connection(s)
W20260929 16:26:57.986197 728 rpcz_store.cc:267] Call kudu.rpc_test.CalculatorService.Sleep from unix:<unnamed> (request call id 2) took 20 ms (client timeout 20 ms). Trace:
W20260929 16:26:57.986282 728 rpcz_store.cc:269] 0929 16:26:57.965877 (+ 0us) service_pool.cc:170] Inserting onto call queue
0929 16:26:57.986114 (+ 20237us) service_pool.cc:214] Skipping call since client already timed out
0929 16:26:57.986176 (+ 62us) inbound_call.cc:173] Queueing failure response
Metrics: {}
W20260929 16:26:57.986994 723 connection.cc:196] Error closing socket: Network error: TlsSocket::Close: Broken pipe
[ OK ] Parameters/TestRpc.TimedOutOnResponseMetricServiceQueue/SSL_UnixSocket (74 ms)
[ RUN ] Parameters/TestRpc.RpcPendingConnectionsMetric/SSL_UnixSocket
I20260929 16:26:57.989888 749 acceptor_pool.cc:254] collecting diagnostics on the listening RPC socket 0.0.0.0:45231 every 8 connection(s)
I20260929 16:26:57.989940 750 acceptor_pool.cc:254] collecting diagnostics on the listening RPC socket 0.0.0.0:45231 every 8 connection(s)
W20260929 16:26:57.999785 745 negotiation.cc:337] Failed RPC negotiation. Trace:
0929 16:26:57.999376 (+ 0us) reactor.cc:625] Submitting negotiation task for server connection from 127.0.0.1:51076 (local address 127.0.0.1:45231)
0929 16:26:57.999487 (+ 111us) server_negotiation.cc:206] Beginning negotiation
0929 16:26:57.999490 (+ 3us) server_negotiation.cc:399] Waiting for connection header
0929 16:26:57.999578 (+ 88us) negotiation.cc:327] Negotiation complete: Network error: Server connection negotiation failed: server connection from 127.0.0.1:51076: BlockingRecv error: recv got EOF from 127.0.0.1:51076 (error 108)
Metrics: {"server-negotiator.queue_time_us":40}
[ OK ] Parameters/TestRpc.RpcPendingConnectionsMetric/SSL_UnixSocket (22 ms)
[ RUN ] Parameters/TestRpc.TestRpcContextClientDeadline/SSL_UnixSocket
I20260929 16:26:58.017136 765 acceptor_pool.cc:254] collecting diagnostics on the listening RPC socket unix:/tmp/dist-test-taskUBBfL_/test-tmp/rpc-test-d06d3f7089ed4be59f04fde49cfb5c22.sock every 8 connection(s)
I20260929 16:26:58.017194 766 acceptor_pool.cc:254] collecting diagnostics on the listening RPC socket unix:/tmp/dist-test-taskUBBfL_/test-tmp/rpc-test-d06d3f7089ed4be59f04fde49cfb5c22.sock every 8 connection(s)
W20260929 16:26:58.053382 762 connection.cc:196] Error closing socket: Network error: TlsSocket::Close: Broken pipe
[ OK ] Parameters/TestRpc.TestRpcContextClientDeadline/SSL_UnixSocket (43 ms)
[ RUN ] Parameters/TestRpc.TestApplicationFeatureFlagUnsupportedServer/SSL_UnixSocket
I20260929 16:26:58.067946 790 acceptor_pool.cc:254] collecting diagnostics on the listening RPC socket unix:/tmp/dist-test-taskUBBfL_/test-tmp/rpc-test-6875bd260ad448c591b84178e047a753.sock every 8 connection(s)
I20260929 16:26:58.067981 791 acceptor_pool.cc:254] collecting diagnostics on the listening RPC socket unix:/tmp/dist-test-taskUBBfL_/test-tmp/rpc-test-6875bd260ad448c591b84178e047a753.sock every 8 connection(s)
W20260929 16:26:58.091558 787 connection.cc:196] Error closing socket: Network error: TlsSocket::Close: Broken pipe
[ OK ] Parameters/TestRpc.TestApplicationFeatureFlagUnsupportedServer/SSL_UnixSocket (37 ms)
[ RUN ] Parameters/TestRpc.TestCancellationAsync/SSL_UnixSocket
I20260929 16:26:58.122059 815 acceptor_pool.cc:254] collecting diagnostics on the listening RPC socket unix:/tmp/dist-test-taskUBBfL_/test-tmp/rpc-test-35e61e4415244979b6857f2c76838dc5.sock every 8 connection(s)
I20260929 16:26:58.122098 816 acceptor_pool.cc:254] collecting diagnostics on the listening RPC socket unix:/tmp/dist-test-taskUBBfL_/test-tmp/rpc-test-35e61e4415244979b6857f2c76838dc5.sock every 8 connection(s)
I20260929 16:26:58.122361 383 rpc-test.cc:1716] Connecting to unix:/tmp/dist-test-taskUBBfL_/test-tmp/rpc-test-35e61e4415244979b6857f2c76838dc5.sock
I20260929 16:26:58.137048 383 test_util.cc:268] Using random seed: -1496584236
I20260929 16:26:58.153898 819 rpc-test-base.h:240] got call: sleep_micros: 500 pattern: 4294967295 num_repetitions: 2097152 sidecar_idx: 0
I20260929 16:26:58.171422 818 rpc-test-base.h:240] got call: sleep_micros: 500 pattern: 4294967295 num_repetitions: 2097152 sidecar_idx: 0
I20260929 16:26:58.187824 819 rpc-test-base.h:240] got call: sleep_micros: 500 pattern: 4294967295 num_repetitions: 2097152 sidecar_idx: 0
I20260929 16:26:58.203603 818 rpc-test-base.h:240] got call: sleep_micros: 500 pattern: 4294967295 num_repetitions: 2097152 sidecar_idx: 0
I20260929 16:26:58.219584 819 rpc-test-base.h:240] got call: sleep_micros: 500 pattern: 4294967295 num_repetitions: 2097152 sidecar_idx: 0
I20260929 16:26:58.235412 818 rpc-test-base.h:240] got call: sleep_micros: 500 pattern: 4294967295 num_repetitions: 2097152 sidecar_idx: 0
I20260929 16:26:58.250725 819 rpc-test-base.h:240] got call: sleep_micros: 500 pattern: 4294967295 num_repetitions: 2097152 sidecar_idx: 0
W20260929 16:26:58.252313 812 connection.cc:196] Error closing socket: Network error: TlsSocket::Close: Broken pipe
W20260929 16:26:58.258842 812 connection.cc:441] server connection from unix:<unnamed> torn down before Call kudu.rpc.GenericCalculatorService.SleepWithSidecar from unix:<unnamed> (request call id 8) could send its response
W20260929 16:26:58.268263 812 connection.cc:441] server connection from unix:<unnamed> torn down before Call kudu.rpc.GenericCalculatorService.SleepWithSidecar from unix:<unnamed> (request call id 9) could send its response
[ OK ] Parameters/TestRpc.TestCancellationAsync/SSL_UnixSocket (176 ms)
[ RUN ] Parameters/TestRpc.TestPerformanceBySocketType/SSL_UnixSocket
I20260929 16:26:58.298044 840 acceptor_pool.cc:254] collecting diagnostics on the listening RPC socket unix:/tmp/dist-test-taskUBBfL_/test-tmp/rpc-test-55cf97ee0cb14a989e3fa316dee01e64.sock every 8 connection(s)
I20260929 16:26:58.298079 841 acceptor_pool.cc:254] collecting diagnostics on the listening RPC socket unix:/tmp/dist-test-taskUBBfL_/test-tmp/rpc-test-55cf97ee0cb14a989e3fa316dee01e64.sock every 8 connection(s)
I20260929 16:26:58.298326 383 rpc-test.cc:1846] Connecting to unix:/tmp/dist-test-taskUBBfL_/test-tmp/rpc-test-55cf97ee0cb14a989e3fa316dee01e64.sock
I20260929 16:26:59.693158 383 rpc-test.cc:1859] Sending 1024MB via ssl-enabled unix socket: real 1.387s user 1.817s sys 0.708s
I20260929 16:27:01.080425 383 rpc-test.cc:1859] Sending 1024MB via ssl-enabled unix socket: real 1.387s user 1.810s sys 0.712s
I20260929 16:27:02.519279 383 rpc-test.cc:1859] Sending 1024MB via ssl-enabled unix socket: real 1.439s user 1.877s sys 0.740s
I20260929 16:27:03.928424 383 rpc-test.cc:1859] Sending 1024MB via ssl-enabled unix socket: real 1.409s user 1.891s sys 0.670s
I20260929 16:27:05.343736 383 rpc-test.cc:1859] Sending 1024MB via ssl-enabled unix socket: real 1.415s user 1.784s sys 0.787s
W20260929 16:27:05.344543 837 connection.cc:196] Error closing socket: Network error: TlsSocket::Close: Broken pipe
[ OK ] Parameters/TestRpc.TestPerformanceBySocketType/SSL_UnixSocket (7076 ms)
[----------] 20 tests from Parameters/TestRpc (28549 ms total)
[----------] 1 test from Parameters/TestRpcSocketTxRxQueue
[ RUN ] Parameters/TestRpcSocketTxRxQueue.AcceptorRxQueueSizeMetric/0
I20260929 16:27:05.352236 865 acceptor_pool.cc:254] collecting diagnostics on the listening RPC socket 0.0.0.0:37947 every 1 connection(s)
I20260929 16:27:05.352277 866 acceptor_pool.cc:254] collecting diagnostics on the listening RPC socket 0.0.0.0:37947 every 1 connection(s)
W20260929 16:27:05.352982 861 negotiation.cc:337] Failed RPC negotiation. Trace:
0929 16:27:05.352729 (+ 0us) reactor.cc:625] Submitting negotiation task for server connection from 127.0.0.1:34946 (local address 127.0.0.1:37947)
0929 16:27:05.352821 (+ 92us) server_negotiation.cc:206] Beginning negotiation
0929 16:27:05.352824 (+ 3us) server_negotiation.cc:399] Waiting for connection header
0929 16:27:05.352915 (+ 91us) negotiation.cc:327] Negotiation complete: Network error: Server connection negotiation failed: server connection from 127.0.0.1:34946: BlockingRecv error: recv got EOF from 127.0.0.1:34946 (error 108)
Metrics: {"server-negotiator.queue_time_us":31}
[ OK ] Parameters/TestRpcSocketTxRxQueue.AcceptorRxQueueSizeMetric/0 (9 ms)
[----------] 1 test from Parameters/TestRpcSocketTxRxQueue (9 ms total)
[----------] Global test environment tear-down
[==========] 21 tests from 2 test suites ran. (28558 ms total)
[ PASSED ] 20 tests.
[ FAILED ] 1 test, listed below:
[ FAILED ] Parameters/TestRpc.TestCallWithChainCertAndChainCA/SSL_UnixSocket, where GetParam() = (true, true)
1 FAILED TEST