Diagnosed failure
Parameters/TestRpc.TestCallWithChainCertAndChainCA/SSL_TCP: /data0/somelongdirectorytoavoidrpathissues/src/kudu/src/kudu/rpc/rpc-test.cc:270: Failure
Failed
Bad status: Runtime error: could not verify certificate chain (error with cert: subject=CN = localhost, ST = sadfjas, C = AS, emailAddress = sdflkdsajf, O = lskdfjlsad, OU = sldfkja, issuer=C = AS, ST = ASDfkjdhf, L = lskdjf, O = saldfja, OU = skdjf, CN = localhost, emailAddress = sadjflkadsj): : certificate has expired
Google Test trace:
/data0/somelongdirectorytoavoidrpathissues/src/kudu/src/kudu/rpc/rpc-test.cc:267: Connecting to 0.0.0.0:37305
I20260928 02:58:35.532781 12184 test_util.cc:175] -----------------------------------------------
I20260928 02:58:35.532892 12184 test_util.cc:176] Had fatal failures, leaving test files at /tmp/dist-test-task_xEv0j/test-tmp/rpc-test.5.Parameters_TestRpc.TestCallWithChainCertAndChainCA_SSL_TCP.1790564315414064-12184-0
Full log
Note: This is test shard 6 of 8.
[==========] Running 21 tests from 2 test suites.
[----------] Global test environment set-up.
[----------] 20 tests from Parameters/TestRpc
[ RUN ] Parameters/TestRpc.TestMessengerCreateDestroy/SSL_TCP
WARNING: Logging before InitGoogleLogging() is written to STDERR
I20260928 02:58:35.457890 12184 rpc-test.cc:169] started messenger TestCreateDestroy
[ OK ] Parameters/TestRpc.TestMessengerCreateDestroy/SSL_TCP (28 ms)
[ RUN ] Parameters/TestRpc.TestNegotiationDeadlock/SSL_TCP
I20260928 02:58:35.487028 12204 acceptor_pool.cc:254] collecting diagnostics on the listening RPC socket 0.0.0.0:34933 every 8 connection(s)
I20260928 02:58:35.487252 12205 acceptor_pool.cc:254] collecting diagnostics on the listening RPC socket 0.0.0.0:34933 every 8 connection(s)
[ OK ] Parameters/TestRpc.TestNegotiationDeadlock/SSL_TCP (45 ms)
[ RUN ] Parameters/TestRpc.TestCallWithChainCertAndChainCA/SSL_TCP
I20260928 02:58:35.521842 12220 acceptor_pool.cc:254] collecting diagnostics on the listening RPC socket 0.0.0.0:37305 every 8 connection(s)
I20260928 02:58:35.522157 12221 acceptor_pool.cc:254] collecting diagnostics on the listening RPC socket 0.0.0.0:37305 every 8 connection(s)
/data0/somelongdirectorytoavoidrpathissues/src/kudu/src/kudu/rpc/rpc-test.cc:270: Failure
Failed
Bad status: Runtime error: could not verify certificate chain (error with cert: subject=CN = localhost, ST = sadfjas, C = AS, emailAddress = sdflkdsajf, O = lskdfjlsad, OU = sldfkja, issuer=C = AS, ST = ASDfkjdhf, L = lskdjf, O = saldfja, OU = skdjf, CN = localhost, emailAddress = sadjflkadsj): : certificate has expired
Google Test trace:
/data0/somelongdirectorytoavoidrpathissues/src/kudu/src/kudu/rpc/rpc-test.cc:267: Connecting to 0.0.0.0:37305
I20260928 02:58:35.532781 12184 test_util.cc:175] -----------------------------------------------
I20260928 02:58:35.532892 12184 test_util.cc:176] Had fatal failures, leaving test files at /tmp/dist-test-task_xEv0j/test-tmp/rpc-test.5.Parameters_TestRpc.TestCallWithChainCertAndChainCA_SSL_TCP.1790564315414064-12184-0
[ FAILED ] Parameters/TestRpc.TestCallWithChainCertAndChainCA/SSL_TCP, where GetParam() = (true, false) (26 ms)
[ RUN ] Parameters/TestRpc.TestCallWithPasswordProtectedKey/SSL_TCP
I20260928 02:58:35.559722 12245 acceptor_pool.cc:254] collecting diagnostics on the listening RPC socket 0.0.0.0:35333 every 8 connection(s)
I20260928 02:58:35.559957 12246 acceptor_pool.cc:254] collecting diagnostics on the listening RPC socket 0.0.0.0:35333 every 8 connection(s)
[ OK ] Parameters/TestRpc.TestCallWithPasswordProtectedKey/SSL_TCP (60 ms)
[ RUN ] Parameters/TestRpc.TestCallToBadServer/SSL_TCP
I20260928 02:58:35.627946 12184 rpc-test.cc:394] Status: Network error: Client connection negotiation failed: client connection to 0.0.0.0:0: connect: Connection refused (error 111)
I20260928 02:58:35.628633 12184 rpc-test.cc:394] Status: Network error: Client connection negotiation failed: client connection to 0.0.0.0:0: connect: Connection refused (error 111)
I20260928 02:58:35.629177 12184 rpc-test.cc:394] Status: Network error: Client connection negotiation failed: client connection to 0.0.0.0:0: connect: Connection refused (error 111)
I20260928 02:58:35.629701 12184 rpc-test.cc:394] Status: Network error: Client connection negotiation failed: client connection to 0.0.0.0:0: connect: Connection refused (error 111)
I20260928 02:58:35.630231 12184 rpc-test.cc:394] Status: Network error: Client connection negotiation failed: client connection to 0.0.0.0:0: connect: Connection refused (error 111)
[ OK ] Parameters/TestRpc.TestCallToBadServer/SSL_TCP (38 ms)
[ RUN ] Parameters/TestRpc.TestWrongService/SSL_TCP
I20260928 02:58:35.646692 12280 acceptor_pool.cc:254] collecting diagnostics on the listening RPC socket 0.0.0.0:43361 every 8 connection(s)
I20260928 02:58:35.646968 12281 acceptor_pool.cc:254] collecting diagnostics on the listening RPC socket 0.0.0.0:43361 every 8 connection(s)
I20260928 02:58:35.709523 12279 messenger.cc:345] service WrongServiceName not registered on TestServer
[ OK ] Parameters/TestRpc.TestWrongService/SSL_TCP (82 ms)
[ RUN ] Parameters/TestRpc.TestConnectionKeepalive/SSL_TCP
I20260928 02:58:35.737721 12303 acceptor_pool.cc:254] collecting diagnostics on the listening RPC socket 0.0.0.0:43983 every 8 connection(s)
I20260928 02:58:35.737947 12304 acceptor_pool.cc:254] collecting diagnostics on the listening RPC socket 0.0.0.0:43983 every 8 connection(s)
I20260928 02:58:35.738773 12184 rpc-test.cc:488] Connecting to 0.0.0.0:43983
[ OK ] Parameters/TestRpc.TestConnectionKeepalive/SSL_TCP (1059 ms)
[ RUN ] Parameters/TestRpc.TestClientConnectionMetrics/SSL_TCP
I20260928 02:58:36.790477 12328 acceptor_pool.cc:254] collecting diagnostics on the listening RPC socket 0.0.0.0:46169 every 8 connection(s)
I20260928 02:58:36.790737 12329 acceptor_pool.cc:254] collecting diagnostics on the listening RPC socket 0.0.0.0:46169 every 8 connection(s)
I20260928 02:58:36.791651 12184 rpc-test.cc:569] Connecting to 0.0.0.0:46169
[ OK ] Parameters/TestRpc.TestClientConnectionMetrics/SSL_TCP (19209 ms)
[ RUN ] Parameters/TestRpc.TestCredentialsPolicy/SSL_TCP
I20260928 02:58:55.995476 12351 acceptor_pool.cc:254] collecting diagnostics on the listening RPC socket 0.0.0.0:38431 every 8 connection(s)
I20260928 02:58:55.995702 12352 acceptor_pool.cc:254] collecting diagnostics on the listening RPC socket 0.0.0.0:38431 every 8 connection(s)
I20260928 02:58:55.996601 12184 rpc-test.cc:700] Connecting to 0.0.0.0:38431
[ OK ] Parameters/TestRpc.TestCredentialsPolicy/SSL_TCP (60 ms)
[ RUN ] Parameters/TestRpc.TestCallLongerThanKeepalive/SSL_TCP
I20260928 02:58:56.070397 12376 acceptor_pool.cc:254] collecting diagnostics on the listening RPC socket 0.0.0.0:38037 every 8 connection(s)
I20260928 02:58:56.070640 12377 acceptor_pool.cc:254] collecting diagnostics on the listening RPC socket 0.0.0.0:38037 every 8 connection(s)
I20260928 02:58:56.093322 12380 rpc-test-base.h:222] got call: sleep_micros: 3000000 deferred: true
I20260928 02:58:59.095048 12380 rpcz_store.cc:275] Call kudu.rpc.GenericCalculatorService.Sleep from 127.0.0.1:37270 (request call id 0) took 3001 ms. Trace:
I20260928 02:58:59.095250 12380 rpcz_store.cc:276] 0928 02:58:56.093199 (+ 0us) service_pool.cc:170] Inserting onto call queue
0928 02:58:56.093258 (+ 59us) service_pool.cc:227] Handling call
0928 02:58:59.095002 (+3001744us) inbound_call.cc:173] Queueing success response
Metrics: {}
[ OK ] Parameters/TestRpc.TestCallLongerThanKeepalive/SSL_TCP (3056 ms)
[ RUN ] Parameters/TestRpc.TestRpcSidecar/SSL_TCP
I20260928 02:58:59.109584 12401 acceptor_pool.cc:254] collecting diagnostics on the listening RPC socket 0.0.0.0:40711 every 8 connection(s)
I20260928 02:58:59.109846 12402 acceptor_pool.cc:254] collecting diagnostics on the listening RPC socket 0.0.0.0:40711 every 8 connection(s)
[ OK ] Parameters/TestRpc.TestRpcSidecar/SSL_TCP (97 ms)
[ RUN ] Parameters/TestRpc.TestRpcSidecarLimits/SSL_TCP
I20260928 02:59:01.201484 12426 acceptor_pool.cc:254] collecting diagnostics on the listening RPC socket 0.0.0.0:44427 every 8 connection(s)
I20260928 02:59:01.201731 12427 acceptor_pool.cc:254] collecting diagnostics on the listening RPC socket 0.0.0.0:44427 every 8 connection(s)
W20260928 02:59:01.220440 12184 serialization.cc:72] Serialized kudu.rpc_test.PushStringsRequestPB (2147483654 bytes) is larger than the maximum configured RPC message size (52428800 bytes). Sending anyway, but peer may reject the data.
W20260928 02:59:01.226429 12425 connection.cc:535] server connection from 127.0.0.1:58664 recv error: Network error: RPC frame had a length of 2147483714, but we only support messages up to 52428800 bytes long.
W20260928 02:59:01.226547 12425 connection.cc:158] shutting down server connection from 127.0.0.1:58664 with pending inbound data: 4/2147483714 bytes received; last active 0 ns ago: status Network error: RPC frame had a length of 2147483714, but we only support messages up to 52428800 bytes long.
W20260928 02:59:01.227048 12439 connection.cc:196] Error closing socket: Network error: TlsSocket::Close: Connection reset by peer
I20260928 02:59:01.241647 12451 acceptor_pool.cc:254] collecting diagnostics on the listening RPC socket 0.0.0.0:39543 every 8 connection(s)
I20260928 02:59:01.241797 12452 acceptor_pool.cc:254] collecting diagnostics on the listening RPC socket 0.0.0.0:39543 every 8 connection(s)
W20260928 02:59:06.622563 12450 connection.cc:577] server connection from 127.0.0.1:37024: received bad data: 'Corruption: Invalid packet: message had a length of 2147483710, but we only support messages up to 2147483647 bytes
'
[ OK ] Parameters/TestRpc.TestRpcSidecarLimits/SSL_TCP (7876 ms)
[ RUN ] Parameters/TestRpc.TestCallTimeoutDoesntAffectNegotiation/SSL_TCP
I20260928 02:59:07.088379 12476 acceptor_pool.cc:254] collecting diagnostics on the listening RPC socket 0.0.0.0:38873 every 8 connection(s)
I20260928 02:59:07.088658 12477 acceptor_pool.cc:254] collecting diagnostics on the listening RPC socket 0.0.0.0:38873 every 8 connection(s)
W20260928 02:59:07.098513 12472 negotiation.cc:266] Injecting 500ms delay in negotiation
I20260928 02:59:07.148972 12184 rpc-test-base.h:595] status: Timed out: connection negotiation to 0.0.0.0:38873 for RPC Sleep timed out after 0.050s (ON_OUTBOUND_QUEUE), seconds elapsed: 0.0510644
[ OK ] Parameters/TestRpc.TestCallTimeoutDoesntAffectNegotiation/SSL_TCP (533 ms)
[ RUN ] Parameters/TestRpc.TestRpcHandlerLatencyMetric/SSL_TCP
I20260928 02:59:07.628871 12501 acceptor_pool.cc:254] collecting diagnostics on the listening RPC socket 0.0.0.0:34585 every 8 connection(s)
I20260928 02:59:07.629093 12502 acceptor_pool.cc:254] collecting diagnostics on the listening RPC socket 0.0.0.0:34585 every 8 connection(s)
I20260928 02:59:07.675460 12184 rpc-test.cc:1236] Sleep() min lat: 20693
I20260928 02:59:07.675566 12184 rpc-test.cc:1237] Sleep() mean lat: 20693
I20260928 02:59:07.675617 12184 rpc-test.cc:1238] Sleep() max lat: 20693
I20260928 02:59:07.675655 12184 rpc-test.cc:1239] Sleep() #calls: 1
[ OK ] Parameters/TestRpc.TestRpcHandlerLatencyMetric/SSL_TCP (72 ms)
[ RUN ] Parameters/TestRpc.TimedOutOnResponseMetricServiceQueue/SSL_TCP
I20260928 02:59:07.696125 12527 acceptor_pool.cc:254] collecting diagnostics on the listening RPC socket 0.0.0.0:41523 every 8 connection(s)
I20260928 02:59:07.696336 12528 acceptor_pool.cc:254] collecting diagnostics on the listening RPC socket 0.0.0.0:41523 every 8 connection(s)
W20260928 02:59:07.764127 12529 rpcz_store.cc:267] Call kudu.rpc_test.CalculatorService.Sleep from 127.0.0.1:51294 (request call id 2) took 20 ms (client timeout 20 ms). Trace:
W20260928 02:59:07.764271 12529 rpcz_store.cc:269] 0928 02:59:07.743602 (+ 0us) service_pool.cc:170] Inserting onto call queue
0928 02:59:07.764049 (+ 20447us) service_pool.cc:214] Skipping call since client already timed out
0928 02:59:07.764103 (+ 54us) inbound_call.cc:173] Queueing failure response
Metrics: {}
[ OK ] Parameters/TestRpc.TimedOutOnResponseMetricServiceQueue/SSL_TCP (88 ms)
[ RUN ] Parameters/TestRpc.RpcPendingConnectionsMetric/SSL_TCP
I20260928 02:59:07.772874 12550 acceptor_pool.cc:254] collecting diagnostics on the listening RPC socket 0.0.0.0:44119 every 8 connection(s)
I20260928 02:59:07.773108 12551 acceptor_pool.cc:254] collecting diagnostics on the listening RPC socket 0.0.0.0:44119 every 8 connection(s)
W20260928 02:59:07.775090 12546 negotiation.cc:337] Failed RPC negotiation. Trace:
0928 02:59:07.774413 (+ 0us) reactor.cc:625] Submitting negotiation task for server connection from 127.0.0.1:44174 (local address 127.0.0.1:44119)
0928 02:59:07.774555 (+ 142us) server_negotiation.cc:206] Beginning negotiation
0928 02:59:07.774559 (+ 4us) server_negotiation.cc:399] Waiting for connection header
0928 02:59:07.774702 (+ 143us) negotiation.cc:327] Negotiation complete: Network error: Server connection negotiation failed: server connection from 127.0.0.1:44174: BlockingRecv error: recv got EOF from 127.0.0.1:44174 (error 108)
Metrics: {"server-negotiator.queue_time_us":41}
[ OK ] Parameters/TestRpc.RpcPendingConnectionsMetric/SSL_TCP (18 ms)
[ RUN ] Parameters/TestRpc.TestRpcContextClientDeadline/SSL_TCP
I20260928 02:59:07.818667 12566 acceptor_pool.cc:254] collecting diagnostics on the listening RPC socket 0.0.0.0:42337 every 8 connection(s)
I20260928 02:59:07.818913 12567 acceptor_pool.cc:254] collecting diagnostics on the listening RPC socket 0.0.0.0:42337 every 8 connection(s)
[ OK ] Parameters/TestRpc.TestRpcContextClientDeadline/SSL_TCP (72 ms)
[ RUN ] Parameters/TestRpc.TestApplicationFeatureFlagUnsupportedServer/SSL_TCP
I20260928 02:59:07.877287 12591 acceptor_pool.cc:254] collecting diagnostics on the listening RPC socket 0.0.0.0:46589 every 8 connection(s)
I20260928 02:59:07.877501 12592 acceptor_pool.cc:254] collecting diagnostics on the listening RPC socket 0.0.0.0:46589 every 8 connection(s)
[ OK ] Parameters/TestRpc.TestApplicationFeatureFlagUnsupportedServer/SSL_TCP (42 ms)
[ RUN ] Parameters/TestRpc.TestCancellationAsync/SSL_TCP
I20260928 02:59:07.911788 12616 acceptor_pool.cc:254] collecting diagnostics on the listening RPC socket 0.0.0.0:35081 every 8 connection(s)
I20260928 02:59:07.912040 12617 acceptor_pool.cc:254] collecting diagnostics on the listening RPC socket 0.0.0.0:35081 every 8 connection(s)
I20260928 02:59:07.912762 12184 rpc-test.cc:1716] Connecting to 0.0.0.0:35081
I20260928 02:59:07.936967 12184 test_util.cc:268] Using random seed: 1072169131
I20260928 02:59:07.970606 12620 rpc-test-base.h:240] got call: sleep_micros: 500 pattern: 4294967295 num_repetitions: 2097152 sidecar_idx: 0
I20260928 02:59:07.989915 12619 rpc-test-base.h:240] got call: sleep_micros: 500 pattern: 4294967295 num_repetitions: 2097152 sidecar_idx: 0
I20260928 02:59:08.014161 12618 rpc-test-base.h:240] got call: sleep_micros: 500 pattern: 4294967295 num_repetitions: 2097152 sidecar_idx: 0
I20260928 02:59:08.046999 12620 rpc-test-base.h:240] got call: sleep_micros: 500 pattern: 4294967295 num_repetitions: 2097152 sidecar_idx: 0
I20260928 02:59:08.063979 12619 rpc-test-base.h:240] got call: sleep_micros: 500 pattern: 4294967295 num_repetitions: 2097152 sidecar_idx: 0
I20260928 02:59:08.111903 12618 rpc-test-base.h:240] got call: sleep_micros: 500 pattern: 4294967295 num_repetitions: 2097152 sidecar_idx: 0
W20260928 02:59:08.136693 12614 connection.cc:535] server connection from 127.0.0.1:60178 recv error: Network error: failed to read from TLS socket (remote: unknown): Connection reset by peer (error 104)
W20260928 02:59:08.136838 12614 connection.cc:158] shutting down server connection from 127.0.0.1:60178 with pending inbound data: 7651413/8388693 bytes received; last active 0 ns ago: status Network error: failed to read from TLS socket (remote: unknown): Connection reset by peer (error 104)
W20260928 02:59:08.137111 12614 connection.cc:196] Error closing socket: Network error: TlsSocket::Close: Broken pipe
W20260928 02:59:08.150173 12614 connection.cc:441] server connection from 127.0.0.1:60178 torn down before Call kudu.rpc.GenericCalculatorService.SleepWithSidecar from 127.0.0.1:60178 (request call id 8) could send its response
[ OK ] Parameters/TestRpc.TestCancellationAsync/SSL_TCP (250 ms)
[ RUN ] Parameters/TestRpc.TestPerformanceBySocketType/SSL_TCP
I20260928 02:59:08.179162 12641 acceptor_pool.cc:254] collecting diagnostics on the listening RPC socket 0.0.0.0:36737 every 8 connection(s)
I20260928 02:59:08.179409 12642 acceptor_pool.cc:254] collecting diagnostics on the listening RPC socket 0.0.0.0:36737 every 8 connection(s)
I20260928 02:59:08.180258 12184 rpc-test.cc:1846] Connecting to 0.0.0.0:36737
I20260928 02:59:10.960673 12184 rpc-test.cc:1859] Sending 1024MB via ssl-enabled tcp socket: real 2.756s user 2.502s sys 2.027s
I20260928 02:59:13.760389 12184 rpc-test.cc:1859] Sending 1024MB via ssl-enabled tcp socket: real 2.800s user 2.630s sys 1.982s
I20260928 02:59:16.694798 12184 rpc-test.cc:1859] Sending 1024MB via ssl-enabled tcp socket: real 2.934s user 2.831s sys 2.049s
I20260928 02:59:19.453464 12184 rpc-test.cc:1859] Sending 1024MB via ssl-enabled tcp socket: real 2.758s user 2.393s sys 2.158s
I20260928 02:59:22.288204 12184 rpc-test.cc:1859] Sending 1024MB via ssl-enabled tcp socket: real 2.835s user 2.489s sys 2.207s
[ OK ] Parameters/TestRpc.TestPerformanceBySocketType/SSL_TCP (14142 ms)
[----------] 20 tests from Parameters/TestRpc (46863 ms total)
[----------] 1 test from Parameters/TestRpcSocketTxRxQueue
[ RUN ] Parameters/TestRpcSocketTxRxQueue.OverCapacity/0
W20260928 02:59:22.594736 12658 negotiation.cc:337] Failed RPC negotiation. Trace:
0928 02:59:22.304694 (+ 0us) reactor.cc:625] Submitting negotiation task for client connection to 0.0.0.0:39739 (local address 127.0.0.1:42250)
0928 02:59:22.304902 (+ 208us) negotiation.cc:107] Waiting for socket to connect
0928 02:59:22.304917 (+ 15us) client_negotiation.cc:174] Beginning negotiation
0928 02:59:22.305051 (+ 134us) client_negotiation.cc:252] Sending NEGOTIATE NegotiatePB request
0928 02:59:22.594380 (+289329us) negotiation.cc:327] Negotiation complete: Network error: Client connection negotiation failed: client connection to 0.0.0.0:39739: BlockingRecv error: recv error from unknown peer: Transport endpoint is not connected (error 107)
Metrics: {"client-negotiator.queue_time_us":45}
W20260928 02:59:22.594903 12667 negotiation.cc:337] Failed RPC negotiation. Trace:
0928 02:59:22.306949 (+ 0us) reactor.cc:625] Submitting negotiation task for client connection to 0.0.0.0:39739 (local address 127.0.0.1:42262)
0928 02:59:22.307133 (+ 184us) negotiation.cc:107] Waiting for socket to connect
0928 02:59:22.307146 (+ 13us) client_negotiation.cc:174] Beginning negotiation
0928 02:59:22.307228 (+ 82us) client_negotiation.cc:252] Sending NEGOTIATE NegotiatePB request
0928 02:59:22.594553 (+287325us) negotiation.cc:327] Negotiation complete: Network error: Client connection negotiation failed: client connection to 0.0.0.0:39739: BlockingRecv error: recv error from unknown peer: Transport endpoint is not connected (error 107)
Metrics: {"client-negotiator.queue_time_us":45}
W20260928 02:59:22.595121 12676 negotiation.cc:337] Failed RPC negotiation. Trace:
0928 02:59:22.309511 (+ 0us) reactor.cc:625] Submitting negotiation task for client connection to 0.0.0.0:39739 (local address 127.0.0.1:42270)
0928 02:59:22.309707 (+ 196us) negotiation.cc:107] Waiting for socket to connect
0928 02:59:22.309725 (+ 18us) client_negotiation.cc:174] Beginning negotiation
0928 02:59:22.309822 (+ 97us) client_negotiation.cc:252] Sending NEGOTIATE NegotiatePB request
0928 02:59:22.594571 (+284749us) negotiation.cc:327] Negotiation complete: Network error: Client connection negotiation failed: client connection to 0.0.0.0:39739: BlockingRecv error: recv error from unknown peer: Transport endpoint is not connected (error 107)
Metrics: {"client-negotiator.queue_time_us":53}
W20260928 02:59:22.595243 12703 negotiation.cc:337] Failed RPC negotiation. Trace:
0928 02:59:22.317716 (+ 0us) reactor.cc:625] Submitting negotiation task for client connection to 0.0.0.0:39739 (local address 127.0.0.1:42294)
0928 02:59:22.317894 (+ 178us) negotiation.cc:107] Waiting for socket to connect
0928 02:59:22.317959 (+ 65us) client_negotiation.cc:174] Beginning negotiation
0928 02:59:22.318053 (+ 94us) client_negotiation.cc:252] Sending NEGOTIATE NegotiatePB request
0928 02:59:22.594974 (+276921us) negotiation.cc:327] Negotiation complete: Network error: Client connection negotiation failed: client connection to 0.0.0.0:39739: BlockingRecv error: recv error from unknown peer: Transport endpoint is not connected (error 107)
Metrics: {"client-negotiator.queue_time_us":55}
W20260928 02:59:22.595618 12685 negotiation.cc:337] Failed RPC negotiation. Trace:
0928 02:59:22.312203 (+ 0us) reactor.cc:625] Submitting negotiation task for client connection to 0.0.0.0:39739 (local address 127.0.0.1:42278)
0928 02:59:22.312412 (+ 209us) negotiation.cc:107] Waiting for socket to connect
0928 02:59:22.312427 (+ 15us) client_negotiation.cc:174] Beginning negotiation
0928 02:59:22.312533 (+ 106us) client_negotiation.cc:252] Sending NEGOTIATE NegotiatePB request
0928 02:59:22.594380 (+281847us) negotiation.cc:327] Negotiation complete: Network error: Client connection negotiation failed: client connection to 0.0.0.0:39739: BlockingRecv error: recv error from unknown peer: Transport endpoint is not connected (error 107)
Metrics: {"client-negotiator.queue_time_us":66}
W20260928 02:59:22.595924 12694 negotiation.cc:337] Failed RPC negotiation. Trace:
0928 02:59:22.314860 (+ 0us) reactor.cc:625] Submitting negotiation task for client connection to 0.0.0.0:39739 (local address 127.0.0.1:42282)
0928 02:59:22.315040 (+ 180us) negotiation.cc:107] Waiting for socket to connect
0928 02:59:22.315054 (+ 14us) client_negotiation.cc:174] Beginning negotiation
0928 02:59:22.315164 (+ 110us) client_negotiation.cc:252] Sending NEGOTIATE NegotiatePB request
0928 02:59:22.594691 (+279527us) negotiation.cc:327] Negotiation complete: Network error: Client connection negotiation failed: client connection to 0.0.0.0:39739: BlockingRecv error: recv error from unknown peer: Transport endpoint is not connected (error 107)
Metrics: {"client-negotiator.queue_time_us":91}
[ OK ] Parameters/TestRpcSocketTxRxQueue.OverCapacity/0 (1071 ms)
[----------] 1 test from Parameters/TestRpcSocketTxRxQueue (1071 ms total)
[----------] Global test environment tear-down
[==========] 21 tests from 2 test suites ran. (47934 ms total)
[ PASSED ] 20 tests.
[ FAILED ] 1 test, listed below:
[ FAILED ] Parameters/TestRpc.TestCallWithChainCertAndChainCA/SSL_TCP, where GetParam() = (true, false)
1 FAILED TEST