Diagnosed failure

Parameters/TestRpc.TestCallWithChainCertAndChainCA/SSL_UnixSocket: /data0/somelongdirectorytoavoidrpathissues/src/kudu/src/kudu/rpc/rpc-test.cc:270: Failure
Failed
Bad status: Runtime error: could not verify certificate chain (error with cert: subject=CN = localhost, ST = sadfjas, C = AS, emailAddress = sdflkdsajf, O = lskdfjlsad, OU = sldfkja, issuer=C = AS, ST = ASDfkjdhf, L = lskdjf, O = saldfja, OU = skdjf, CN = localhost, emailAddress = sadjflkadsj): : certificate has expired
Google Test trace:
/data0/somelongdirectorytoavoidrpathissues/src/kudu/src/kudu/rpc/rpc-test.cc:267: Connecting to unix:/tmp/dist-test-taskYIDsjb/test-tmp/rpc-test-1dfc869627164462bc5eed327b722e69.sock
I20260929 14:21:06.630430 11569 test_util.cc:175] -----------------------------------------------
I20260929 14:21:06.630612 11569 test_util.cc:176] Had fatal failures, leaving test files at /tmp/dist-test-taskYIDsjb/test-tmp/rpc-test.6.Parameters_TestRpc.TestCallWithChainCertAndChainCA_SSL_UnixSocket.1790691665350688-11569-0

Full log

Note: This is test shard 7 of 8.
[==========] Running 21 tests from 2 test suites.
[----------] Global test environment set-up.
[----------] 20 tests from Parameters/TestRpc
[ RUN      ] Parameters/TestRpc.TestMessengerCreateDestroy/SSL_UnixSocket
WARNING: Logging before InitGoogleLogging() is written to STDERR
I20260929 14:21:05.454910 11569 rpc-test.cc:169] started messenger TestCreateDestroy
[       OK ] Parameters/TestRpc.TestMessengerCreateDestroy/SSL_UnixSocket (1093 ms)
[ RUN      ] Parameters/TestRpc.TestNegotiationDeadlock/SSL_UnixSocket
I20260929 14:21:06.520083 11591 acceptor_pool.cc:254] collecting diagnostics on the listening RPC socket unix:/tmp/dist-test-taskYIDsjb/test-tmp/rpc-test-bb41c1ccac27474b9bbd3f2bdece50c1.sock every 8 connection(s)
I20260929 14:21:06.521459 11592 acceptor_pool.cc:254] collecting diagnostics on the listening RPC socket unix:/tmp/dist-test-taskYIDsjb/test-tmp/rpc-test-bb41c1ccac27474b9bbd3f2bdece50c1.sock every 8 connection(s)
[       OK ] Parameters/TestRpc.TestNegotiationDeadlock/SSL_UnixSocket (66 ms)
[ RUN      ] Parameters/TestRpc.TestCallWithChainCertAndChainCA/SSL_UnixSocket
I20260929 14:21:06.584127 11607 acceptor_pool.cc:254] collecting diagnostics on the listening RPC socket unix:/tmp/dist-test-taskYIDsjb/test-tmp/rpc-test-1dfc869627164462bc5eed327b722e69.sock every 8 connection(s)
I20260929 14:21:06.586216 11608 acceptor_pool.cc:254] collecting diagnostics on the listening RPC socket unix:/tmp/dist-test-taskYIDsjb/test-tmp/rpc-test-1dfc869627164462bc5eed327b722e69.sock every 8 connection(s)
/data0/somelongdirectorytoavoidrpathissues/src/kudu/src/kudu/rpc/rpc-test.cc:270: Failure
Failed
Bad status: Runtime error: could not verify certificate chain (error with cert: subject=CN = localhost, ST = sadfjas, C = AS, emailAddress = sdflkdsajf, O = lskdfjlsad, OU = sldfkja, issuer=C = AS, ST = ASDfkjdhf, L = lskdjf, O = saldfja, OU = skdjf, CN = localhost, emailAddress = sadjflkadsj): : certificate has expired
Google Test trace:
/data0/somelongdirectorytoavoidrpathissues/src/kudu/src/kudu/rpc/rpc-test.cc:267: Connecting to unix:/tmp/dist-test-taskYIDsjb/test-tmp/rpc-test-1dfc869627164462bc5eed327b722e69.sock
I20260929 14:21:06.630430 11569 test_util.cc:175] -----------------------------------------------
I20260929 14:21:06.630612 11569 test_util.cc:176] Had fatal failures, leaving test files at /tmp/dist-test-taskYIDsjb/test-tmp/rpc-test.6.Parameters_TestRpc.TestCallWithChainCertAndChainCA_SSL_UnixSocket.1790691665350688-11569-0
[  FAILED  ] Parameters/TestRpc.TestCallWithChainCertAndChainCA/SSL_UnixSocket, where GetParam() = (true, true) (65 ms)
[ RUN      ] Parameters/TestRpc.TestCallWithPasswordProtectedKey/SSL_UnixSocket
I20260929 14:21:06.659226 11632 acceptor_pool.cc:254] collecting diagnostics on the listening RPC socket unix:/tmp/dist-test-taskYIDsjb/test-tmp/rpc-test-d658c2fa3eaf4333abade9b1d20c3d3a.sock every 8 connection(s)
I20260929 14:21:06.659914 11633 acceptor_pool.cc:254] collecting diagnostics on the listening RPC socket unix:/tmp/dist-test-taskYIDsjb/test-tmp/rpc-test-d658c2fa3eaf4333abade9b1d20c3d3a.sock every 8 connection(s)
[       OK ] Parameters/TestRpc.TestCallWithPasswordProtectedKey/SSL_UnixSocket (74 ms)
[ RUN      ] Parameters/TestRpc.TestCallToBadServer/SSL_UnixSocket
I20260929 14:21:06.731065 11569 rpc-test.cc:394] Status: Network error: Client connection negotiation failed: client connection to 0.0.0.0:0: connect: Connection refused (error 111)
I20260929 14:21:06.732086 11569 rpc-test.cc:394] Status: Network error: Client connection negotiation failed: client connection to 0.0.0.0:0: connect: Connection refused (error 111)
I20260929 14:21:06.733101 11569 rpc-test.cc:394] Status: Network error: Client connection negotiation failed: client connection to 0.0.0.0:0: connect: Connection refused (error 111)
I20260929 14:21:06.734205 11569 rpc-test.cc:394] Status: Network error: Client connection negotiation failed: client connection to 0.0.0.0:0: connect: Connection refused (error 111)
I20260929 14:21:06.735337 11569 rpc-test.cc:394] Status: Network error: Client connection negotiation failed: client connection to 0.0.0.0:0: connect: Connection refused (error 111)
[       OK ] Parameters/TestRpc.TestCallToBadServer/SSL_UnixSocket (32 ms)
[ RUN      ] Parameters/TestRpc.TestWrongService/SSL_UnixSocket
I20260929 14:21:06.753451 11667 acceptor_pool.cc:254] collecting diagnostics on the listening RPC socket unix:/tmp/dist-test-taskYIDsjb/test-tmp/rpc-test-c42bddcce4c3466cbf0d94d6c0dec4de.sock every 8 connection(s)
I20260929 14:21:06.754180 11668 acceptor_pool.cc:254] collecting diagnostics on the listening RPC socket unix:/tmp/dist-test-taskYIDsjb/test-tmp/rpc-test-c42bddcce4c3466cbf0d94d6c0dec4de.sock every 8 connection(s)
I20260929 14:21:06.804141 11664 messenger.cc:345] service WrongServiceName not registered on TestServer
W20260929 14:21:06.807462 11664 connection.cc:196] Error closing socket: Network error: TlsSocket::Close: Broken pipe
[       OK ] Parameters/TestRpc.TestWrongService/SSL_UnixSocket (74 ms)
[ RUN      ] Parameters/TestRpc.TestConnectionKeepalive/SSL_UnixSocket
I20260929 14:21:06.831427 11690 acceptor_pool.cc:254] collecting diagnostics on the listening RPC socket unix:/tmp/dist-test-taskYIDsjb/test-tmp/rpc-test-e1467c19206b482ab841b3ed246290c0.sock every 8 connection(s)
I20260929 14:21:06.832072 11691 acceptor_pool.cc:254] collecting diagnostics on the listening RPC socket unix:/tmp/dist-test-taskYIDsjb/test-tmp/rpc-test-e1467c19206b482ab841b3ed246290c0.sock every 8 connection(s)
I20260929 14:21:06.834904 11569 rpc-test.cc:488] Connecting to unix:/tmp/dist-test-taskYIDsjb/test-tmp/rpc-test-e1467c19206b482ab841b3ed246290c0.sock
W20260929 14:21:07.315219 11703 connection.cc:196] Error closing socket: Network error: TlsSocket::Close: Broken pipe
[       OK ] Parameters/TestRpc.TestConnectionKeepalive/SSL_UnixSocket (1063 ms)
[ RUN      ] Parameters/TestRpc.TestClientConnectionMetrics/SSL_UnixSocket
I20260929 14:21:07.922705 11715 acceptor_pool.cc:254] collecting diagnostics on the listening RPC socket unix:/tmp/dist-test-taskYIDsjb/test-tmp/rpc-test-c949facd403f4ea7adea6a2921c37f74.sock every 8 connection(s)
I20260929 14:21:07.923388 11716 acceptor_pool.cc:254] collecting diagnostics on the listening RPC socket unix:/tmp/dist-test-taskYIDsjb/test-tmp/rpc-test-c949facd403f4ea7adea6a2921c37f74.sock every 8 connection(s)
I20260929 14:21:07.926608 11569 rpc-test.cc:569] Connecting to unix:/tmp/dist-test-taskYIDsjb/test-tmp/rpc-test-c949facd403f4ea7adea6a2921c37f74.sock
W20260929 14:23:10.454044 11712 connection.cc:196] Error closing socket: Network error: TlsSocket::Close: Broken pipe
[       OK ] Parameters/TestRpc.TestClientConnectionMetrics/SSL_UnixSocket (122585 ms)
[ RUN      ] Parameters/TestRpc.TestCredentialsPolicy/SSL_UnixSocket
I20260929 14:23:10.499770 11750 acceptor_pool.cc:254] collecting diagnostics on the listening RPC socket unix:/tmp/dist-test-taskYIDsjb/test-tmp/rpc-test-55f9e7f80cca49c0a5eb1f3632a1cc9b.sock every 8 connection(s)
I20260929 14:23:10.500587 11751 acceptor_pool.cc:254] collecting diagnostics on the listening RPC socket unix:/tmp/dist-test-taskYIDsjb/test-tmp/rpc-test-55f9e7f80cca49c0a5eb1f3632a1cc9b.sock every 8 connection(s)
I20260929 14:23:10.503576 11569 rpc-test.cc:700] Connecting to unix:/tmp/dist-test-taskYIDsjb/test-tmp/rpc-test-55f9e7f80cca49c0a5eb1f3632a1cc9b.sock
W20260929 14:23:10.542982 11749 connection.cc:196] Error closing socket: Network error: TlsSocket::Close: Broken pipe
W20260929 14:23:10.556972 11749 connection.cc:196] Error closing socket: Network error: TlsSocket::Close: Broken pipe
[       OK ] Parameters/TestRpc.TestCredentialsPolicy/SSL_UnixSocket (101 ms)
[ RUN      ] Parameters/TestRpc.TestCallLongerThanKeepalive/SSL_UnixSocket
I20260929 14:23:10.579108 11775 acceptor_pool.cc:254] collecting diagnostics on the listening RPC socket unix:/tmp/dist-test-taskYIDsjb/test-tmp/rpc-test-2f3dc0a0c5c64b39b9387b303c768297.sock every 8 connection(s)
I20260929 14:23:10.579816 11776 acceptor_pool.cc:254] collecting diagnostics on the listening RPC socket unix:/tmp/dist-test-taskYIDsjb/test-tmp/rpc-test-2f3dc0a0c5c64b39b9387b303c768297.sock every 8 connection(s)
I20260929 14:23:10.611898 11779 rpc-test-base.h:222] got call: sleep_micros: 3000000 deferred: true
I20260929 14:23:13.615907 11779 rpcz_store.cc:275] Call kudu.rpc.GenericCalculatorService.Sleep from unix:<unnamed> (request call id 0) took 3004 ms. Trace:
I20260929 14:23:13.616410 11779 rpcz_store.cc:276] 0929 14:23:10.611770 (+     0us) service_pool.cc:170] Inserting onto call queue
0929 14:23:10.611852 (+    82us) service_pool.cc:227] Handling call
0929 14:23:13.615843 (+3003991us) inbound_call.cc:173] Queueing success response
Metrics: {}
[       OK ] Parameters/TestRpc.TestCallLongerThanKeepalive/SSL_UnixSocket (3064 ms)
[ RUN      ] Parameters/TestRpc.TestRpcSidecar/SSL_UnixSocket
I20260929 14:23:13.648962 11800 acceptor_pool.cc:254] collecting diagnostics on the listening RPC socket unix:/tmp/dist-test-taskYIDsjb/test-tmp/rpc-test-54d644836ff74b5ab6f8949fa1eebaec.sock every 8 connection(s)
I20260929 14:23:13.649730 11801 acceptor_pool.cc:254] collecting diagnostics on the listening RPC socket unix:/tmp/dist-test-taskYIDsjb/test-tmp/rpc-test-54d644836ff74b5ab6f8949fa1eebaec.sock every 8 connection(s)
W20260929 14:23:14.111709 11797 connection.cc:196] Error closing socket: Network error: TlsSocket::Close: Broken pipe
[       OK ] Parameters/TestRpc.TestRpcSidecar/SSL_UnixSocket (488 ms)
[ RUN      ] Parameters/TestRpc.TestRpcSidecarLimits/SSL_UnixSocket
I20260929 14:23:38.977486 11828 acceptor_pool.cc:254] collecting diagnostics on the listening RPC socket unix:/tmp/dist-test-taskYIDsjb/test-tmp/rpc-test-275e274bd1204695bcf9d220f25aef8a.sock every 8 connection(s)
I20260929 14:23:38.979065 11829 acceptor_pool.cc:254] collecting diagnostics on the listening RPC socket unix:/tmp/dist-test-taskYIDsjb/test-tmp/rpc-test-275e274bd1204695bcf9d220f25aef8a.sock every 8 connection(s)
W20260929 14:23:39.001619 11569 serialization.cc:72] Serialized kudu.rpc_test.PushStringsRequestPB (2147483654 bytes) is larger than the maximum configured RPC message size (52428800 bytes). Sending anyway, but peer may reject the data.
W20260929 14:23:39.013440 11825 connection.cc:535] server connection from unix:<unnamed> recv error: Network error: RPC frame had a length of 2147483714, but we only support messages up to 52428800 bytes long.
W20260929 14:23:39.013679 11825 connection.cc:158] shutting down server connection from unix:<unnamed> with pending inbound data: 4/2147483714 bytes received; last active 0 ns ago: status Network error: RPC frame had a length of 2147483714, but we only support messages up to 52428800 bytes long.
W20260929 14:23:39.014449 11841 connection.cc:698] client connection to unix:/tmp/dist-test-taskYIDsjb/test-tmp/rpc-test-275e274bd1204695bcf9d220f25aef8a.sock send error: Network error: failed to write to TLS socket: Broken pipe
W20260929 14:23:39.015003 11841 connection.cc:196] Error closing socket: Network error: TlsSocket::Close: Success
[       OK ] Parameters/TestRpc.TestRpcSidecarLimits/SSL_UnixSocket (25480 ms)
[ RUN      ] Parameters/TestRpc.TestCallTimeoutDoesntAffectNegotiation/SSL_UnixSocket
I20260929 14:23:39.616343 11853 acceptor_pool.cc:254] collecting diagnostics on the listening RPC socket unix:/tmp/dist-test-taskYIDsjb/test-tmp/rpc-test-c2a0458205f8493ea5a1cad7955fdd5c.sock every 8 connection(s)
I20260929 14:23:39.617008 11854 acceptor_pool.cc:254] collecting diagnostics on the listening RPC socket unix:/tmp/dist-test-taskYIDsjb/test-tmp/rpc-test-c2a0458205f8493ea5a1cad7955fdd5c.sock every 8 connection(s)
W20260929 14:23:39.631376 11849 negotiation.cc:266] Injecting 500ms delay in negotiation
I20260929 14:23:39.681975 11569 rpc-test-base.h:595] status: Timed out: connection negotiation to unix:/tmp/dist-test-taskYIDsjb/test-tmp/rpc-test-c2a0458205f8493ea5a1cad7955fdd5c.sock for RPC Sleep timed out after 0.050s (ON_OUTBOUND_QUEUE), seconds elapsed: 0.0513853
W20260929 14:23:40.143275 11850 connection.cc:196] Error closing socket: Network error: TlsSocket::Close: Broken pipe
[       OK ] Parameters/TestRpc.TestCallTimeoutDoesntAffectNegotiation/SSL_UnixSocket (549 ms)
[ RUN      ] Parameters/TestRpc.TestRpcHandlerLatencyMetric/SSL_UnixSocket
I20260929 14:23:40.164740 11878 acceptor_pool.cc:254] collecting diagnostics on the listening RPC socket unix:/tmp/dist-test-taskYIDsjb/test-tmp/rpc-test-530d5d1922644a6b823c349a84005068.sock every 8 connection(s)
I20260929 14:23:40.165436 11879 acceptor_pool.cc:254] collecting diagnostics on the listening RPC socket unix:/tmp/dist-test-taskYIDsjb/test-tmp/rpc-test-530d5d1922644a6b823c349a84005068.sock every 8 connection(s)
I20260929 14:23:40.214741 11569 rpc-test.cc:1236] Sleep() min lat: 21421
I20260929 14:23:40.214912 11569 rpc-test.cc:1237] Sleep() mean lat: 21421
I20260929 14:23:40.215022 11569 rpc-test.cc:1238] Sleep() max lat: 21421
I20260929 14:23:40.215127 11569 rpc-test.cc:1239] Sleep() #calls: 1
[       OK ] Parameters/TestRpc.TestRpcHandlerLatencyMetric/SSL_UnixSocket (74 ms)
[ RUN      ] Parameters/TestRpc.TimedOutOnResponseMetricServiceQueue/SSL_UnixSocket
I20260929 14:23:40.247503 11904 acceptor_pool.cc:254] collecting diagnostics on the listening RPC socket unix:/tmp/dist-test-taskYIDsjb/test-tmp/rpc-test-a048d4d7c8ca43b090b8bd2557ee509c.sock every 8 connection(s)
I20260929 14:23:40.248139 11905 acceptor_pool.cc:254] collecting diagnostics on the listening RPC socket unix:/tmp/dist-test-taskYIDsjb/test-tmp/rpc-test-a048d4d7c8ca43b090b8bd2557ee509c.sock every 8 connection(s)
W20260929 14:23:40.349500 11906 rpcz_store.cc:267] Call kudu.rpc_test.CalculatorService.Sleep from unix:<unnamed> (request call id 2) took 20 ms (client timeout 20 ms). Trace:
W20260929 14:23:40.349830 11906 rpcz_store.cc:269] 0929 14:23:40.329173 (+     0us) service_pool.cc:170] Inserting onto call queue
0929 14:23:40.349391 (+ 20218us) service_pool.cc:214] Skipping call since client already timed out
0929 14:23:40.349451 (+    60us) inbound_call.cc:173] Queueing failure response
Metrics: {}
[       OK ] Parameters/TestRpc.TimedOutOnResponseMetricServiceQueue/SSL_UnixSocket (134 ms)
[ RUN      ] Parameters/TestRpc.RpcPendingConnectionsMetric/SSL_UnixSocket
I20260929 14:23:40.364673 11927 acceptor_pool.cc:254] collecting diagnostics on the listening RPC socket 0.0.0.0:41843 every 8 connection(s)
I20260929 14:23:40.365427 11928 acceptor_pool.cc:254] collecting diagnostics on the listening RPC socket 0.0.0.0:41843 every 8 connection(s)
W20260929 14:23:40.369858 11923 negotiation.cc:337] Failed RPC negotiation. Trace:
0929 14:23:40.368836 (+     0us) reactor.cc:625] Submitting negotiation task for server connection from 127.0.0.1:53108 (local address 127.0.0.1:41843)
0929 14:23:40.369149 (+   313us) server_negotiation.cc:206] Beginning negotiation
0929 14:23:40.369164 (+    15us) server_negotiation.cc:399] Waiting for connection header
0929 14:23:40.369355 (+   191us) negotiation.cc:327] Negotiation complete: Network error: Server connection negotiation failed: server connection from 127.0.0.1:53108: BlockingRecv error: recv got EOF from 127.0.0.1:53108 (error 108)
Metrics: {"server-negotiator.queue_time_us":77}
[       OK ] Parameters/TestRpc.RpcPendingConnectionsMetric/SSL_UnixSocket (26 ms)
[ RUN      ] Parameters/TestRpc.TestRpcContextClientDeadline/SSL_UnixSocket
I20260929 14:23:40.396473 11943 acceptor_pool.cc:254] collecting diagnostics on the listening RPC socket unix:/tmp/dist-test-taskYIDsjb/test-tmp/rpc-test-867645c06ca5425b83d30cdadbaf2796.sock every 8 connection(s)
I20260929 14:23:40.397125 11944 acceptor_pool.cc:254] collecting diagnostics on the listening RPC socket unix:/tmp/dist-test-taskYIDsjb/test-tmp/rpc-test-867645c06ca5425b83d30cdadbaf2796.sock every 8 connection(s)
W20260929 14:23:40.445964 11940 connection.cc:196] Error closing socket: Network error: TlsSocket::Close: Broken pipe
[       OK ] Parameters/TestRpc.TestRpcContextClientDeadline/SSL_UnixSocket (67 ms)
[ RUN      ] Parameters/TestRpc.TestApplicationFeatureFlagUnsupportedServer/SSL_UnixSocket
I20260929 14:23:40.480243 11968 acceptor_pool.cc:254] collecting diagnostics on the listening RPC socket unix:/tmp/dist-test-taskYIDsjb/test-tmp/rpc-test-81756c700cbf4f69a85f1502ef290bc9.sock every 8 connection(s)
I20260929 14:23:40.480839 11969 acceptor_pool.cc:254] collecting diagnostics on the listening RPC socket unix:/tmp/dist-test-taskYIDsjb/test-tmp/rpc-test-81756c700cbf4f69a85f1502ef290bc9.sock every 8 connection(s)
W20260929 14:23:40.517501 11965 connection.cc:196] Error closing socket: Network error: TlsSocket::Close: Broken pipe
[       OK ] Parameters/TestRpc.TestApplicationFeatureFlagUnsupportedServer/SSL_UnixSocket (71 ms)
[ RUN      ] Parameters/TestRpc.TestCancellationAsync/SSL_UnixSocket
I20260929 14:23:40.548027 11993 acceptor_pool.cc:254] collecting diagnostics on the listening RPC socket unix:/tmp/dist-test-taskYIDsjb/test-tmp/rpc-test-4a808bd09ed94786bbc6a0923ce5bac3.sock every 8 connection(s)
I20260929 14:23:40.548765 11994 acceptor_pool.cc:254] collecting diagnostics on the listening RPC socket unix:/tmp/dist-test-taskYIDsjb/test-tmp/rpc-test-4a808bd09ed94786bbc6a0923ce5bac3.sock every 8 connection(s)
I20260929 14:23:40.551384 11569 rpc-test.cc:1716] Connecting to unix:/tmp/dist-test-taskYIDsjb/test-tmp/rpc-test-4a808bd09ed94786bbc6a0923ce5bac3.sock
I20260929 14:23:40.574091 11569 test_util.cc:268] Using random seed: -304212613
I20260929 14:23:40.775414 11997 rpc-test-base.h:240] got call: sleep_micros: 500 pattern: 4294967295 num_repetitions: 2097152 sidecar_idx: 0
I20260929 14:23:40.945981 11996 rpc-test-base.h:240] got call: sleep_micros: 500 pattern: 4294967295 num_repetitions: 2097152 sidecar_idx: 0
I20260929 14:23:41.156867 11996 rpc-test-base.h:240] got call: sleep_micros: 500 pattern: 4294967295 num_repetitions: 2097152 sidecar_idx: 0
I20260929 14:23:41.351457 11996 rpc-test-base.h:240] got call: sleep_micros: 500 pattern: 4294967295 num_repetitions: 2097152 sidecar_idx: 0
I20260929 14:23:41.524653 11997 rpc-test-base.h:240] got call: sleep_micros: 500 pattern: 4294967295 num_repetitions: 2097152 sidecar_idx: 0
I20260929 14:23:41.721530 11996 rpc-test-base.h:240] got call: sleep_micros: 500 pattern: 4294967295 num_repetitions: 2097152 sidecar_idx: 0
I20260929 14:23:41.915110 11996 rpc-test-base.h:240] got call: sleep_micros: 500 pattern: 4294967295 num_repetitions: 2097152 sidecar_idx: 0
I20260929 14:23:42.106106 11996 rpc-test-base.h:240] got call: sleep_micros: 500 pattern: 4294967295 num_repetitions: 2097152 sidecar_idx: 0
I20260929 14:23:42.305912 11996 rpc-test-base.h:240] got call: sleep_micros: 500 pattern: 4294967295 num_repetitions: 2097152 sidecar_idx: 0
W20260929 14:23:42.319245 11990 connection.cc:196] Error closing socket: Network error: TlsSocket::Close: Broken pipe
W20260929 14:23:42.422390 11990 connection.cc:441] server connection from unix:<unnamed> torn down before Call kudu.rpc.GenericCalculatorService.SleepWithSidecar from unix:<unnamed> (request call id 9) could send its response
[       OK ] Parameters/TestRpc.TestCancellationAsync/SSL_UnixSocket (1911 ms)
[ RUN      ] Parameters/TestRpc.TestPerformanceBySocketType/SSL_UnixSocket
I20260929 14:23:42.524071 12018 acceptor_pool.cc:254] collecting diagnostics on the listening RPC socket unix:/tmp/dist-test-taskYIDsjb/test-tmp/rpc-test-b37761b5d7f940408edc88a983e4dd33.sock every 8 connection(s)
I20260929 14:23:42.524758 12019 acceptor_pool.cc:254] collecting diagnostics on the listening RPC socket unix:/tmp/dist-test-taskYIDsjb/test-tmp/rpc-test-b37761b5d7f940408edc88a983e4dd33.sock every 8 connection(s)
I20260929 14:23:42.527820 11569 rpc-test.cc:1846] Connecting to unix:/tmp/dist-test-taskYIDsjb/test-tmp/rpc-test-b37761b5d7f940408edc88a983e4dd33.sock
I20260929 14:24:01.915700 11569 rpc-test.cc:1859] Sending 1024MB via ssl-enabled unix socket: real 19.360s	user 16.621s	sys 12.088s
I20260929 14:24:22.095970 11569 rpc-test.cc:1859] Sending 1024MB via ssl-enabled unix socket: real 20.180s	user 17.851s	sys 12.282s
I20260929 14:24:41.305414 11569 rpc-test.cc:1859] Sending 1024MB via ssl-enabled unix socket: real 19.209s	user 16.562s	sys 11.789s
I20260929 14:25:00.725567 11569 rpc-test.cc:1859] Sending 1024MB via ssl-enabled unix socket: real 19.420s	user 16.530s	sys 12.140s
I20260929 14:25:20.315294 11569 rpc-test.cc:1859] Sending 1024MB via ssl-enabled unix socket: real 19.589s	user 16.977s	sys 12.046s
W20260929 14:25:20.321801 12015 connection.cc:196] Error closing socket: Network error: TlsSocket::Close: Broken pipe
[       OK ] Parameters/TestRpc.TestPerformanceBySocketType/SSL_UnixSocket (97902 ms)
[----------] 20 tests from Parameters/TestRpc (254930 ms total)

[----------] 1 test from Parameters/TestRpcSocketTxRxQueue
[ RUN      ] Parameters/TestRpcSocketTxRxQueue.AcceptorRxQueueSizeMetric/0
I20260929 14:25:20.351994 12053 acceptor_pool.cc:254] collecting diagnostics on the listening RPC socket 0.0.0.0:43835 every 1 connection(s)
I20260929 14:25:20.352841 12054 acceptor_pool.cc:254] collecting diagnostics on the listening RPC socket 0.0.0.0:43835 every 1 connection(s)
W20260929 14:25:20.357957 12049 negotiation.cc:337] Failed RPC negotiation. Trace:
0929 14:25:20.356630 (+     0us) reactor.cc:625] Submitting negotiation task for server connection from 127.0.0.1:50354 (local address 127.0.0.1:43835)
0929 14:25:20.357041 (+   411us) server_negotiation.cc:206] Beginning negotiation
0929 14:25:20.357064 (+    23us) server_negotiation.cc:399] Waiting for connection header
0929 14:25:20.357270 (+   206us) negotiation.cc:327] Negotiation complete: Network error: Server connection negotiation failed: server connection from 127.0.0.1:50354: BlockingRecv error: recv got EOF from 127.0.0.1:50354 (error 108)
Metrics: {"server-negotiator.queue_time_us":106}
[       OK ] Parameters/TestRpcSocketTxRxQueue.AcceptorRxQueueSizeMetric/0 (29 ms)
[----------] 1 test from Parameters/TestRpcSocketTxRxQueue (29 ms total)

[----------] Global test environment tear-down
[==========] 21 tests from 2 test suites ran. (254961 ms total)
[  PASSED  ] 20 tests.
[  FAILED  ] 1 test, listed below:
[  FAILED  ] Parameters/TestRpc.TestCallWithChainCertAndChainCA/SSL_UnixSocket, where GetParam() = (true, true)

 1 FAILED TEST