Diagnosed failure

Parameters/TestRpc.TestCallWithChainCertAndChainCA/SSL_UnixSocket: /data0/somelongdirectorytoavoidrpathissues/src/kudu/src/kudu/rpc/rpc-test.cc:270: Failure
Failed
Bad status: Runtime error: could not verify certificate chain (error with cert: subject=CN = localhost, ST = sadfjas, C = AS, emailAddress = sdflkdsajf, O = lskdfjlsad, OU = sldfkja, issuer=C = AS, ST = ASDfkjdhf, L = lskdjf, O = saldfja, OU = skdjf, CN = localhost, emailAddress = sadjflkadsj): : certificate has expired
Google Test trace:
/data0/somelongdirectorytoavoidrpathissues/src/kudu/src/kudu/rpc/rpc-test.cc:267: Connecting to unix:/tmp/dist-test-taskpQc0pX/test-tmp/rpc-test-524836cc461f42c18aec3fb7f8d0ab9e.sock
I20260927 18:37:47.087435 20392 test_util.cc:175] -----------------------------------------------
I20260927 18:37:47.087481 20392 test_util.cc:176] Had fatal failures, leaving test files at /tmp/dist-test-taskpQc0pX/test-tmp/rpc-test.6.Parameters_TestRpc.TestCallWithChainCertAndChainCA_SSL_UnixSocket.1790534267020170-20392-0

Full log

Note: This is test shard 7 of 8.
[==========] Running 21 tests from 2 test suites.
[----------] Global test environment set-up.
[----------] 20 tests from Parameters/TestRpc
[ RUN      ] Parameters/TestRpc.TestMessengerCreateDestroy/SSL_UnixSocket
WARNING: Logging before InitGoogleLogging() is written to STDERR
I20260927 18:37:47.053462 20392 rpc-test.cc:169] started messenger TestCreateDestroy
[       OK ] Parameters/TestRpc.TestMessengerCreateDestroy/SSL_UnixSocket (28 ms)
[ RUN      ] Parameters/TestRpc.TestNegotiationDeadlock/SSL_UnixSocket
I20260927 18:37:47.065291 20412 acceptor_pool.cc:254] collecting diagnostics on the listening RPC socket unix:/tmp/dist-test-taskpQc0pX/test-tmp/rpc-test-e89319dca6aa4d7ebf47ca8d7f3c162f.sock every 8 connection(s)
I20260927 18:37:47.065335 20413 acceptor_pool.cc:254] collecting diagnostics on the listening RPC socket unix:/tmp/dist-test-taskpQc0pX/test-tmp/rpc-test-e89319dca6aa4d7ebf47ca8d7f3c162f.sock every 8 connection(s)
[       OK ] Parameters/TestRpc.TestNegotiationDeadlock/SSL_UnixSocket (19 ms)
[ RUN      ] Parameters/TestRpc.TestCallWithChainCertAndChainCA/SSL_UnixSocket
I20260927 18:37:47.082798 20428 acceptor_pool.cc:254] collecting diagnostics on the listening RPC socket unix:/tmp/dist-test-taskpQc0pX/test-tmp/rpc-test-524836cc461f42c18aec3fb7f8d0ab9e.sock every 8 connection(s)
I20260927 18:37:47.082873 20429 acceptor_pool.cc:254] collecting diagnostics on the listening RPC socket unix:/tmp/dist-test-taskpQc0pX/test-tmp/rpc-test-524836cc461f42c18aec3fb7f8d0ab9e.sock every 8 connection(s)
/data0/somelongdirectorytoavoidrpathissues/src/kudu/src/kudu/rpc/rpc-test.cc:270: Failure
Failed
Bad status: Runtime error: could not verify certificate chain (error with cert: subject=CN = localhost, ST = sadfjas, C = AS, emailAddress = sdflkdsajf, O = lskdfjlsad, OU = sldfkja, issuer=C = AS, ST = ASDfkjdhf, L = lskdjf, O = saldfja, OU = skdjf, CN = localhost, emailAddress = sadjflkadsj): : certificate has expired
Google Test trace:
/data0/somelongdirectorytoavoidrpathissues/src/kudu/src/kudu/rpc/rpc-test.cc:267: Connecting to unix:/tmp/dist-test-taskpQc0pX/test-tmp/rpc-test-524836cc461f42c18aec3fb7f8d0ab9e.sock
I20260927 18:37:47.087435 20392 test_util.cc:175] -----------------------------------------------
I20260927 18:37:47.087481 20392 test_util.cc:176] Had fatal failures, leaving test files at /tmp/dist-test-taskpQc0pX/test-tmp/rpc-test.6.Parameters_TestRpc.TestCallWithChainCertAndChainCA_SSL_UnixSocket.1790534267020170-20392-0
[  FAILED  ] Parameters/TestRpc.TestCallWithChainCertAndChainCA/SSL_UnixSocket, where GetParam() = (true, true) (12 ms)
[ RUN      ] Parameters/TestRpc.TestCallWithPasswordProtectedKey/SSL_UnixSocket
I20260927 18:37:47.093200 20453 acceptor_pool.cc:254] collecting diagnostics on the listening RPC socket unix:/tmp/dist-test-taskpQc0pX/test-tmp/rpc-test-1662155623b94c658b3901fde7d86968.sock every 8 connection(s)
I20260927 18:37:47.093248 20454 acceptor_pool.cc:254] collecting diagnostics on the listening RPC socket unix:/tmp/dist-test-taskpQc0pX/test-tmp/rpc-test-1662155623b94c658b3901fde7d86968.sock every 8 connection(s)
W20260927 18:37:47.104825 20450 connection.cc:196] Error closing socket: Network error: TlsSocket::Close: Broken pipe
[       OK ] Parameters/TestRpc.TestCallWithPasswordProtectedKey/SSL_UnixSocket (18 ms)
[ RUN      ] Parameters/TestRpc.TestCallToBadServer/SSL_UnixSocket
I20260927 18:37:47.115734 20392 rpc-test.cc:394] Status: Network error: Client connection negotiation failed: client connection to 0.0.0.0:0: connect: Connection refused (error 111)
I20260927 18:37:47.116112 20392 rpc-test.cc:394] Status: Network error: Client connection negotiation failed: client connection to 0.0.0.0:0: connect: Connection refused (error 111)
I20260927 18:37:47.116508 20392 rpc-test.cc:394] Status: Network error: Client connection negotiation failed: client connection to 0.0.0.0:0: connect: Connection refused (error 111)
I20260927 18:37:47.116933 20392 rpc-test.cc:394] Status: Network error: Client connection negotiation failed: client connection to 0.0.0.0:0: connect: Connection refused (error 111)
I20260927 18:37:47.117374 20392 rpc-test.cc:394] Status: Network error: Client connection negotiation failed: client connection to 0.0.0.0:0: connect: Connection refused (error 111)
[       OK ] Parameters/TestRpc.TestCallToBadServer/SSL_UnixSocket (11 ms)
[ RUN      ] Parameters/TestRpc.TestWrongService/SSL_UnixSocket
I20260927 18:37:47.154467 20488 acceptor_pool.cc:254] collecting diagnostics on the listening RPC socket unix:/tmp/dist-test-taskpQc0pX/test-tmp/rpc-test-41c399c970ae4649b50666d1c224a795.sock every 8 connection(s)
I20260927 18:37:47.154510 20489 acceptor_pool.cc:254] collecting diagnostics on the listening RPC socket unix:/tmp/dist-test-taskpQc0pX/test-tmp/rpc-test-41c399c970ae4649b50666d1c224a795.sock every 8 connection(s)
I20260927 18:37:47.174664 20485 messenger.cc:345] service WrongServiceName not registered on TestServer
[       OK ] Parameters/TestRpc.TestWrongService/SSL_UnixSocket (58 ms)
[ RUN      ] Parameters/TestRpc.TestConnectionKeepalive/SSL_UnixSocket
I20260927 18:37:47.196130 20511 acceptor_pool.cc:254] collecting diagnostics on the listening RPC socket unix:/tmp/dist-test-taskpQc0pX/test-tmp/rpc-test-99bcff9429924eb98f4540f3c3adf906.sock every 8 connection(s)
I20260927 18:37:47.196185 20512 acceptor_pool.cc:254] collecting diagnostics on the listening RPC socket unix:/tmp/dist-test-taskpQc0pX/test-tmp/rpc-test-99bcff9429924eb98f4540f3c3adf906.sock every 8 connection(s)
I20260927 18:37:47.196518 20392 rpc-test.cc:488] Connecting to unix:/tmp/dist-test-taskpQc0pX/test-tmp/rpc-test-99bcff9429924eb98f4540f3c3adf906.sock
W20260927 18:37:47.678375 20524 connection.cc:196] Error closing socket: Network error: TlsSocket::Close: Broken pipe
[       OK ] Parameters/TestRpc.TestConnectionKeepalive/SSL_UnixSocket (1039 ms)
[ RUN      ] Parameters/TestRpc.TestClientConnectionMetrics/SSL_UnixSocket
I20260927 18:37:48.241045 20536 acceptor_pool.cc:254] collecting diagnostics on the listening RPC socket unix:/tmp/dist-test-taskpQc0pX/test-tmp/rpc-test-8f79e77f694942d688ce355d8f5cd4ad.sock every 8 connection(s)
I20260927 18:37:48.241086 20537 acceptor_pool.cc:254] collecting diagnostics on the listening RPC socket unix:/tmp/dist-test-taskpQc0pX/test-tmp/rpc-test-8f79e77f694942d688ce355d8f5cd4ad.sock every 8 connection(s)
I20260927 18:37:48.241382 20392 rpc-test.cc:569] Connecting to unix:/tmp/dist-test-taskpQc0pX/test-tmp/rpc-test-8f79e77f694942d688ce355d8f5cd4ad.sock
W20260927 18:37:58.062609 20533 connection.cc:196] Error closing socket: Network error: TlsSocket::Close: Broken pipe
[       OK ] Parameters/TestRpc.TestClientConnectionMetrics/SSL_UnixSocket (9847 ms)
[ RUN      ] Parameters/TestRpc.TestCredentialsPolicy/SSL_UnixSocket
I20260927 18:37:58.084103 20559 acceptor_pool.cc:254] collecting diagnostics on the listening RPC socket unix:/tmp/dist-test-taskpQc0pX/test-tmp/rpc-test-936a82904e51467aa98221120439a2fe.sock every 8 connection(s)
I20260927 18:37:58.084159 20560 acceptor_pool.cc:254] collecting diagnostics on the listening RPC socket unix:/tmp/dist-test-taskpQc0pX/test-tmp/rpc-test-936a82904e51467aa98221120439a2fe.sock every 8 connection(s)
I20260927 18:37:58.084470 20392 rpc-test.cc:700] Connecting to unix:/tmp/dist-test-taskpQc0pX/test-tmp/rpc-test-936a82904e51467aa98221120439a2fe.sock
W20260927 18:37:58.105954 20558 connection.cc:196] Error closing socket: Network error: TlsSocket::Close: Broken pipe
W20260927 18:37:58.111057 20558 connection.cc:196] Error closing socket: Network error: TlsSocket::Close: Broken pipe
[       OK ] Parameters/TestRpc.TestCredentialsPolicy/SSL_UnixSocket (47 ms)
[ RUN      ] Parameters/TestRpc.TestCallLongerThanKeepalive/SSL_UnixSocket
I20260927 18:37:58.121333 20584 acceptor_pool.cc:254] collecting diagnostics on the listening RPC socket unix:/tmp/dist-test-taskpQc0pX/test-tmp/rpc-test-4d6c06492ad643c4970f52634717c046.sock every 8 connection(s)
I20260927 18:37:58.121379 20585 acceptor_pool.cc:254] collecting diagnostics on the listening RPC socket unix:/tmp/dist-test-taskpQc0pX/test-tmp/rpc-test-4d6c06492ad643c4970f52634717c046.sock every 8 connection(s)
I20260927 18:37:58.149883 20588 rpc-test-base.h:222] got call: sleep_micros: 3000000 deferred: true
I20260927 18:38:01.150697 20588 rpcz_store.cc:275] Call kudu.rpc.GenericCalculatorService.Sleep from unix:<unnamed> (request call id 0) took 3000 ms. Trace:
I20260927 18:38:01.150821 20588 rpcz_store.cc:276] 0927 18:37:58.149793 (+     0us) service_pool.cc:170] Inserting onto call queue
0927 18:37:58.149852 (+    59us) service_pool.cc:227] Handling call
0927 18:38:01.150675 (+3000823us) inbound_call.cc:173] Queueing success response
Metrics: {}
[       OK ] Parameters/TestRpc.TestCallLongerThanKeepalive/SSL_UnixSocket (3041 ms)
[ RUN      ] Parameters/TestRpc.TestRpcSidecar/SSL_UnixSocket
I20260927 18:38:01.161301 20609 acceptor_pool.cc:254] collecting diagnostics on the listening RPC socket unix:/tmp/dist-test-taskpQc0pX/test-tmp/rpc-test-233a379636eb42338ce01b71fce63a50.sock every 8 connection(s)
I20260927 18:38:01.161407 20610 acceptor_pool.cc:254] collecting diagnostics on the listening RPC socket unix:/tmp/dist-test-taskpQc0pX/test-tmp/rpc-test-233a379636eb42338ce01b71fce63a50.sock every 8 connection(s)
W20260927 18:38:01.222795 20606 connection.cc:196] Error closing socket: Network error: TlsSocket::Close: Broken pipe
[       OK ] Parameters/TestRpc.TestRpcSidecar/SSL_UnixSocket (70 ms)
[ RUN      ] Parameters/TestRpc.TestRpcSidecarLimits/SSL_UnixSocket
I20260927 18:38:02.823290 20634 acceptor_pool.cc:254] collecting diagnostics on the listening RPC socket unix:/tmp/dist-test-taskpQc0pX/test-tmp/rpc-test-d330c40bd60d4db199096b78725fc276.sock every 8 connection(s)
I20260927 18:38:02.823333 20635 acceptor_pool.cc:254] collecting diagnostics on the listening RPC socket unix:/tmp/dist-test-taskpQc0pX/test-tmp/rpc-test-d330c40bd60d4db199096b78725fc276.sock every 8 connection(s)
W20260927 18:38:02.835853 20392 serialization.cc:72] Serialized kudu.rpc_test.PushStringsRequestPB (2147483654 bytes) is larger than the maximum configured RPC message size (52428800 bytes). Sending anyway, but peer may reject the data.
W20260927 18:38:02.839818 20631 connection.cc:535] server connection from unix:<unnamed> recv error: Network error: RPC frame had a length of 2147483714, but we only support messages up to 52428800 bytes long.
W20260927 18:38:02.839897 20631 connection.cc:158] shutting down server connection from unix:<unnamed> with pending inbound data: 4/2147483714 bytes received; last active 0 ns ago: status Network error: RPC frame had a length of 2147483714, but we only support messages up to 52428800 bytes long.
W20260927 18:38:02.840124 20647 connection.cc:196] Error closing socket: Network error: TlsSocket::Close: Broken pipe
I20260927 18:38:02.847091 20659 acceptor_pool.cc:254] collecting diagnostics on the listening RPC socket unix:/tmp/dist-test-taskpQc0pX/test-tmp/rpc-test-d330c40bd60d4db199096b78725fc276.sock every 8 connection(s)
I20260927 18:38:02.847106 20660 acceptor_pool.cc:254] collecting diagnostics on the listening RPC socket unix:/tmp/dist-test-taskpQc0pX/test-tmp/rpc-test-d330c40bd60d4db199096b78725fc276.sock every 8 connection(s)
W20260927 18:38:07.687590 20656 connection.cc:577] server connection from unix:<unnamed>: received bad data: 'Corruption: Invalid packet: message had a length of 2147483710, but we only support messages up to 2147483647 bytes
'
W20260927 18:38:07.687944 20672 connection.cc:196] Error closing socket: Network error: TlsSocket::Close: Broken pipe
[       OK ] Parameters/TestRpc.TestRpcSidecarLimits/SSL_UnixSocket (6466 ms)
[ RUN      ] Parameters/TestRpc.TestCallTimeoutDoesntAffectNegotiation/SSL_UnixSocket
I20260927 18:38:07.710434 20684 acceptor_pool.cc:254] collecting diagnostics on the listening RPC socket unix:/tmp/dist-test-taskpQc0pX/test-tmp/rpc-test-edd2929cc2974db6bbdcc558cc75eaa5.sock every 8 connection(s)
I20260927 18:38:07.710489 20685 acceptor_pool.cc:254] collecting diagnostics on the listening RPC socket unix:/tmp/dist-test-taskpQc0pX/test-tmp/rpc-test-edd2929cc2974db6bbdcc558cc75eaa5.sock every 8 connection(s)
W20260927 18:38:07.737099 20680 negotiation.cc:266] Injecting 500ms delay in negotiation
I20260927 18:38:07.787487 20392 rpc-test-base.h:595] status: Timed out: connection negotiation to unix:/tmp/dist-test-taskpQc0pX/test-tmp/rpc-test-edd2929cc2974db6bbdcc558cc75eaa5.sock for RPC Sleep timed out after 0.050s (ON_OUTBOUND_QUEUE), seconds elapsed: 0.0508129
W20260927 18:38:08.242300 20681 connection.cc:196] Error closing socket: Network error: TlsSocket::Close: Broken pipe
[       OK ] Parameters/TestRpc.TestCallTimeoutDoesntAffectNegotiation/SSL_UnixSocket (552 ms)
[ RUN      ] Parameters/TestRpc.TestRpcHandlerLatencyMetric/SSL_UnixSocket
I20260927 18:38:08.251638 20709 acceptor_pool.cc:254] collecting diagnostics on the listening RPC socket unix:/tmp/dist-test-taskpQc0pX/test-tmp/rpc-test-512f8a75ade34d5e8f59cfc04c56b5a6.sock every 8 connection(s)
I20260927 18:38:08.251751 20710 acceptor_pool.cc:254] collecting diagnostics on the listening RPC socket unix:/tmp/dist-test-taskpQc0pX/test-tmp/rpc-test-512f8a75ade34d5e8f59cfc04c56b5a6.sock every 8 connection(s)
I20260927 18:38:08.287806 20392 rpc-test.cc:1236] Sleep() min lat: 20363
I20260927 18:38:08.287863 20392 rpc-test.cc:1237] Sleep() mean lat: 20363
I20260927 18:38:08.287890 20392 rpc-test.cc:1238] Sleep() max lat: 20363
I20260927 18:38:08.287904 20392 rpc-test.cc:1239] Sleep() #calls: 1
[       OK ] Parameters/TestRpc.TestRpcHandlerLatencyMetric/SSL_UnixSocket (46 ms)
[ RUN      ] Parameters/TestRpc.TimedOutOnResponseMetricServiceQueue/SSL_UnixSocket
I20260927 18:38:08.298277 20736 acceptor_pool.cc:254] collecting diagnostics on the listening RPC socket unix:/tmp/dist-test-taskpQc0pX/test-tmp/rpc-test-63b54b253d304ef49ec74783eaa3c5e3.sock every 8 connection(s)
I20260927 18:38:08.298448 20735 acceptor_pool.cc:254] collecting diagnostics on the listening RPC socket unix:/tmp/dist-test-taskpQc0pX/test-tmp/rpc-test-63b54b253d304ef49ec74783eaa3c5e3.sock every 8 connection(s)
W20260927 18:38:08.351169 20737 rpcz_store.cc:267] Call kudu.rpc_test.CalculatorService.Sleep from unix:<unnamed> (request call id 2) took 20 ms (client timeout 20 ms). Trace:
W20260927 18:38:08.351280 20737 rpcz_store.cc:269] 0927 18:38:08.330873 (+     0us) service_pool.cc:170] Inserting onto call queue
0927 18:38:08.351121 (+ 20248us) service_pool.cc:214] Skipping call since client already timed out
0927 18:38:08.351141 (+    20us) inbound_call.cc:173] Queueing failure response
Metrics: {}
W20260927 18:38:08.351976 20732 connection.cc:196] Error closing socket: Network error: TlsSocket::Close: Broken pipe
[       OK ] Parameters/TestRpc.TimedOutOnResponseMetricServiceQueue/SSL_UnixSocket (63 ms)
[ RUN      ] Parameters/TestRpc.RpcPendingConnectionsMetric/SSL_UnixSocket
I20260927 18:38:08.355396 20758 acceptor_pool.cc:254] collecting diagnostics on the listening RPC socket 0.0.0.0:41895 every 8 connection(s)
I20260927 18:38:08.355485 20759 acceptor_pool.cc:254] collecting diagnostics on the listening RPC socket 0.0.0.0:41895 every 8 connection(s)
W20260927 18:38:08.356614 20754 negotiation.cc:337] Failed RPC negotiation. Trace:
0927 18:38:08.356181 (+     0us) reactor.cc:625] Submitting negotiation task for server connection from 127.0.0.1:33014 (local address 127.0.0.1:41895)
0927 18:38:08.356310 (+   129us) server_negotiation.cc:206] Beginning negotiation
0927 18:38:08.356316 (+     6us) server_negotiation.cc:399] Waiting for connection header
0927 18:38:08.356421 (+   105us) negotiation.cc:327] Negotiation complete: Network error: Server connection negotiation failed: server connection from 127.0.0.1:33014: BlockingRecv error: recv got EOF from 127.0.0.1:33014 (error 108)
Metrics: {"server-negotiator.queue_time_us":35}
[       OK ] Parameters/TestRpc.RpcPendingConnectionsMetric/SSL_UnixSocket (14 ms)
[ RUN      ] Parameters/TestRpc.TestRpcContextClientDeadline/SSL_UnixSocket
I20260927 18:38:08.382114 20774 acceptor_pool.cc:254] collecting diagnostics on the listening RPC socket unix:/tmp/dist-test-taskpQc0pX/test-tmp/rpc-test-192db7bde16f4fea80a5872643dc80ea.sock every 8 connection(s)
I20260927 18:38:08.382148 20775 acceptor_pool.cc:254] collecting diagnostics on the listening RPC socket unix:/tmp/dist-test-taskpQc0pX/test-tmp/rpc-test-192db7bde16f4fea80a5872643dc80ea.sock every 8 connection(s)
[       OK ] Parameters/TestRpc.TestRpcContextClientDeadline/SSL_UnixSocket (60 ms)
[ RUN      ] Parameters/TestRpc.TestApplicationFeatureFlagUnsupportedServer/SSL_UnixSocket
I20260927 18:38:08.437381 20799 acceptor_pool.cc:254] collecting diagnostics on the listening RPC socket unix:/tmp/dist-test-taskpQc0pX/test-tmp/rpc-test-ce812079653441538861f54c584ebe44.sock every 8 connection(s)
I20260927 18:38:08.437435 20800 acceptor_pool.cc:254] collecting diagnostics on the listening RPC socket unix:/tmp/dist-test-taskpQc0pX/test-tmp/rpc-test-ce812079653441538861f54c584ebe44.sock every 8 connection(s)
W20260927 18:38:08.451537 20796 connection.cc:196] Error closing socket: Network error: TlsSocket::Close: Broken pipe
[       OK ] Parameters/TestRpc.TestApplicationFeatureFlagUnsupportedServer/SSL_UnixSocket (24 ms)
[ RUN      ] Parameters/TestRpc.TestCancellationAsync/SSL_UnixSocket
I20260927 18:38:08.471341 20824 acceptor_pool.cc:254] collecting diagnostics on the listening RPC socket unix:/tmp/dist-test-taskpQc0pX/test-tmp/rpc-test-5c5c393b103f4107b199dfc15a70578c.sock every 8 connection(s)
I20260927 18:38:08.471380 20825 acceptor_pool.cc:254] collecting diagnostics on the listening RPC socket unix:/tmp/dist-test-taskpQc0pX/test-tmp/rpc-test-5c5c393b103f4107b199dfc15a70578c.sock every 8 connection(s)
I20260927 18:38:08.471666 20392 rpc-test.cc:1716] Connecting to unix:/tmp/dist-test-taskpQc0pX/test-tmp/rpc-test-5c5c393b103f4107b199dfc15a70578c.sock
I20260927 18:38:08.479439 20392 test_util.cc:268] Using random seed: 1077482702
I20260927 18:38:08.495426 20828 rpc-test-base.h:240] got call: sleep_micros: 500 pattern: 4294967295 num_repetitions: 2097152 sidecar_idx: 0
I20260927 18:38:08.511894 20827 rpc-test-base.h:240] got call: sleep_micros: 500 pattern: 4294967295 num_repetitions: 2097152 sidecar_idx: 0
I20260927 18:38:08.527689 20828 rpc-test-base.h:240] got call: sleep_micros: 500 pattern: 4294967295 num_repetitions: 2097152 sidecar_idx: 0
I20260927 18:38:08.547111 20827 rpc-test-base.h:240] got call: sleep_micros: 500 pattern: 4294967295 num_repetitions: 2097152 sidecar_idx: 0
I20260927 18:38:08.566079 20827 rpc-test-base.h:240] got call: sleep_micros: 500 pattern: 4294967295 num_repetitions: 2097152 sidecar_idx: 0
I20260927 18:38:08.581496 20828 rpc-test-base.h:240] got call: sleep_micros: 500 pattern: 4294967295 num_repetitions: 2097152 sidecar_idx: 0
I20260927 18:38:08.597972 20827 rpc-test-base.h:240] got call: sleep_micros: 500 pattern: 4294967295 num_repetitions: 2097152 sidecar_idx: 0
I20260927 18:38:08.612923 20828 rpc-test-base.h:240] got call: sleep_micros: 500 pattern: 4294967295 num_repetitions: 2097152 sidecar_idx: 0
W20260927 18:38:08.614063 20821 connection.cc:196] Error closing socket: Network error: TlsSocket::Close: Broken pipe
W20260927 18:38:08.621621 20821 connection.cc:441] server connection from unix:<unnamed> torn down before Call kudu.rpc.GenericCalculatorService.SleepWithSidecar from unix:<unnamed> (request call id 8) could send its response
W20260927 18:38:08.631330 20821 connection.cc:441] server connection from unix:<unnamed> torn down before Call kudu.rpc.GenericCalculatorService.SleepWithSidecar from unix:<unnamed> (request call id 9) could send its response
[       OK ] Parameters/TestRpc.TestCancellationAsync/SSL_UnixSocket (179 ms)
[ RUN      ] Parameters/TestRpc.TestPerformanceBySocketType/SSL_UnixSocket
I20260927 18:38:08.643292 20849 acceptor_pool.cc:254] collecting diagnostics on the listening RPC socket unix:/tmp/dist-test-taskpQc0pX/test-tmp/rpc-test-515a20ef17ef4a73ae99b0fa7631f2f9.sock every 8 connection(s)
I20260927 18:38:08.643347 20850 acceptor_pool.cc:254] collecting diagnostics on the listening RPC socket unix:/tmp/dist-test-taskpQc0pX/test-tmp/rpc-test-515a20ef17ef4a73ae99b0fa7631f2f9.sock every 8 connection(s)
I20260927 18:38:08.643656 20392 rpc-test.cc:1846] Connecting to unix:/tmp/dist-test-taskpQc0pX/test-tmp/rpc-test-515a20ef17ef4a73ae99b0fa7631f2f9.sock
I20260927 18:38:10.115039 20392 rpc-test.cc:1859] Sending 1024MB via ssl-enabled unix socket: real 1.437s	user 1.785s	sys 0.854s
I20260927 18:38:11.544822 20392 rpc-test.cc:1859] Sending 1024MB via ssl-enabled unix socket: real 1.430s	user 1.858s	sys 0.774s
I20260927 18:38:12.932924 20392 rpc-test.cc:1859] Sending 1024MB via ssl-enabled unix socket: real 1.388s	user 1.745s	sys 0.812s
I20260927 18:38:14.374503 20392 rpc-test.cc:1859] Sending 1024MB via ssl-enabled unix socket: real 1.441s	user 1.754s	sys 0.887s
I20260927 18:38:15.849372 20392 rpc-test.cc:1859] Sending 1024MB via ssl-enabled unix socket: real 1.475s	user 1.926s	sys 0.785s
W20260927 18:38:15.850176 20846 connection.cc:196] Error closing socket: Network error: TlsSocket::Close: Broken pipe
[       OK ] Parameters/TestRpc.TestPerformanceBySocketType/SSL_UnixSocket (7218 ms)
[----------] 20 tests from Parameters/TestRpc (28825 ms total)

[----------] 1 test from Parameters/TestRpcSocketTxRxQueue
[ RUN      ] Parameters/TestRpcSocketTxRxQueue.AcceptorRxQueueSizeMetric/0
I20260927 18:38:15.859153 20874 acceptor_pool.cc:254] collecting diagnostics on the listening RPC socket 0.0.0.0:41471 every 1 connection(s)
I20260927 18:38:15.859210 20875 acceptor_pool.cc:254] collecting diagnostics on the listening RPC socket 0.0.0.0:41471 every 1 connection(s)
W20260927 18:38:15.860038 20870 negotiation.cc:337] Failed RPC negotiation. Trace:
0927 18:38:15.859781 (+     0us) reactor.cc:625] Submitting negotiation task for server connection from 127.0.0.1:47114 (local address 127.0.0.1:41471)
0927 18:38:15.859885 (+   104us) server_negotiation.cc:206] Beginning negotiation
0927 18:38:15.859888 (+     3us) server_negotiation.cc:399] Waiting for connection header
0927 18:38:15.859974 (+    86us) negotiation.cc:327] Negotiation complete: Network error: Server connection negotiation failed: server connection from 127.0.0.1:47114: BlockingRecv error: recv got EOF from 127.0.0.1:47114 (error 108)
Metrics: {"server-negotiator.queue_time_us":37}
[       OK ] Parameters/TestRpcSocketTxRxQueue.AcceptorRxQueueSizeMetric/0 (10 ms)
[----------] 1 test from Parameters/TestRpcSocketTxRxQueue (10 ms total)

[----------] Global test environment tear-down
[==========] 21 tests from 2 test suites ran. (28835 ms total)
[  PASSED  ] 20 tests.
[  FAILED  ] 1 test, listed below:
[  FAILED  ] Parameters/TestRpc.TestCallWithChainCertAndChainCA/SSL_UnixSocket, where GetParam() = (true, true)

 1 FAILED TEST