Diagnosed failure

Parameters/TestRpc.TestCallWithChainCertAndChainCA/SSL_UnixSocket: /data0/somelongdirectorytoavoidrpathissues/src/kudu/src/kudu/rpc/rpc-test.cc:270: Failure
Failed
Bad status: Runtime error: could not verify certificate chain (error with cert: subject=CN = localhost, ST = sadfjas, C = AS, emailAddress = sdflkdsajf, O = lskdfjlsad, OU = sldfkja, issuer=C = AS, ST = ASDfkjdhf, L = lskdjf, O = saldfja, OU = skdjf, CN = localhost, emailAddress = sadjflkadsj): : certificate has expired
Google Test trace:
/data0/somelongdirectorytoavoidrpathissues/src/kudu/src/kudu/rpc/rpc-test.cc:267: Connecting to unix:/tmp/dist-test-task0APGY1/test-tmp/rpc-test-54e3b5ba97964ac48175c328b5997f72.sock
I20260928 02:44:31.091310 15325 test_util.cc:175] -----------------------------------------------
I20260928 02:44:31.091387 15325 test_util.cc:176] Had fatal failures, leaving test files at /tmp/dist-test-task0APGY1/test-tmp/rpc-test.6.Parameters_TestRpc.TestCallWithChainCertAndChainCA_SSL_UnixSocket.1790563471015290-15325-0

Full log

Note: This is test shard 7 of 8.
[==========] Running 21 tests from 2 test suites.
[----------] Global test environment set-up.
[----------] 20 tests from Parameters/TestRpc
[ RUN      ] Parameters/TestRpc.TestMessengerCreateDestroy/SSL_UnixSocket
WARNING: Logging before InitGoogleLogging() is written to STDERR
I20260928 02:44:31.048960 15325 rpc-test.cc:169] started messenger TestCreateDestroy
[       OK ] Parameters/TestRpc.TestMessengerCreateDestroy/SSL_UnixSocket (28 ms)
[ RUN      ] Parameters/TestRpc.TestNegotiationDeadlock/SSL_UnixSocket
I20260928 02:44:31.064034 15345 acceptor_pool.cc:254] collecting diagnostics on the listening RPC socket unix:/tmp/dist-test-task0APGY1/test-tmp/rpc-test-ead8d78d819944c9ba7e85dad368a8f6.sock every 8 connection(s)
I20260928 02:44:31.064080 15346 acceptor_pool.cc:254] collecting diagnostics on the listening RPC socket unix:/tmp/dist-test-task0APGY1/test-tmp/rpc-test-ead8d78d819944c9ba7e85dad368a8f6.sock every 8 connection(s)
[       OK ] Parameters/TestRpc.TestNegotiationDeadlock/SSL_UnixSocket (23 ms)
[ RUN      ] Parameters/TestRpc.TestCallWithChainCertAndChainCA/SSL_UnixSocket
I20260928 02:44:31.085908 15361 acceptor_pool.cc:254] collecting diagnostics on the listening RPC socket unix:/tmp/dist-test-task0APGY1/test-tmp/rpc-test-54e3b5ba97964ac48175c328b5997f72.sock every 8 connection(s)
I20260928 02:44:31.085958 15362 acceptor_pool.cc:254] collecting diagnostics on the listening RPC socket unix:/tmp/dist-test-task0APGY1/test-tmp/rpc-test-54e3b5ba97964ac48175c328b5997f72.sock every 8 connection(s)
/data0/somelongdirectorytoavoidrpathissues/src/kudu/src/kudu/rpc/rpc-test.cc:270: Failure
Failed
Bad status: Runtime error: could not verify certificate chain (error with cert: subject=CN = localhost, ST = sadfjas, C = AS, emailAddress = sdflkdsajf, O = lskdfjlsad, OU = sldfkja, issuer=C = AS, ST = ASDfkjdhf, L = lskdjf, O = saldfja, OU = skdjf, CN = localhost, emailAddress = sadjflkadsj): : certificate has expired
Google Test trace:
/data0/somelongdirectorytoavoidrpathissues/src/kudu/src/kudu/rpc/rpc-test.cc:267: Connecting to unix:/tmp/dist-test-task0APGY1/test-tmp/rpc-test-54e3b5ba97964ac48175c328b5997f72.sock
I20260928 02:44:31.091310 15325 test_util.cc:175] -----------------------------------------------
I20260928 02:44:31.091387 15325 test_util.cc:176] Had fatal failures, leaving test files at /tmp/dist-test-task0APGY1/test-tmp/rpc-test.6.Parameters_TestRpc.TestCallWithChainCertAndChainCA_SSL_UnixSocket.1790563471015290-15325-0
[  FAILED  ] Parameters/TestRpc.TestCallWithChainCertAndChainCA/SSL_UnixSocket, where GetParam() = (true, true) (17 ms)
[ RUN      ] Parameters/TestRpc.TestCallWithPasswordProtectedKey/SSL_UnixSocket
I20260928 02:44:31.112493 15386 acceptor_pool.cc:254] collecting diagnostics on the listening RPC socket unix:/tmp/dist-test-task0APGY1/test-tmp/rpc-test-82d37ba09246433e999ceeacbf91540d.sock every 8 connection(s)
I20260928 02:44:31.112501 15387 acceptor_pool.cc:254] collecting diagnostics on the listening RPC socket unix:/tmp/dist-test-task0APGY1/test-tmp/rpc-test-82d37ba09246433e999ceeacbf91540d.sock every 8 connection(s)
W20260928 02:44:31.126732 15383 connection.cc:196] Error closing socket: Network error: TlsSocket::Close: Broken pipe
[       OK ] Parameters/TestRpc.TestCallWithPasswordProtectedKey/SSL_UnixSocket (36 ms)
[ RUN      ] Parameters/TestRpc.TestCallToBadServer/SSL_UnixSocket
I20260928 02:44:31.142063 15325 rpc-test.cc:394] Status: Network error: Client connection negotiation failed: client connection to 0.0.0.0:0: connect: Connection refused (error 111)
I20260928 02:44:31.142606 15325 rpc-test.cc:394] Status: Network error: Client connection negotiation failed: client connection to 0.0.0.0:0: connect: Connection refused (error 111)
I20260928 02:44:31.143055 15325 rpc-test.cc:394] Status: Network error: Client connection negotiation failed: client connection to 0.0.0.0:0: connect: Connection refused (error 111)
I20260928 02:44:31.143460 15325 rpc-test.cc:394] Status: Network error: Client connection negotiation failed: client connection to 0.0.0.0:0: connect: Connection refused (error 111)
I20260928 02:44:31.143904 15325 rpc-test.cc:394] Status: Network error: Client connection negotiation failed: client connection to 0.0.0.0:0: connect: Connection refused (error 111)
[       OK ] Parameters/TestRpc.TestCallToBadServer/SSL_UnixSocket (16 ms)
[ RUN      ] Parameters/TestRpc.TestWrongService/SSL_UnixSocket
I20260928 02:44:31.157142 15422 acceptor_pool.cc:254] collecting diagnostics on the listening RPC socket unix:/tmp/dist-test-task0APGY1/test-tmp/rpc-test-8784bb2d550f410faaf22a3d65d6b2fb.sock every 8 connection(s)
I20260928 02:44:31.157114 15421 acceptor_pool.cc:254] collecting diagnostics on the listening RPC socket unix:/tmp/dist-test-task0APGY1/test-tmp/rpc-test-8784bb2d550f410faaf22a3d65d6b2fb.sock every 8 connection(s)
I20260928 02:44:31.184625 15418 messenger.cc:345] service WrongServiceName not registered on TestServer
[       OK ] Parameters/TestRpc.TestWrongService/SSL_UnixSocket (42 ms)
[ RUN      ] Parameters/TestRpc.TestConnectionKeepalive/SSL_UnixSocket
I20260928 02:44:31.195166 15445 acceptor_pool.cc:254] collecting diagnostics on the listening RPC socket unix:/tmp/dist-test-task0APGY1/test-tmp/rpc-test-bdc1d87fd0f94b5e9c6bfcc758490dd3.sock every 8 connection(s)
I20260928 02:44:31.195188 15444 acceptor_pool.cc:254] collecting diagnostics on the listening RPC socket unix:/tmp/dist-test-task0APGY1/test-tmp/rpc-test-bdc1d87fd0f94b5e9c6bfcc758490dd3.sock every 8 connection(s)
I20260928 02:44:31.195457 15325 rpc-test.cc:488] Connecting to unix:/tmp/dist-test-task0APGY1/test-tmp/rpc-test-bdc1d87fd0f94b5e9c6bfcc758490dd3.sock
W20260928 02:44:31.689136 15457 connection.cc:196] Error closing socket: Network error: TlsSocket::Close: Broken pipe
[       OK ] Parameters/TestRpc.TestConnectionKeepalive/SSL_UnixSocket (1035 ms)
[ RUN      ] Parameters/TestRpc.TestClientConnectionMetrics/SSL_UnixSocket
I20260928 02:44:32.237314 15469 acceptor_pool.cc:254] collecting diagnostics on the listening RPC socket unix:/tmp/dist-test-task0APGY1/test-tmp/rpc-test-7acee4279b6c4d78a2972bacd2de9506.sock every 8 connection(s)
I20260928 02:44:32.237377 15470 acceptor_pool.cc:254] collecting diagnostics on the listening RPC socket unix:/tmp/dist-test-task0APGY1/test-tmp/rpc-test-7acee4279b6c4d78a2972bacd2de9506.sock every 8 connection(s)
I20260928 02:44:32.237681 15325 rpc-test.cc:569] Connecting to unix:/tmp/dist-test-task0APGY1/test-tmp/rpc-test-7acee4279b6c4d78a2972bacd2de9506.sock
W20260928 02:44:42.537338 15466 connection.cc:196] Error closing socket: Network error: TlsSocket::Close: Broken pipe
[       OK ] Parameters/TestRpc.TestClientConnectionMetrics/SSL_UnixSocket (10315 ms)
[ RUN      ] Parameters/TestRpc.TestCredentialsPolicy/SSL_UnixSocket
I20260928 02:44:42.577845 15492 acceptor_pool.cc:254] collecting diagnostics on the listening RPC socket unix:/tmp/dist-test-task0APGY1/test-tmp/rpc-test-8a0edc14879b4401a1830ebd709e5198.sock every 8 connection(s)
I20260928 02:44:42.577870 15493 acceptor_pool.cc:254] collecting diagnostics on the listening RPC socket unix:/tmp/dist-test-task0APGY1/test-tmp/rpc-test-8a0edc14879b4401a1830ebd709e5198.sock every 8 connection(s)
I20260928 02:44:42.578244 15325 rpc-test.cc:700] Connecting to unix:/tmp/dist-test-task0APGY1/test-tmp/rpc-test-8a0edc14879b4401a1830ebd709e5198.sock
W20260928 02:44:42.605472 15491 connection.cc:196] Error closing socket: Network error: TlsSocket::Close: Broken pipe
W20260928 02:44:42.612120 15491 connection.cc:196] Error closing socket: Network error: TlsSocket::Close: Broken pipe
[       OK ] Parameters/TestRpc.TestCredentialsPolicy/SSL_UnixSocket (77 ms)
[ RUN      ] Parameters/TestRpc.TestCallLongerThanKeepalive/SSL_UnixSocket
I20260928 02:44:42.642906 15517 acceptor_pool.cc:254] collecting diagnostics on the listening RPC socket unix:/tmp/dist-test-task0APGY1/test-tmp/rpc-test-7ed26846a82f40b9968c41f03e0c4547.sock every 8 connection(s)
I20260928 02:44:42.642962 15518 acceptor_pool.cc:254] collecting diagnostics on the listening RPC socket unix:/tmp/dist-test-task0APGY1/test-tmp/rpc-test-7ed26846a82f40b9968c41f03e0c4547.sock every 8 connection(s)
I20260928 02:44:42.669984 15521 rpc-test-base.h:222] got call: sleep_micros: 3000000 deferred: true
I20260928 02:44:45.670825 15521 rpcz_store.cc:275] Call kudu.rpc.GenericCalculatorService.Sleep from unix:<unnamed> (request call id 0) took 3000 ms. Trace:
I20260928 02:44:45.670939 15521 rpcz_store.cc:276] 0928 02:44:42.669898 (+     0us) service_pool.cc:170] Inserting onto call queue
0928 02:44:42.669962 (+    64us) service_pool.cc:227] Handling call
0928 02:44:45.670804 (+3000842us) inbound_call.cc:173] Queueing success response
Metrics: {}
[       OK ] Parameters/TestRpc.TestCallLongerThanKeepalive/SSL_UnixSocket (3057 ms)
[ RUN      ] Parameters/TestRpc.TestRpcSidecar/SSL_UnixSocket
I20260928 02:44:45.682094 15542 acceptor_pool.cc:254] collecting diagnostics on the listening RPC socket unix:/tmp/dist-test-task0APGY1/test-tmp/rpc-test-dfd97af96c0c4727b90b53d46f875cab.sock every 8 connection(s)
I20260928 02:44:45.682217 15543 acceptor_pool.cc:254] collecting diagnostics on the listening RPC socket unix:/tmp/dist-test-task0APGY1/test-tmp/rpc-test-dfd97af96c0c4727b90b53d46f875cab.sock every 8 connection(s)
W20260928 02:44:45.741287 15539 connection.cc:196] Error closing socket: Network error: TlsSocket::Close: Broken pipe
[       OK ] Parameters/TestRpc.TestRpcSidecar/SSL_UnixSocket (68 ms)
[ RUN      ] Parameters/TestRpc.TestRpcSidecarLimits/SSL_UnixSocket
I20260928 02:44:47.459949 15567 acceptor_pool.cc:254] collecting diagnostics on the listening RPC socket unix:/tmp/dist-test-task0APGY1/test-tmp/rpc-test-44e2a3eae84c432fb48a810c163868f1.sock every 8 connection(s)
I20260928 02:44:47.459976 15568 acceptor_pool.cc:254] collecting diagnostics on the listening RPC socket unix:/tmp/dist-test-task0APGY1/test-tmp/rpc-test-44e2a3eae84c432fb48a810c163868f1.sock every 8 connection(s)
W20260928 02:44:47.478278 15325 serialization.cc:72] Serialized kudu.rpc_test.PushStringsRequestPB (2147483654 bytes) is larger than the maximum configured RPC message size (52428800 bytes). Sending anyway, but peer may reject the data.
W20260928 02:44:47.482300 15564 connection.cc:535] server connection from unix:<unnamed> recv error: Network error: RPC frame had a length of 2147483714, but we only support messages up to 52428800 bytes long.
W20260928 02:44:47.482399 15564 connection.cc:158] shutting down server connection from unix:<unnamed> with pending inbound data: 4/2147483714 bytes received; last active 0 ns ago: status Network error: RPC frame had a length of 2147483714, but we only support messages up to 52428800 bytes long.
W20260928 02:44:47.482659 15580 connection.cc:196] Error closing socket: Network error: TlsSocket::Close: Broken pipe
I20260928 02:44:47.503911 15592 acceptor_pool.cc:254] collecting diagnostics on the listening RPC socket unix:/tmp/dist-test-task0APGY1/test-tmp/rpc-test-44e2a3eae84c432fb48a810c163868f1.sock every 8 connection(s)
I20260928 02:44:47.504073 15593 acceptor_pool.cc:254] collecting diagnostics on the listening RPC socket unix:/tmp/dist-test-task0APGY1/test-tmp/rpc-test-44e2a3eae84c432fb48a810c163868f1.sock every 8 connection(s)
W20260928 02:44:52.325204 15589 connection.cc:577] server connection from unix:<unnamed>: received bad data: 'Corruption: Invalid packet: message had a length of 2147483710, but we only support messages up to 2147483647 bytes
'
W20260928 02:44:52.325551 15605 connection.cc:196] Error closing socket: Network error: TlsSocket::Close: Broken pipe
[       OK ] Parameters/TestRpc.TestRpcSidecarLimits/SSL_UnixSocket (6585 ms)
[ RUN      ] Parameters/TestRpc.TestCallTimeoutDoesntAffectNegotiation/SSL_UnixSocket
I20260928 02:44:52.351162 15617 acceptor_pool.cc:254] collecting diagnostics on the listening RPC socket unix:/tmp/dist-test-task0APGY1/test-tmp/rpc-test-c7024984514a45499085dc9978a8f531.sock every 8 connection(s)
I20260928 02:44:52.351195 15618 acceptor_pool.cc:254] collecting diagnostics on the listening RPC socket unix:/tmp/dist-test-task0APGY1/test-tmp/rpc-test-c7024984514a45499085dc9978a8f531.sock every 8 connection(s)
W20260928 02:44:52.361991 15613 negotiation.cc:266] Injecting 500ms delay in negotiation
I20260928 02:44:52.412423 15325 rpc-test-base.h:595] status: Timed out: connection negotiation to unix:/tmp/dist-test-task0APGY1/test-tmp/rpc-test-c7024984514a45499085dc9978a8f531.sock for RPC Sleep timed out after 0.050s (ON_OUTBOUND_QUEUE), seconds elapsed: 0.0509782
W20260928 02:44:52.867322 15614 connection.cc:196] Error closing socket: Network error: TlsSocket::Close: Broken pipe
[       OK ] Parameters/TestRpc.TestCallTimeoutDoesntAffectNegotiation/SSL_UnixSocket (540 ms)
[ RUN      ] Parameters/TestRpc.TestRpcHandlerLatencyMetric/SSL_UnixSocket
I20260928 02:44:52.877620 15642 acceptor_pool.cc:254] collecting diagnostics on the listening RPC socket unix:/tmp/dist-test-task0APGY1/test-tmp/rpc-test-205417610fc041e38767776469528ee0.sock every 8 connection(s)
I20260928 02:44:52.877743 15643 acceptor_pool.cc:254] collecting diagnostics on the listening RPC socket unix:/tmp/dist-test-task0APGY1/test-tmp/rpc-test-205417610fc041e38767776469528ee0.sock every 8 connection(s)
I20260928 02:44:52.913558 15325 rpc-test.cc:1236] Sleep() min lat: 20374
I20260928 02:44:52.913630 15325 rpc-test.cc:1237] Sleep() mean lat: 20374
I20260928 02:44:52.913657 15325 rpc-test.cc:1238] Sleep() max lat: 20374
I20260928 02:44:52.913671 15325 rpc-test.cc:1239] Sleep() #calls: 1
W20260928 02:44:52.914503 15639 connection.cc:196] Error closing socket: Network error: TlsSocket::Close: Broken pipe
[       OK ] Parameters/TestRpc.TestRpcHandlerLatencyMetric/SSL_UnixSocket (47 ms)
[ RUN      ] Parameters/TestRpc.TimedOutOnResponseMetricServiceQueue/SSL_UnixSocket
I20260928 02:44:52.926491 15668 acceptor_pool.cc:254] collecting diagnostics on the listening RPC socket unix:/tmp/dist-test-task0APGY1/test-tmp/rpc-test-73d3400630834873b7dc0abab832a99b.sock every 8 connection(s)
I20260928 02:44:52.926506 15669 acceptor_pool.cc:254] collecting diagnostics on the listening RPC socket unix:/tmp/dist-test-task0APGY1/test-tmp/rpc-test-73d3400630834873b7dc0abab832a99b.sock every 8 connection(s)
W20260928 02:44:52.982466 15670 rpcz_store.cc:267] Call kudu.rpc_test.CalculatorService.Sleep from unix:<unnamed> (request call id 2) took 20 ms (client timeout 20 ms). Trace:
W20260928 02:44:52.982592 15670 rpcz_store.cc:269] 0928 02:44:52.961990 (+     0us) service_pool.cc:170] Inserting onto call queue
0928 02:44:52.982415 (+ 20425us) service_pool.cc:214] Skipping call since client already timed out
0928 02:44:52.982446 (+    31us) inbound_call.cc:173] Queueing failure response
Metrics: {}
W20260928 02:44:52.983349 15665 connection.cc:196] Error closing socket: Network error: TlsSocket::Close: Broken pipe
[       OK ] Parameters/TestRpc.TimedOutOnResponseMetricServiceQueue/SSL_UnixSocket (68 ms)
[ RUN      ] Parameters/TestRpc.RpcPendingConnectionsMetric/SSL_UnixSocket
I20260928 02:44:52.986943 15691 acceptor_pool.cc:254] collecting diagnostics on the listening RPC socket 0.0.0.0:38769 every 8 connection(s)
I20260928 02:44:52.987003 15692 acceptor_pool.cc:254] collecting diagnostics on the listening RPC socket 0.0.0.0:38769 every 8 connection(s)
W20260928 02:44:52.988122 15687 negotiation.cc:337] Failed RPC negotiation. Trace:
0928 02:44:52.987743 (+     0us) reactor.cc:625] Submitting negotiation task for server connection from 127.0.0.1:54718 (local address 127.0.0.1:38769)
0928 02:44:52.987831 (+    88us) server_negotiation.cc:206] Beginning negotiation
0928 02:44:52.987834 (+     3us) server_negotiation.cc:399] Waiting for connection header
0928 02:44:52.987927 (+    93us) negotiation.cc:327] Negotiation complete: Network error: Server connection negotiation failed: server connection from 127.0.0.1:54718: BlockingRecv error: recv got EOF from 127.0.0.1:54718 (error 108)
Metrics: {"server-negotiator.queue_time_us":21}
[       OK ] Parameters/TestRpc.RpcPendingConnectionsMetric/SSL_UnixSocket (14 ms)
[ RUN      ] Parameters/TestRpc.TestRpcContextClientDeadline/SSL_UnixSocket
I20260928 02:44:53.008606 15707 acceptor_pool.cc:254] collecting diagnostics on the listening RPC socket unix:/tmp/dist-test-task0APGY1/test-tmp/rpc-test-561f7d55c7154b3a99342f20fd8f2b21.sock every 8 connection(s)
I20260928 02:44:53.008656 15708 acceptor_pool.cc:254] collecting diagnostics on the listening RPC socket unix:/tmp/dist-test-task0APGY1/test-tmp/rpc-test-561f7d55c7154b3a99342f20fd8f2b21.sock every 8 connection(s)
[       OK ] Parameters/TestRpc.TestRpcContextClientDeadline/SSL_UnixSocket (52 ms)
[ RUN      ] Parameters/TestRpc.TestApplicationFeatureFlagUnsupportedServer/SSL_UnixSocket
I20260928 02:44:53.076082 15732 acceptor_pool.cc:254] collecting diagnostics on the listening RPC socket unix:/tmp/dist-test-task0APGY1/test-tmp/rpc-test-5e0c40c2526b4f31b3c6a853f114304f.sock every 8 connection(s)
I20260928 02:44:53.076131 15733 acceptor_pool.cc:254] collecting diagnostics on the listening RPC socket unix:/tmp/dist-test-task0APGY1/test-tmp/rpc-test-5e0c40c2526b4f31b3c6a853f114304f.sock every 8 connection(s)
[       OK ] Parameters/TestRpc.TestApplicationFeatureFlagUnsupportedServer/SSL_UnixSocket (46 ms)
[ RUN      ] Parameters/TestRpc.TestCancellationAsync/SSL_UnixSocket
I20260928 02:44:53.115110 15757 acceptor_pool.cc:254] collecting diagnostics on the listening RPC socket unix:/tmp/dist-test-task0APGY1/test-tmp/rpc-test-498732064dfc4e1aa4ea4e58ee42e351.sock every 8 connection(s)
I20260928 02:44:53.115141 15758 acceptor_pool.cc:254] collecting diagnostics on the listening RPC socket unix:/tmp/dist-test-task0APGY1/test-tmp/rpc-test-498732064dfc4e1aa4ea4e58ee42e351.sock every 8 connection(s)
I20260928 02:44:53.115473 15325 rpc-test.cc:1716] Connecting to unix:/tmp/dist-test-task0APGY1/test-tmp/rpc-test-498732064dfc4e1aa4ea4e58ee42e351.sock
I20260928 02:44:53.122547 15325 test_util.cc:268] Using random seed: 217354738
I20260928 02:44:53.145870 15761 rpc-test-base.h:240] got call: sleep_micros: 500 pattern: 4294967295 num_repetitions: 2097152 sidecar_idx: 0
I20260928 02:44:53.164628 15761 rpc-test-base.h:240] got call: sleep_micros: 500 pattern: 4294967295 num_repetitions: 2097152 sidecar_idx: 0
I20260928 02:44:53.181651 15760 rpc-test-base.h:240] got call: sleep_micros: 500 pattern: 4294967295 num_repetitions: 2097152 sidecar_idx: 0
I20260928 02:44:53.198167 15761 rpc-test-base.h:240] got call: sleep_micros: 500 pattern: 4294967295 num_repetitions: 2097152 sidecar_idx: 0
I20260928 02:44:53.214576 15760 rpc-test-base.h:240] got call: sleep_micros: 500 pattern: 4294967295 num_repetitions: 2097152 sidecar_idx: 0
I20260928 02:44:53.230285 15761 rpc-test-base.h:240] got call: sleep_micros: 500 pattern: 4294967295 num_repetitions: 2097152 sidecar_idx: 0
I20260928 02:44:53.245872 15760 rpc-test-base.h:240] got call: sleep_micros: 500 pattern: 4294967295 num_repetitions: 2097152 sidecar_idx: 0
I20260928 02:44:53.261463 15761 rpc-test-base.h:240] got call: sleep_micros: 500 pattern: 4294967295 num_repetitions: 2097152 sidecar_idx: 0
W20260928 02:44:53.263047 15754 connection.cc:196] Error closing socket: Network error: TlsSocket::Close: Broken pipe
W20260928 02:44:53.271236 15754 connection.cc:441] server connection from unix:<unnamed> torn down before Call kudu.rpc.GenericCalculatorService.SleepWithSidecar from unix:<unnamed> (request call id 8) could send its response
W20260928 02:44:53.283496 15754 connection.cc:441] server connection from unix:<unnamed> torn down before Call kudu.rpc.GenericCalculatorService.SleepWithSidecar from unix:<unnamed> (request call id 9) could send its response
[       OK ] Parameters/TestRpc.TestCancellationAsync/SSL_UnixSocket (186 ms)
[ RUN      ] Parameters/TestRpc.TestPerformanceBySocketType/SSL_UnixSocket
I20260928 02:44:53.300940 15782 acceptor_pool.cc:254] collecting diagnostics on the listening RPC socket unix:/tmp/dist-test-task0APGY1/test-tmp/rpc-test-77fbbfd0bfa84f4fa7e86e176068bac5.sock every 8 connection(s)
I20260928 02:44:53.300987 15783 acceptor_pool.cc:254] collecting diagnostics on the listening RPC socket unix:/tmp/dist-test-task0APGY1/test-tmp/rpc-test-77fbbfd0bfa84f4fa7e86e176068bac5.sock every 8 connection(s)
I20260928 02:44:53.301311 15325 rpc-test.cc:1846] Connecting to unix:/tmp/dist-test-task0APGY1/test-tmp/rpc-test-77fbbfd0bfa84f4fa7e86e176068bac5.sock
I20260928 02:44:54.849077 15325 rpc-test.cc:1859] Sending 1024MB via ssl-enabled unix socket: real 1.541s	user 1.861s	sys 0.925s
I20260928 02:44:56.442714 15325 rpc-test.cc:1859] Sending 1024MB via ssl-enabled unix socket: real 1.594s	user 1.897s	sys 0.991s
I20260928 02:44:58.015020 15325 rpc-test.cc:1859] Sending 1024MB via ssl-enabled unix socket: real 1.572s	user 1.942s	sys 0.912s
I20260928 02:44:59.543834 15325 rpc-test.cc:1859] Sending 1024MB via ssl-enabled unix socket: real 1.529s	user 1.933s	sys 0.843s
I20260928 02:45:01.229986 15325 rpc-test.cc:1859] Sending 1024MB via ssl-enabled unix socket: real 1.686s	user 2.040s	sys 0.987s
[       OK ] Parameters/TestRpc.TestPerformanceBySocketType/SSL_UnixSocket (7947 ms)
[----------] 20 tests from Parameters/TestRpc (30210 ms total)

[----------] 1 test from Parameters/TestRpcSocketTxRxQueue
[ RUN      ] Parameters/TestRpcSocketTxRxQueue.AcceptorRxQueueSizeMetric/0
I20260928 02:45:01.239935 15807 acceptor_pool.cc:254] collecting diagnostics on the listening RPC socket 0.0.0.0:37657 every 1 connection(s)
I20260928 02:45:01.240072 15808 acceptor_pool.cc:254] collecting diagnostics on the listening RPC socket 0.0.0.0:37657 every 1 connection(s)
W20260928 02:45:01.241037 15803 negotiation.cc:337] Failed RPC negotiation. Trace:
0928 02:45:01.240713 (+     0us) reactor.cc:625] Submitting negotiation task for server connection from 127.0.0.1:37040 (local address 127.0.0.1:37657)
0928 02:45:01.240864 (+   151us) server_negotiation.cc:206] Beginning negotiation
0928 02:45:01.240867 (+     3us) server_negotiation.cc:399] Waiting for connection header
0928 02:45:01.240966 (+    99us) negotiation.cc:327] Negotiation complete: Network error: Server connection negotiation failed: server connection from 127.0.0.1:37040: BlockingRecv error: recv got EOF from 127.0.0.1:37040 (error 108)
Metrics: {"server-negotiator.queue_time_us":66}
[       OK ] Parameters/TestRpcSocketTxRxQueue.AcceptorRxQueueSizeMetric/0 (11 ms)
[----------] 1 test from Parameters/TestRpcSocketTxRxQueue (11 ms total)

[----------] Global test environment tear-down
[==========] 21 tests from 2 test suites ran. (30221 ms total)
[  PASSED  ] 20 tests.
[  FAILED  ] 1 test, listed below:
[  FAILED  ] Parameters/TestRpc.TestCallWithChainCertAndChainCA/SSL_UnixSocket, where GetParam() = (true, true)

 1 FAILED TEST