Diagnosed failure
Parameters/TestRpc.TestCallWithChainCertAndChainCA/SSL_UnixSocket: /data0/somelongdirectorytoavoidrpathissues/src/kudu/src/kudu/rpc/rpc-test.cc:270: Failure
Failed
Bad status: Runtime error: could not verify certificate chain (error with cert: subject=CN = localhost, ST = sadfjas, C = AS, emailAddress = sdflkdsajf, O = lskdfjlsad, OU = sldfkja, issuer=C = AS, ST = ASDfkjdhf, L = lskdjf, O = saldfja, OU = skdjf, CN = localhost, emailAddress = sadjflkadsj): : certificate has expired
Google Test trace:
/data0/somelongdirectorytoavoidrpathissues/src/kudu/src/kudu/rpc/rpc-test.cc:267: Connecting to unix:/tmp/dist-test-taskqHATj4/test-tmp/rpc-test-f46d239448de45c4a332570b3d2caabe.sock
I20260928 11:44:51.597613 1410 test_util.cc:175] -----------------------------------------------
I20260928 11:44:51.597783 1410 test_util.cc:176] Had fatal failures, leaving test files at /tmp/dist-test-taskqHATj4/test-tmp/rpc-test.6.Parameters_TestRpc.TestCallWithChainCertAndChainCA_SSL_UnixSocket.1790595890305118-1410-0
Full log
Note: This is test shard 7 of 8.
[==========] Running 21 tests from 2 test suites.
[----------] Global test environment set-up.
[----------] 20 tests from Parameters/TestRpc
[ RUN ] Parameters/TestRpc.TestMessengerCreateDestroy/SSL_UnixSocket
WARNING: Logging before InitGoogleLogging() is written to STDERR
I20260928 11:44:50.392275 1410 rpc-test.cc:169] started messenger TestCreateDestroy
[ OK ] Parameters/TestRpc.TestMessengerCreateDestroy/SSL_UnixSocket (1092 ms)
[ RUN ] Parameters/TestRpc.TestNegotiationDeadlock/SSL_UnixSocket
I20260928 11:44:51.479215 1432 acceptor_pool.cc:254] collecting diagnostics on the listening RPC socket unix:/tmp/dist-test-taskqHATj4/test-tmp/rpc-test-f44010898c2a4fcc91ee476a205e56be.sock every 8 connection(s)
I20260928 11:44:51.480505 1433 acceptor_pool.cc:254] collecting diagnostics on the listening RPC socket unix:/tmp/dist-test-taskqHATj4/test-tmp/rpc-test-f44010898c2a4fcc91ee476a205e56be.sock every 8 connection(s)
[ OK ] Parameters/TestRpc.TestNegotiationDeadlock/SSL_UnixSocket (79 ms)
[ RUN ] Parameters/TestRpc.TestCallWithChainCertAndChainCA/SSL_UnixSocket
I20260928 11:44:51.571739 1448 acceptor_pool.cc:254] collecting diagnostics on the listening RPC socket unix:/tmp/dist-test-taskqHATj4/test-tmp/rpc-test-f46d239448de45c4a332570b3d2caabe.sock every 8 connection(s)
I20260928 11:44:51.573616 1449 acceptor_pool.cc:254] collecting diagnostics on the listening RPC socket unix:/tmp/dist-test-taskqHATj4/test-tmp/rpc-test-f46d239448de45c4a332570b3d2caabe.sock every 8 connection(s)
/data0/somelongdirectorytoavoidrpathissues/src/kudu/src/kudu/rpc/rpc-test.cc:270: Failure
Failed
Bad status: Runtime error: could not verify certificate chain (error with cert: subject=CN = localhost, ST = sadfjas, C = AS, emailAddress = sdflkdsajf, O = lskdfjlsad, OU = sldfkja, issuer=C = AS, ST = ASDfkjdhf, L = lskdjf, O = saldfja, OU = skdjf, CN = localhost, emailAddress = sadjflkadsj): : certificate has expired
Google Test trace:
/data0/somelongdirectorytoavoidrpathissues/src/kudu/src/kudu/rpc/rpc-test.cc:267: Connecting to unix:/tmp/dist-test-taskqHATj4/test-tmp/rpc-test-f46d239448de45c4a332570b3d2caabe.sock
I20260928 11:44:51.597613 1410 test_util.cc:175] -----------------------------------------------
I20260928 11:44:51.597783 1410 test_util.cc:176] Had fatal failures, leaving test files at /tmp/dist-test-taskqHATj4/test-tmp/rpc-test.6.Parameters_TestRpc.TestCallWithChainCertAndChainCA_SSL_UnixSocket.1790595890305118-1410-0
[ FAILED ] Parameters/TestRpc.TestCallWithChainCertAndChainCA/SSL_UnixSocket, where GetParam() = (true, true) (71 ms)
[ RUN ] Parameters/TestRpc.TestCallWithPasswordProtectedKey/SSL_UnixSocket
I20260928 11:44:51.616833 1473 acceptor_pool.cc:254] collecting diagnostics on the listening RPC socket unix:/tmp/dist-test-taskqHATj4/test-tmp/rpc-test-af70ef651cbe4e3a85c487e8d8ce58fe.sock every 8 connection(s)
I20260928 11:44:51.617501 1474 acceptor_pool.cc:254] collecting diagnostics on the listening RPC socket unix:/tmp/dist-test-taskqHATj4/test-tmp/rpc-test-af70ef651cbe4e3a85c487e8d8ce58fe.sock every 8 connection(s)
W20260928 11:44:51.655169 1470 connection.cc:196] Error closing socket: Network error: TlsSocket::Close: Broken pipe
[ OK ] Parameters/TestRpc.TestCallWithPasswordProtectedKey/SSL_UnixSocket (63 ms)
[ RUN ] Parameters/TestRpc.TestCallToBadServer/SSL_UnixSocket
I20260928 11:44:51.677520 1410 rpc-test.cc:394] Status: Network error: Client connection negotiation failed: client connection to 0.0.0.0:0: connect: Connection refused (error 111)
I20260928 11:44:51.678771 1410 rpc-test.cc:394] Status: Network error: Client connection negotiation failed: client connection to 0.0.0.0:0: connect: Connection refused (error 111)
I20260928 11:44:51.679883 1410 rpc-test.cc:394] Status: Network error: Client connection negotiation failed: client connection to 0.0.0.0:0: connect: Connection refused (error 111)
I20260928 11:44:51.680968 1410 rpc-test.cc:394] Status: Network error: Client connection negotiation failed: client connection to 0.0.0.0:0: connect: Connection refused (error 111)
I20260928 11:44:51.682051 1410 rpc-test.cc:394] Status: Network error: Client connection negotiation failed: client connection to 0.0.0.0:0: connect: Connection refused (error 111)
[ OK ] Parameters/TestRpc.TestCallToBadServer/SSL_UnixSocket (23 ms)
[ RUN ] Parameters/TestRpc.TestWrongService/SSL_UnixSocket
I20260928 11:44:51.716801 1508 acceptor_pool.cc:254] collecting diagnostics on the listening RPC socket unix:/tmp/dist-test-taskqHATj4/test-tmp/rpc-test-dd67654931d94c4fb3ace72ca20be05e.sock every 8 connection(s)
I20260928 11:44:51.717589 1509 acceptor_pool.cc:254] collecting diagnostics on the listening RPC socket unix:/tmp/dist-test-taskqHATj4/test-tmp/rpc-test-dd67654931d94c4fb3ace72ca20be05e.sock every 8 connection(s)
I20260928 11:44:51.748646 1505 messenger.cc:345] service WrongServiceName not registered on TestServer
W20260928 11:44:51.751432 1505 connection.cc:196] Error closing socket: Network error: TlsSocket::Close: Broken pipe
[ OK ] Parameters/TestRpc.TestWrongService/SSL_UnixSocket (71 ms)
[ RUN ] Parameters/TestRpc.TestConnectionKeepalive/SSL_UnixSocket
I20260928 11:44:51.781387 1531 acceptor_pool.cc:254] collecting diagnostics on the listening RPC socket unix:/tmp/dist-test-taskqHATj4/test-tmp/rpc-test-3cdf778d30fd4ba88a18aca8a52ed5b4.sock every 8 connection(s)
I20260928 11:44:51.782111 1532 acceptor_pool.cc:254] collecting diagnostics on the listening RPC socket unix:/tmp/dist-test-taskqHATj4/test-tmp/rpc-test-3cdf778d30fd4ba88a18aca8a52ed5b4.sock every 8 connection(s)
I20260928 11:44:51.785122 1410 rpc-test.cc:488] Connecting to unix:/tmp/dist-test-taskqHATj4/test-tmp/rpc-test-3cdf778d30fd4ba88a18aca8a52ed5b4.sock
W20260928 11:44:52.259564 1544 connection.cc:196] Error closing socket: Network error: TlsSocket::Close: Broken pipe
[ OK ] Parameters/TestRpc.TestConnectionKeepalive/SSL_UnixSocket (1078 ms)
[ RUN ] Parameters/TestRpc.TestClientConnectionMetrics/SSL_UnixSocket
I20260928 11:44:52.853631 1556 acceptor_pool.cc:254] collecting diagnostics on the listening RPC socket unix:/tmp/dist-test-taskqHATj4/test-tmp/rpc-test-e12fe725ddd64cc1a0fdaf3a79f4f7bb.sock every 8 connection(s)
I20260928 11:44:52.854286 1557 acceptor_pool.cc:254] collecting diagnostics on the listening RPC socket unix:/tmp/dist-test-taskqHATj4/test-tmp/rpc-test-e12fe725ddd64cc1a0fdaf3a79f4f7bb.sock every 8 connection(s)
I20260928 11:44:52.857237 1410 rpc-test.cc:569] Connecting to unix:/tmp/dist-test-taskqHATj4/test-tmp/rpc-test-e12fe725ddd64cc1a0fdaf3a79f4f7bb.sock
W20260928 11:46:59.559021 1553 connection.cc:196] Error closing socket: Network error: TlsSocket::Close: Broken pipe
[ OK ] Parameters/TestRpc.TestClientConnectionMetrics/SSL_UnixSocket (126732 ms)
[ RUN ] Parameters/TestRpc.TestCredentialsPolicy/SSL_UnixSocket
I20260928 11:46:59.591101 1591 acceptor_pool.cc:254] collecting diagnostics on the listening RPC socket unix:/tmp/dist-test-taskqHATj4/test-tmp/rpc-test-f2aa27ec3e2b423c9198a6ac657d9e74.sock every 8 connection(s)
I20260928 11:46:59.591884 1592 acceptor_pool.cc:254] collecting diagnostics on the listening RPC socket unix:/tmp/dist-test-taskqHATj4/test-tmp/rpc-test-f2aa27ec3e2b423c9198a6ac657d9e74.sock every 8 connection(s)
I20260928 11:46:59.594899 1410 rpc-test.cc:700] Connecting to unix:/tmp/dist-test-taskqHATj4/test-tmp/rpc-test-f2aa27ec3e2b423c9198a6ac657d9e74.sock
W20260928 11:46:59.628389 1590 connection.cc:196] Error closing socket: Network error: TlsSocket::Close: Broken pipe
[ OK ] Parameters/TestRpc.TestCredentialsPolicy/SSL_UnixSocket (79 ms)
[ RUN ] Parameters/TestRpc.TestCallLongerThanKeepalive/SSL_UnixSocket
I20260928 11:46:59.680677 1616 acceptor_pool.cc:254] collecting diagnostics on the listening RPC socket unix:/tmp/dist-test-taskqHATj4/test-tmp/rpc-test-03bfdf467dbd44ce9f40d25d42f51ee0.sock every 8 connection(s)
I20260928 11:46:59.681346 1617 acceptor_pool.cc:254] collecting diagnostics on the listening RPC socket unix:/tmp/dist-test-taskqHATj4/test-tmp/rpc-test-03bfdf467dbd44ce9f40d25d42f51ee0.sock every 8 connection(s)
I20260928 11:46:59.713135 1620 rpc-test-base.h:222] got call: sleep_micros: 3000000 deferred: true
I20260928 11:47:02.717422 1620 rpcz_store.cc:275] Call kudu.rpc.GenericCalculatorService.Sleep from unix:<unnamed> (request call id 0) took 3004 ms. Trace:
I20260928 11:47:02.717814 1620 rpcz_store.cc:276] 0928 11:46:59.712999 (+ 0us) service_pool.cc:170] Inserting onto call queue
0928 11:46:59.713087 (+ 88us) service_pool.cc:227] Handling call
0928 11:47:02.717262 (+3004175us) inbound_call.cc:173] Queueing success response
Metrics: {}
W20260928 11:47:02.722149 1613 connection.cc:196] Error closing socket: Network error: TlsSocket::Close: Broken pipe
[ OK ] Parameters/TestRpc.TestCallLongerThanKeepalive/SSL_UnixSocket (3083 ms)
[ RUN ] Parameters/TestRpc.TestRpcSidecar/SSL_UnixSocket
I20260928 11:47:02.759542 1642 acceptor_pool.cc:254] collecting diagnostics on the listening RPC socket unix:/tmp/dist-test-taskqHATj4/test-tmp/rpc-test-7501a02912ea428f9df83fa378842c77.sock every 8 connection(s)
I20260928 11:47:02.760331 1643 acceptor_pool.cc:254] collecting diagnostics on the listening RPC socket unix:/tmp/dist-test-taskqHATj4/test-tmp/rpc-test-7501a02912ea428f9df83fa378842c77.sock every 8 connection(s)
W20260928 11:47:03.247938 1639 connection.cc:196] Error closing socket: Network error: TlsSocket::Close: Broken pipe
[ OK ] Parameters/TestRpc.TestRpcSidecar/SSL_UnixSocket (523 ms)
[ RUN ] Parameters/TestRpc.TestRpcSidecarLimits/SSL_UnixSocket
I20260928 11:47:18.509781 1668 acceptor_pool.cc:254] collecting diagnostics on the listening RPC socket unix:/tmp/dist-test-taskqHATj4/test-tmp/rpc-test-1e157f8b4e9247e4bd2c8e595b7c8adc.sock every 8 connection(s)
I20260928 11:47:18.510579 1669 acceptor_pool.cc:254] collecting diagnostics on the listening RPC socket unix:/tmp/dist-test-taskqHATj4/test-tmp/rpc-test-1e157f8b4e9247e4bd2c8e595b7c8adc.sock every 8 connection(s)
W20260928 11:47:18.534507 1410 serialization.cc:72] Serialized kudu.rpc_test.PushStringsRequestPB (2147483654 bytes) is larger than the maximum configured RPC message size (52428800 bytes). Sending anyway, but peer may reject the data.
W20260928 11:47:18.544662 1665 connection.cc:535] server connection from unix:<unnamed> recv error: Network error: RPC frame had a length of 2147483714, but we only support messages up to 52428800 bytes long.
W20260928 11:47:18.545055 1665 connection.cc:158] shutting down server connection from unix:<unnamed> with pending inbound data: 4/2147483714 bytes received; last active 0 ns ago: status Network error: RPC frame had a length of 2147483714, but we only support messages up to 52428800 bytes long.
W20260928 11:47:18.545902 1681 connection.cc:698] client connection to unix:/tmp/dist-test-taskqHATj4/test-tmp/rpc-test-1e157f8b4e9247e4bd2c8e595b7c8adc.sock send error: Network error: failed to write to TLS socket: Broken pipe
W20260928 11:47:18.546482 1681 connection.cc:196] Error closing socket: Network error: TlsSocket::Close: Success
[ OK ] Parameters/TestRpc.TestRpcSidecarLimits/SSL_UnixSocket (15989 ms)
[ RUN ] Parameters/TestRpc.TestCallTimeoutDoesntAffectNegotiation/SSL_UnixSocket
I20260928 11:47:19.294574 1693 acceptor_pool.cc:254] collecting diagnostics on the listening RPC socket unix:/tmp/dist-test-taskqHATj4/test-tmp/rpc-test-c8860393cb4544ddad7f955be9efb90b.sock every 8 connection(s)
I20260928 11:47:19.295226 1694 acceptor_pool.cc:254] collecting diagnostics on the listening RPC socket unix:/tmp/dist-test-taskqHATj4/test-tmp/rpc-test-c8860393cb4544ddad7f955be9efb90b.sock every 8 connection(s)
W20260928 11:47:19.315169 1689 negotiation.cc:266] Injecting 500ms delay in negotiation
I20260928 11:47:19.365694 1410 rpc-test-base.h:595] status: Timed out: connection negotiation to unix:/tmp/dist-test-taskqHATj4/test-tmp/rpc-test-c8860393cb4544ddad7f955be9efb90b.sock for RPC Sleep timed out after 0.050s (ON_OUTBOUND_QUEUE), seconds elapsed: 0.0513651
W20260928 11:47:19.826815 1690 connection.cc:196] Error closing socket: Network error: TlsSocket::Close: Broken pipe
[ OK ] Parameters/TestRpc.TestCallTimeoutDoesntAffectNegotiation/SSL_UnixSocket (588 ms)
[ RUN ] Parameters/TestRpc.TestRpcHandlerLatencyMetric/SSL_UnixSocket
I20260928 11:47:19.867105 1718 acceptor_pool.cc:254] collecting diagnostics on the listening RPC socket unix:/tmp/dist-test-taskqHATj4/test-tmp/rpc-test-9fa827f1e51e40448aff93c1fb3ca9e8.sock every 8 connection(s)
I20260928 11:47:19.867765 1719 acceptor_pool.cc:254] collecting diagnostics on the listening RPC socket unix:/tmp/dist-test-taskqHATj4/test-tmp/rpc-test-9fa827f1e51e40448aff93c1fb3ca9e8.sock every 8 connection(s)
I20260928 11:47:19.915294 1410 rpc-test.cc:1236] Sleep() min lat: 21378
I20260928 11:47:19.915472 1410 rpc-test.cc:1237] Sleep() mean lat: 21378
I20260928 11:47:19.915648 1410 rpc-test.cc:1238] Sleep() max lat: 21378
I20260928 11:47:19.915787 1410 rpc-test.cc:1239] Sleep() #calls: 1
[ OK ] Parameters/TestRpc.TestRpcHandlerLatencyMetric/SSL_UnixSocket (91 ms)
[ RUN ] Parameters/TestRpc.TimedOutOnResponseMetricServiceQueue/SSL_UnixSocket
I20260928 11:47:19.942731 1744 acceptor_pool.cc:254] collecting diagnostics on the listening RPC socket unix:/tmp/dist-test-taskqHATj4/test-tmp/rpc-test-d0a68b8ccc9e4ac5972b46b3c1d9a518.sock every 8 connection(s)
I20260928 11:47:19.943374 1745 acceptor_pool.cc:254] collecting diagnostics on the listening RPC socket unix:/tmp/dist-test-taskqHATj4/test-tmp/rpc-test-d0a68b8ccc9e4ac5972b46b3c1d9a518.sock every 8 connection(s)
W20260928 11:47:20.032099 1746 rpcz_store.cc:267] Call kudu.rpc_test.CalculatorService.Sleep from unix:<unnamed> (request call id 2) took 20 ms (client timeout 20 ms). Trace:
W20260928 11:47:20.032419 1746 rpcz_store.cc:269] 0928 11:47:20.011753 (+ 0us) service_pool.cc:170] Inserting onto call queue
0928 11:47:20.031979 (+ 20226us) service_pool.cc:214] Skipping call since client already timed out
0928 11:47:20.032052 (+ 73us) inbound_call.cc:173] Queueing failure response
Metrics: {}
[ OK ] Parameters/TestRpc.TimedOutOnResponseMetricServiceQueue/SSL_UnixSocket (116 ms)
[ RUN ] Parameters/TestRpc.RpcPendingConnectionsMetric/SSL_UnixSocket
I20260928 11:47:20.047715 1767 acceptor_pool.cc:254] collecting diagnostics on the listening RPC socket 0.0.0.0:44733 every 8 connection(s)
I20260928 11:47:20.048388 1768 acceptor_pool.cc:254] collecting diagnostics on the listening RPC socket 0.0.0.0:44733 every 8 connection(s)
W20260928 11:47:20.052893 1763 negotiation.cc:337] Failed RPC negotiation. Trace:
0928 11:47:20.051797 (+ 0us) reactor.cc:625] Submitting negotiation task for server connection from 127.0.0.1:34666 (local address 127.0.0.1:44733)
0928 11:47:20.052147 (+ 350us) server_negotiation.cc:206] Beginning negotiation
0928 11:47:20.052164 (+ 17us) server_negotiation.cc:399] Waiting for connection header
0928 11:47:20.052367 (+ 203us) negotiation.cc:327] Negotiation complete: Network error: Server connection negotiation failed: server connection from 127.0.0.1:34666: BlockingRecv error: recv got EOF from 127.0.0.1:34666 (error 108)
Metrics: {"server-negotiator.queue_time_us":81}
[ OK ] Parameters/TestRpc.RpcPendingConnectionsMetric/SSL_UnixSocket (27 ms)
[ RUN ] Parameters/TestRpc.TestRpcContextClientDeadline/SSL_UnixSocket
I20260928 11:47:20.094218 1783 acceptor_pool.cc:254] collecting diagnostics on the listening RPC socket unix:/tmp/dist-test-taskqHATj4/test-tmp/rpc-test-fdea1f7c681943048705bc538685e2ff.sock every 8 connection(s)
I20260928 11:47:20.094882 1784 acceptor_pool.cc:254] collecting diagnostics on the listening RPC socket unix:/tmp/dist-test-taskqHATj4/test-tmp/rpc-test-fdea1f7c681943048705bc538685e2ff.sock every 8 connection(s)
W20260928 11:47:20.151464 1780 connection.cc:196] Error closing socket: Network error: TlsSocket::Close: Broken pipe
[ OK ] Parameters/TestRpc.TestRpcContextClientDeadline/SSL_UnixSocket (89 ms)
[ RUN ] Parameters/TestRpc.TestApplicationFeatureFlagUnsupportedServer/SSL_UnixSocket
I20260928 11:47:20.175590 1808 acceptor_pool.cc:254] collecting diagnostics on the listening RPC socket unix:/tmp/dist-test-taskqHATj4/test-tmp/rpc-test-74bab835ef0f4d879bf5d85c91359bd1.sock every 8 connection(s)
I20260928 11:47:20.176262 1809 acceptor_pool.cc:254] collecting diagnostics on the listening RPC socket unix:/tmp/dist-test-taskqHATj4/test-tmp/rpc-test-74bab835ef0f4d879bf5d85c91359bd1.sock every 8 connection(s)
W20260928 11:47:20.208061 1805 connection.cc:196] Error closing socket: Network error: TlsSocket::Close: Broken pipe
[ OK ] Parameters/TestRpc.TestApplicationFeatureFlagUnsupportedServer/SSL_UnixSocket (57 ms)
[ RUN ] Parameters/TestRpc.TestCancellationAsync/SSL_UnixSocket
I20260928 11:47:20.230510 1833 acceptor_pool.cc:254] collecting diagnostics on the listening RPC socket unix:/tmp/dist-test-taskqHATj4/test-tmp/rpc-test-12dd4a71a6304678bc1aaaa69cd6265f.sock every 8 connection(s)
I20260928 11:47:20.231185 1834 acceptor_pool.cc:254] collecting diagnostics on the listening RPC socket unix:/tmp/dist-test-taskqHATj4/test-tmp/rpc-test-12dd4a71a6304678bc1aaaa69cd6265f.sock every 8 connection(s)
I20260928 11:47:20.234009 1410 rpc-test.cc:1716] Connecting to unix:/tmp/dist-test-taskqHATj4/test-tmp/rpc-test-12dd4a71a6304678bc1aaaa69cd6265f.sock
I20260928 11:47:20.246886 1410 test_util.cc:268] Using random seed: -1595259310
I20260928 11:47:20.452953 1837 rpc-test-base.h:240] got call: sleep_micros: 500 pattern: 4294967295 num_repetitions: 2097152 sidecar_idx: 0
I20260928 11:47:20.642038 1836 rpc-test-base.h:240] got call: sleep_micros: 500 pattern: 4294967295 num_repetitions: 2097152 sidecar_idx: 0
I20260928 11:47:20.897668 1837 rpc-test-base.h:240] got call: sleep_micros: 500 pattern: 4294967295 num_repetitions: 2097152 sidecar_idx: 0
W20260928 11:47:20.957634 1846 outbound_call.cc:322] RPC callback for RPC call kudu.rpc.GenericCalculatorService.SleepWithSidecar -> {remote=unix:/tmp/dist-test-taskqHATj4/test-tmp/rpc-test-12dd4a71a6304678bc1aaaa69cd6265f.sock, user_credentials={real_user=slave}} blocked reactor thread for 60613.9us
I20260928 11:47:21.141515 1837 rpc-test-base.h:240] got call: sleep_micros: 500 pattern: 4294967295 num_repetitions: 2097152 sidecar_idx: 0
I20260928 11:47:21.337054 1837 rpc-test-base.h:240] got call: sleep_micros: 500 pattern: 4294967295 num_repetitions: 2097152 sidecar_idx: 0
I20260928 11:47:21.531978 1836 rpc-test-base.h:240] got call: sleep_micros: 500 pattern: 4294967295 num_repetitions: 2097152 sidecar_idx: 0
I20260928 11:47:21.711937 1837 rpc-test-base.h:240] got call: sleep_micros: 500 pattern: 4294967295 num_repetitions: 2097152 sidecar_idx: 0
I20260928 11:47:21.908294 1836 rpc-test-base.h:240] got call: sleep_micros: 500 pattern: 4294967295 num_repetitions: 2097152 sidecar_idx: 0
I20260928 11:47:22.105676 1836 rpc-test-base.h:240] got call: sleep_micros: 500 pattern: 4294967295 num_repetitions: 2097152 sidecar_idx: 0
W20260928 11:47:22.127526 1830 connection.cc:196] Error closing socket: Network error: TlsSocket::Close: Broken pipe
W20260928 11:47:22.244897 1830 connection.cc:441] server connection from unix:<unnamed> torn down before Call kudu.rpc.GenericCalculatorService.SleepWithSidecar from unix:<unnamed> (request call id 9) could send its response
[ OK ] Parameters/TestRpc.TestCancellationAsync/SSL_UnixSocket (2041 ms)
[ RUN ] Parameters/TestRpc.TestPerformanceBySocketType/SSL_UnixSocket
I20260928 11:47:22.335182 1859 acceptor_pool.cc:254] collecting diagnostics on the listening RPC socket unix:/tmp/dist-test-taskqHATj4/test-tmp/rpc-test-53c67cf258124aca82492ade9182ea45.sock every 8 connection(s)
I20260928 11:47:22.336010 1860 acceptor_pool.cc:254] collecting diagnostics on the listening RPC socket unix:/tmp/dist-test-taskqHATj4/test-tmp/rpc-test-53c67cf258124aca82492ade9182ea45.sock every 8 connection(s)
I20260928 11:47:22.338893 1410 rpc-test.cc:1846] Connecting to unix:/tmp/dist-test-taskqHATj4/test-tmp/rpc-test-53c67cf258124aca82492ade9182ea45.sock
I20260928 11:47:42.570560 1410 rpc-test.cc:1859] Sending 1024MB via ssl-enabled unix socket: real 20.211s user 18.550s sys 11.668s
I20260928 11:48:02.444504 1410 rpc-test.cc:1859] Sending 1024MB via ssl-enabled unix socket: real 19.874s user 17.995s sys 11.618s
I20260928 11:48:22.324404 1410 rpc-test.cc:1859] Sending 1024MB via ssl-enabled unix socket: real 19.879s user 17.880s sys 11.700s
I20260928 11:48:42.068732 1410 rpc-test.cc:1859] Sending 1024MB via ssl-enabled unix socket: real 19.744s user 17.811s sys 11.527s
I20260928 11:49:01.777697 1410 rpc-test.cc:1859] Sending 1024MB via ssl-enabled unix socket: real 19.709s user 17.546s sys 11.707s
W20260928 11:49:01.782924 1856 connection.cc:196] Error closing socket: Network error: TlsSocket::Close: Broken pipe
[ OK ] Parameters/TestRpc.TestPerformanceBySocketType/SSL_UnixSocket (99537 ms)
[----------] 20 tests from Parameters/TestRpc (251438 ms total)
[----------] 1 test from Parameters/TestRpcSocketTxRxQueue
[ RUN ] Parameters/TestRpcSocketTxRxQueue.AcceptorRxQueueSizeMetric/0
I20260928 11:49:01.806553 1894 acceptor_pool.cc:254] collecting diagnostics on the listening RPC socket 0.0.0.0:46845 every 1 connection(s)
I20260928 11:49:01.807361 1895 acceptor_pool.cc:254] collecting diagnostics on the listening RPC socket 0.0.0.0:46845 every 1 connection(s)
W20260928 11:49:01.812362 1890 negotiation.cc:337] Failed RPC negotiation. Trace:
0928 11:49:01.811082 (+ 0us) reactor.cc:625] Submitting negotiation task for server connection from 127.0.0.1:59456 (local address 127.0.0.1:46845)
0928 11:49:01.811523 (+ 441us) server_negotiation.cc:206] Beginning negotiation
0928 11:49:01.811545 (+ 22us) server_negotiation.cc:399] Waiting for connection header
0928 11:49:01.811760 (+ 215us) negotiation.cc:327] Negotiation complete: Network error: Server connection negotiation failed: server connection from 127.0.0.1:59456: BlockingRecv error: recv got EOF from 127.0.0.1:59456 (error 108)
Metrics: {"server-negotiator.queue_time_us":94}
[ OK ] Parameters/TestRpcSocketTxRxQueue.AcceptorRxQueueSizeMetric/0 (26 ms)
[----------] 1 test from Parameters/TestRpcSocketTxRxQueue (26 ms total)
[----------] Global test environment tear-down
[==========] 21 tests from 2 test suites ran. (251465 ms total)
[ PASSED ] 20 tests.
[ FAILED ] 1 test, listed below:
[ FAILED ] Parameters/TestRpc.TestCallWithChainCertAndChainCA/SSL_UnixSocket, where GetParam() = (true, true)
1 FAILED TEST