Diagnosed failure

Parameters/TestRpc.TestCallWithChainCertAndChainCA/SSL_UnixSocket: /data0/somelongdirectorytoavoidrpathissues/src/kudu/src/kudu/rpc/rpc-test.cc:270: Failure
Failed
Bad status: Runtime error: could not verify certificate chain (error with cert: subject=CN = localhost, ST = sadfjas, C = AS, emailAddress = sdflkdsajf, O = lskdfjlsad, OU = sldfkja, issuer=C = AS, ST = ASDfkjdhf, L = lskdjf, O = saldfja, OU = skdjf, CN = localhost, emailAddress = sadjflkadsj): : certificate has expired
Google Test trace:
/data0/somelongdirectorytoavoidrpathissues/src/kudu/src/kudu/rpc/rpc-test.cc:267: Connecting to unix:/tmp/dist-test-taskKC9c0V/test-tmp/rpc-test-c74e7d82f4f342f095e60e091ddf5f43.sock
I20260928 16:34:42.657497 17521 test_util.cc:175] -----------------------------------------------
I20260928 16:34:42.657562 17521 test_util.cc:176] Had fatal failures, leaving test files at /tmp/dist-test-taskKC9c0V/test-tmp/rpc-test.6.Parameters_TestRpc.TestCallWithChainCertAndChainCA_SSL_UnixSocket.1790613282549051-17521-0

Full log

Note: This is test shard 7 of 8.
[==========] Running 21 tests from 2 test suites.
[----------] Global test environment set-up.
[----------] 20 tests from Parameters/TestRpc
[ RUN      ] Parameters/TestRpc.TestMessengerCreateDestroy/SSL_UnixSocket
WARNING: Logging before InitGoogleLogging() is written to STDERR
I20260928 16:34:42.604913 17521 rpc-test.cc:169] started messenger TestCreateDestroy
[       OK ] Parameters/TestRpc.TestMessengerCreateDestroy/SSL_UnixSocket (51 ms)
[ RUN      ] Parameters/TestRpc.TestNegotiationDeadlock/SSL_UnixSocket
I20260928 16:34:42.624876 17541 acceptor_pool.cc:254] collecting diagnostics on the listening RPC socket unix:/tmp/dist-test-taskKC9c0V/test-tmp/rpc-test-4d1fc4155b604417ae6411ca8ea75ac0.sock every 8 connection(s)
I20260928 16:34:42.624917 17542 acceptor_pool.cc:254] collecting diagnostics on the listening RPC socket unix:/tmp/dist-test-taskKC9c0V/test-tmp/rpc-test-4d1fc4155b604417ae6411ca8ea75ac0.sock every 8 connection(s)
[       OK ] Parameters/TestRpc.TestNegotiationDeadlock/SSL_UnixSocket (28 ms)
[ RUN      ] Parameters/TestRpc.TestCallWithChainCertAndChainCA/SSL_UnixSocket
I20260928 16:34:42.652055 17557 acceptor_pool.cc:254] collecting diagnostics on the listening RPC socket unix:/tmp/dist-test-taskKC9c0V/test-tmp/rpc-test-c74e7d82f4f342f095e60e091ddf5f43.sock every 8 connection(s)
I20260928 16:34:42.652102 17558 acceptor_pool.cc:254] collecting diagnostics on the listening RPC socket unix:/tmp/dist-test-taskKC9c0V/test-tmp/rpc-test-c74e7d82f4f342f095e60e091ddf5f43.sock every 8 connection(s)
/data0/somelongdirectorytoavoidrpathissues/src/kudu/src/kudu/rpc/rpc-test.cc:270: Failure
Failed
Bad status: Runtime error: could not verify certificate chain (error with cert: subject=CN = localhost, ST = sadfjas, C = AS, emailAddress = sdflkdsajf, O = lskdfjlsad, OU = sldfkja, issuer=C = AS, ST = ASDfkjdhf, L = lskdjf, O = saldfja, OU = skdjf, CN = localhost, emailAddress = sadjflkadsj): : certificate has expired
Google Test trace:
/data0/somelongdirectorytoavoidrpathissues/src/kudu/src/kudu/rpc/rpc-test.cc:267: Connecting to unix:/tmp/dist-test-taskKC9c0V/test-tmp/rpc-test-c74e7d82f4f342f095e60e091ddf5f43.sock
I20260928 16:34:42.657497 17521 test_util.cc:175] -----------------------------------------------
I20260928 16:34:42.657562 17521 test_util.cc:176] Had fatal failures, leaving test files at /tmp/dist-test-taskKC9c0V/test-tmp/rpc-test.6.Parameters_TestRpc.TestCallWithChainCertAndChainCA_SSL_UnixSocket.1790613282549051-17521-0
[  FAILED  ] Parameters/TestRpc.TestCallWithChainCertAndChainCA/SSL_UnixSocket, where GetParam() = (true, true) (21 ms)
[ RUN      ] Parameters/TestRpc.TestCallWithPasswordProtectedKey/SSL_UnixSocket
I20260928 16:34:42.668462 17583 acceptor_pool.cc:254] collecting diagnostics on the listening RPC socket unix:/tmp/dist-test-taskKC9c0V/test-tmp/rpc-test-80041e48708c4639a53b79ebc0ceb3c8.sock every 8 connection(s)
I20260928 16:34:42.668473 17584 acceptor_pool.cc:254] collecting diagnostics on the listening RPC socket unix:/tmp/dist-test-taskKC9c0V/test-tmp/rpc-test-80041e48708c4639a53b79ebc0ceb3c8.sock every 8 connection(s)
W20260928 16:34:42.683322 17580 connection.cc:196] Error closing socket: Network error: TlsSocket::Close: Broken pipe
[       OK ] Parameters/TestRpc.TestCallWithPasswordProtectedKey/SSL_UnixSocket (26 ms)
[ RUN      ] Parameters/TestRpc.TestCallToBadServer/SSL_UnixSocket
I20260928 16:34:42.695377 17521 rpc-test.cc:394] Status: Network error: Client connection negotiation failed: client connection to 0.0.0.0:0: connect: Connection refused (error 111)
I20260928 16:34:42.695858 17521 rpc-test.cc:394] Status: Network error: Client connection negotiation failed: client connection to 0.0.0.0:0: connect: Connection refused (error 111)
I20260928 16:34:42.696309 17521 rpc-test.cc:394] Status: Network error: Client connection negotiation failed: client connection to 0.0.0.0:0: connect: Connection refused (error 111)
I20260928 16:34:42.696736 17521 rpc-test.cc:394] Status: Network error: Client connection negotiation failed: client connection to 0.0.0.0:0: connect: Connection refused (error 111)
I20260928 16:34:42.697132 17521 rpc-test.cc:394] Status: Network error: Client connection negotiation failed: client connection to 0.0.0.0:0: connect: Connection refused (error 111)
[       OK ] Parameters/TestRpc.TestCallToBadServer/SSL_UnixSocket (13 ms)
[ RUN      ] Parameters/TestRpc.TestWrongService/SSL_UnixSocket
I20260928 16:34:42.708889 17618 acceptor_pool.cc:254] collecting diagnostics on the listening RPC socket unix:/tmp/dist-test-taskKC9c0V/test-tmp/rpc-test-6c7d36a8938d4b5ea269b97dfb1377f5.sock every 8 connection(s)
I20260928 16:34:42.708935 17619 acceptor_pool.cc:254] collecting diagnostics on the listening RPC socket unix:/tmp/dist-test-taskKC9c0V/test-tmp/rpc-test-6c7d36a8938d4b5ea269b97dfb1377f5.sock every 8 connection(s)
I20260928 16:34:42.727712 17615 messenger.cc:345] service WrongServiceName not registered on TestServer
[       OK ] Parameters/TestRpc.TestWrongService/SSL_UnixSocket (31 ms)
[ RUN      ] Parameters/TestRpc.TestConnectionKeepalive/SSL_UnixSocket
I20260928 16:34:42.749493 17641 acceptor_pool.cc:254] collecting diagnostics on the listening RPC socket unix:/tmp/dist-test-taskKC9c0V/test-tmp/rpc-test-56dbef9f63c74e45a08f09faf8fc2d3e.sock every 8 connection(s)
I20260928 16:34:42.749522 17642 acceptor_pool.cc:254] collecting diagnostics on the listening RPC socket unix:/tmp/dist-test-taskKC9c0V/test-tmp/rpc-test-56dbef9f63c74e45a08f09faf8fc2d3e.sock every 8 connection(s)
I20260928 16:34:42.749831 17521 rpc-test.cc:488] Connecting to unix:/tmp/dist-test-taskKC9c0V/test-tmp/rpc-test-56dbef9f63c74e45a08f09faf8fc2d3e.sock
W20260928 16:34:43.231433 17654 connection.cc:196] Error closing socket: Network error: TlsSocket::Close: Broken pipe
[       OK ] Parameters/TestRpc.TestConnectionKeepalive/SSL_UnixSocket (1038 ms)
[ RUN      ] Parameters/TestRpc.TestClientConnectionMetrics/SSL_UnixSocket
I20260928 16:34:43.781739 17666 acceptor_pool.cc:254] collecting diagnostics on the listening RPC socket unix:/tmp/dist-test-taskKC9c0V/test-tmp/rpc-test-c8ae77b6c0aa47d58f4fedac46932fbb.sock every 8 connection(s)
I20260928 16:34:43.781765 17667 acceptor_pool.cc:254] collecting diagnostics on the listening RPC socket unix:/tmp/dist-test-taskKC9c0V/test-tmp/rpc-test-c8ae77b6c0aa47d58f4fedac46932fbb.sock every 8 connection(s)
I20260928 16:34:43.782070 17521 rpc-test.cc:569] Connecting to unix:/tmp/dist-test-taskKC9c0V/test-tmp/rpc-test-c8ae77b6c0aa47d58f4fedac46932fbb.sock
W20260928 16:34:54.311013 17663 connection.cc:196] Error closing socket: Network error: TlsSocket::Close: Broken pipe
[       OK ] Parameters/TestRpc.TestClientConnectionMetrics/SSL_UnixSocket (10543 ms)
[ RUN      ] Parameters/TestRpc.TestCredentialsPolicy/SSL_UnixSocket
I20260928 16:34:54.324893 17690 acceptor_pool.cc:254] collecting diagnostics on the listening RPC socket unix:/tmp/dist-test-taskKC9c0V/test-tmp/rpc-test-c006c0cc88124e9daf5f0e1ee9da31b3.sock every 8 connection(s)
I20260928 16:34:54.325026 17691 acceptor_pool.cc:254] collecting diagnostics on the listening RPC socket unix:/tmp/dist-test-taskKC9c0V/test-tmp/rpc-test-c006c0cc88124e9daf5f0e1ee9da31b3.sock every 8 connection(s)
I20260928 16:34:54.325322 17521 rpc-test.cc:700] Connecting to unix:/tmp/dist-test-taskKC9c0V/test-tmp/rpc-test-c006c0cc88124e9daf5f0e1ee9da31b3.sock
W20260928 16:34:54.356199 17689 connection.cc:196] Error closing socket: Network error: TlsSocket::Close: Broken pipe
[       OK ] Parameters/TestRpc.TestCredentialsPolicy/SSL_UnixSocket (49 ms)
[ RUN      ] Parameters/TestRpc.TestCallLongerThanKeepalive/SSL_UnixSocket
I20260928 16:34:54.370975 17715 acceptor_pool.cc:254] collecting diagnostics on the listening RPC socket unix:/tmp/dist-test-taskKC9c0V/test-tmp/rpc-test-e0ef4075b3a6467b859ceda988306d36.sock every 8 connection(s)
I20260928 16:34:54.370976 17716 acceptor_pool.cc:254] collecting diagnostics on the listening RPC socket unix:/tmp/dist-test-taskKC9c0V/test-tmp/rpc-test-e0ef4075b3a6467b859ceda988306d36.sock every 8 connection(s)
I20260928 16:34:54.388252 17717 rpc-test-base.h:222] got call: sleep_micros: 3000000 deferred: true
I20260928 16:34:57.389232 17717 rpcz_store.cc:275] Call kudu.rpc.GenericCalculatorService.Sleep from unix:<unnamed> (request call id 0) took 3001 ms. Trace:
I20260928 16:34:57.389360 17717 rpcz_store.cc:276] 0928 16:34:54.388169 (+     0us) service_pool.cc:170] Inserting onto call queue
0928 16:34:54.388224 (+    55us) service_pool.cc:227] Handling call
0928 16:34:57.389210 (+3000986us) inbound_call.cc:173] Queueing success response
Metrics: {}
[       OK ] Parameters/TestRpc.TestCallLongerThanKeepalive/SSL_UnixSocket (3030 ms)
[ RUN      ] Parameters/TestRpc.TestRpcSidecar/SSL_UnixSocket
I20260928 16:34:57.427994 17740 acceptor_pool.cc:254] collecting diagnostics on the listening RPC socket unix:/tmp/dist-test-taskKC9c0V/test-tmp/rpc-test-a5e182486759428b9e4687593b7d9e21.sock every 8 connection(s)
I20260928 16:34:57.428011 17741 acceptor_pool.cc:254] collecting diagnostics on the listening RPC socket unix:/tmp/dist-test-taskKC9c0V/test-tmp/rpc-test-a5e182486759428b9e4687593b7d9e21.sock every 8 connection(s)
W20260928 16:34:57.499111 17737 connection.cc:196] Error closing socket: Network error: TlsSocket::Close: Broken pipe
[       OK ] Parameters/TestRpc.TestRpcSidecar/SSL_UnixSocket (107 ms)
[ RUN      ] Parameters/TestRpc.TestRpcSidecarLimits/SSL_UnixSocket
I20260928 16:35:00.443522 17765 acceptor_pool.cc:254] collecting diagnostics on the listening RPC socket unix:/tmp/dist-test-taskKC9c0V/test-tmp/rpc-test-a7ca8e4fa2bd4ec68ee89983af8ee2cb.sock every 8 connection(s)
I20260928 16:35:00.443522 17766 acceptor_pool.cc:254] collecting diagnostics on the listening RPC socket unix:/tmp/dist-test-taskKC9c0V/test-tmp/rpc-test-a7ca8e4fa2bd4ec68ee89983af8ee2cb.sock every 8 connection(s)
W20260928 16:35:00.456015 17521 serialization.cc:72] Serialized kudu.rpc_test.PushStringsRequestPB (2147483654 bytes) is larger than the maximum configured RPC message size (52428800 bytes). Sending anyway, but peer may reject the data.
W20260928 16:35:00.460121 17762 connection.cc:535] server connection from unix:<unnamed> recv error: Network error: RPC frame had a length of 2147483714, but we only support messages up to 52428800 bytes long.
W20260928 16:35:00.460215 17762 connection.cc:158] shutting down server connection from unix:<unnamed> with pending inbound data: 4/2147483714 bytes received; last active 0 ns ago: status Network error: RPC frame had a length of 2147483714, but we only support messages up to 52428800 bytes long.
W20260928 16:35:00.460554 17778 connection.cc:196] Error closing socket: Network error: TlsSocket::Close: Broken pipe
I20260928 16:35:00.496955 17790 acceptor_pool.cc:254] collecting diagnostics on the listening RPC socket unix:/tmp/dist-test-taskKC9c0V/test-tmp/rpc-test-a7ca8e4fa2bd4ec68ee89983af8ee2cb.sock every 8 connection(s)
I20260928 16:35:00.497171 17791 acceptor_pool.cc:254] collecting diagnostics on the listening RPC socket unix:/tmp/dist-test-taskKC9c0V/test-tmp/rpc-test-a7ca8e4fa2bd4ec68ee89983af8ee2cb.sock every 8 connection(s)
W20260928 16:35:10.697579 17787 connection.cc:577] server connection from unix:<unnamed>: received bad data: 'Corruption: Invalid packet: message had a length of 2147483710, but we only support messages up to 2147483647 bytes
'
W20260928 16:35:10.698056 17803 connection.cc:196] Error closing socket: Network error: TlsSocket::Close: Broken pipe
[       OK ] Parameters/TestRpc.TestRpcSidecarLimits/SSL_UnixSocket (13201 ms)
[ RUN      ] Parameters/TestRpc.TestCallTimeoutDoesntAffectNegotiation/SSL_UnixSocket
I20260928 16:35:10.710121 17815 acceptor_pool.cc:254] collecting diagnostics on the listening RPC socket unix:/tmp/dist-test-taskKC9c0V/test-tmp/rpc-test-54f15399ba01487da596699e9611e5e0.sock every 8 connection(s)
I20260928 16:35:10.710284 17816 acceptor_pool.cc:254] collecting diagnostics on the listening RPC socket unix:/tmp/dist-test-taskKC9c0V/test-tmp/rpc-test-54f15399ba01487da596699e9611e5e0.sock every 8 connection(s)
W20260928 16:35:10.718160 17811 negotiation.cc:266] Injecting 500ms delay in negotiation
I20260928 16:35:10.768635 17521 rpc-test-base.h:595] status: Timed out: connection negotiation to unix:/tmp/dist-test-taskKC9c0V/test-tmp/rpc-test-54f15399ba01487da596699e9611e5e0.sock for RPC Sleep timed out after 0.050s (ON_OUTBOUND_QUEUE), seconds elapsed: 0.0509923
[       OK ] Parameters/TestRpc.TestCallTimeoutDoesntAffectNegotiation/SSL_UnixSocket (530 ms)
[ RUN      ] Parameters/TestRpc.TestRpcHandlerLatencyMetric/SSL_UnixSocket
I20260928 16:35:11.249815 17841 acceptor_pool.cc:254] collecting diagnostics on the listening RPC socket unix:/tmp/dist-test-taskKC9c0V/test-tmp/rpc-test-55c411b64f6c476098a6c505b14682ed.sock every 8 connection(s)
I20260928 16:35:11.249847 17842 acceptor_pool.cc:254] collecting diagnostics on the listening RPC socket unix:/tmp/dist-test-taskKC9c0V/test-tmp/rpc-test-55c411b64f6c476098a6c505b14682ed.sock every 8 connection(s)
I20260928 16:35:11.298059 17521 rpc-test.cc:1236] Sleep() min lat: 20525
I20260928 16:35:11.298137 17521 rpc-test.cc:1237] Sleep() mean lat: 20525
I20260928 16:35:11.298169 17521 rpc-test.cc:1238] Sleep() max lat: 20525
I20260928 16:35:11.298182 17521 rpc-test.cc:1239] Sleep() #calls: 1
W20260928 16:35:11.299165 17838 connection.cc:196] Error closing socket: Network error: TlsSocket::Close: Broken pipe
[       OK ] Parameters/TestRpc.TestRpcHandlerLatencyMetric/SSL_UnixSocket (68 ms)
[ RUN      ] Parameters/TestRpc.TimedOutOnResponseMetricServiceQueue/SSL_UnixSocket
I20260928 16:35:11.320758 17867 acceptor_pool.cc:254] collecting diagnostics on the listening RPC socket unix:/tmp/dist-test-taskKC9c0V/test-tmp/rpc-test-4f6de51614674f1db0b2708a86941308.sock every 8 connection(s)
I20260928 16:35:11.320779 17868 acceptor_pool.cc:254] collecting diagnostics on the listening RPC socket unix:/tmp/dist-test-taskKC9c0V/test-tmp/rpc-test-4f6de51614674f1db0b2708a86941308.sock every 8 connection(s)
W20260928 16:35:11.373530 17869 rpcz_store.cc:267] Call kudu.rpc_test.CalculatorService.Sleep from unix:<unnamed> (request call id 2) took 20 ms (client timeout 20 ms). Trace:
W20260928 16:35:11.373663 17869 rpcz_store.cc:269] 0928 16:35:11.353067 (+     0us) service_pool.cc:170] Inserting onto call queue
0928 16:35:11.373471 (+ 20404us) service_pool.cc:214] Skipping call since client already timed out
0928 16:35:11.373510 (+    39us) inbound_call.cc:173] Queueing failure response
Metrics: {}
W20260928 16:35:11.374711 17864 connection.cc:196] Error closing socket: Network error: TlsSocket::Close: Broken pipe
[       OK ] Parameters/TestRpc.TimedOutOnResponseMetricServiceQueue/SSL_UnixSocket (75 ms)
[ RUN      ] Parameters/TestRpc.RpcPendingConnectionsMetric/SSL_UnixSocket
I20260928 16:35:11.378352 17890 acceptor_pool.cc:254] collecting diagnostics on the listening RPC socket 0.0.0.0:39397 every 8 connection(s)
I20260928 16:35:11.378424 17891 acceptor_pool.cc:254] collecting diagnostics on the listening RPC socket 0.0.0.0:39397 every 8 connection(s)
W20260928 16:35:11.379640 17886 negotiation.cc:337] Failed RPC negotiation. Trace:
0928 16:35:11.379222 (+     0us) reactor.cc:625] Submitting negotiation task for server connection from 127.0.0.1:51988 (local address 127.0.0.1:39397)
0928 16:35:11.379316 (+    94us) server_negotiation.cc:206] Beginning negotiation
0928 16:35:11.379319 (+     3us) server_negotiation.cc:399] Waiting for connection header
0928 16:35:11.379425 (+   106us) negotiation.cc:327] Negotiation complete: Network error: Server connection negotiation failed: server connection from 127.0.0.1:51988: BlockingRecv error: recv got EOF from 127.0.0.1:51988 (error 108)
Metrics: {"server-negotiator.queue_time_us":23}
[       OK ] Parameters/TestRpc.RpcPendingConnectionsMetric/SSL_UnixSocket (14 ms)
[ RUN      ] Parameters/TestRpc.TestRpcContextClientDeadline/SSL_UnixSocket
I20260928 16:35:11.397939 17906 acceptor_pool.cc:254] collecting diagnostics on the listening RPC socket unix:/tmp/dist-test-taskKC9c0V/test-tmp/rpc-test-53518e372bc041839ac6b65d7b326341.sock every 8 connection(s)
I20260928 16:35:11.397969 17907 acceptor_pool.cc:254] collecting diagnostics on the listening RPC socket unix:/tmp/dist-test-taskKC9c0V/test-tmp/rpc-test-53518e372bc041839ac6b65d7b326341.sock every 8 connection(s)
W20260928 16:35:11.476835 17903 connection.cc:196] Error closing socket: Network error: TlsSocket::Close: Broken pipe
[       OK ] Parameters/TestRpc.TestRpcContextClientDeadline/SSL_UnixSocket (87 ms)
[ RUN      ] Parameters/TestRpc.TestApplicationFeatureFlagUnsupportedServer/SSL_UnixSocket
I20260928 16:35:11.500770 17932 acceptor_pool.cc:254] collecting diagnostics on the listening RPC socket unix:/tmp/dist-test-taskKC9c0V/test-tmp/rpc-test-e5f74c8c7a27455aa8152829706a2a0a.sock every 8 connection(s)
I20260928 16:35:11.500746 17931 acceptor_pool.cc:254] collecting diagnostics on the listening RPC socket unix:/tmp/dist-test-taskKC9c0V/test-tmp/rpc-test-e5f74c8c7a27455aa8152829706a2a0a.sock every 8 connection(s)
W20260928 16:35:11.515555 17928 connection.cc:196] Error closing socket: Network error: TlsSocket::Close: Broken pipe
[       OK ] Parameters/TestRpc.TestApplicationFeatureFlagUnsupportedServer/SSL_UnixSocket (38 ms)
[ RUN      ] Parameters/TestRpc.TestCancellationAsync/SSL_UnixSocket
I20260928 16:35:11.529557 17957 acceptor_pool.cc:254] collecting diagnostics on the listening RPC socket unix:/tmp/dist-test-taskKC9c0V/test-tmp/rpc-test-7c2220832947453590cd02651a2cd298.sock every 8 connection(s)
I20260928 16:35:11.529557 17956 acceptor_pool.cc:254] collecting diagnostics on the listening RPC socket unix:/tmp/dist-test-taskKC9c0V/test-tmp/rpc-test-7c2220832947453590cd02651a2cd298.sock every 8 connection(s)
I20260928 16:35:11.529893 17521 rpc-test.cc:1716] Connecting to unix:/tmp/dist-test-taskKC9c0V/test-tmp/rpc-test-7c2220832947453590cd02651a2cd298.sock
I20260928 16:35:11.543118 17521 test_util.cc:268] Using random seed: -1503832244
I20260928 16:35:11.566951 17961 rpc-test-base.h:240] got call: sleep_micros: 500 pattern: 4294967295 num_repetitions: 2097152 sidecar_idx: 0
I20260928 16:35:11.585489 17961 rpc-test-base.h:240] got call: sleep_micros: 500 pattern: 4294967295 num_repetitions: 2097152 sidecar_idx: 0
I20260928 16:35:11.603034 17960 rpc-test-base.h:240] got call: sleep_micros: 500 pattern: 4294967295 num_repetitions: 2097152 sidecar_idx: 0
I20260928 16:35:11.620529 17961 rpc-test-base.h:240] got call: sleep_micros: 500 pattern: 4294967295 num_repetitions: 2097152 sidecar_idx: 0
I20260928 16:35:11.638375 17960 rpc-test-base.h:240] got call: sleep_micros: 500 pattern: 4294967295 num_repetitions: 2097152 sidecar_idx: 0
I20260928 16:35:11.662703 17961 rpc-test-base.h:240] got call: sleep_micros: 500 pattern: 4294967295 num_repetitions: 2097152 sidecar_idx: 0
I20260928 16:35:11.682279 17960 rpc-test-base.h:240] got call: sleep_micros: 500 pattern: 4294967295 num_repetitions: 2097152 sidecar_idx: 0
I20260928 16:35:11.707379 17961 rpc-test-base.h:240] got call: sleep_micros: 500 pattern: 4294967295 num_repetitions: 2097152 sidecar_idx: 0
W20260928 16:35:11.707762 17953 connection.cc:441] server connection from unix:<unnamed> torn down before Call kudu.rpc.GenericCalculatorService.SleepWithSidecar from unix:<unnamed> (request call id 8) could send its response
W20260928 16:35:11.726085 17953 connection.cc:441] server connection from unix:<unnamed> torn down before Call kudu.rpc.GenericCalculatorService.SleepWithSidecar from unix:<unnamed> (request call id 9) could send its response
[       OK ] Parameters/TestRpc.TestCancellationAsync/SSL_UnixSocket (210 ms)
[ RUN      ] Parameters/TestRpc.TestPerformanceBySocketType/SSL_UnixSocket
I20260928 16:35:11.760345 17982 acceptor_pool.cc:254] collecting diagnostics on the listening RPC socket unix:/tmp/dist-test-taskKC9c0V/test-tmp/rpc-test-ea0f508e0a6e40a3be8212ecf9b6c65e.sock every 8 connection(s)
I20260928 16:35:11.760345 17983 acceptor_pool.cc:254] collecting diagnostics on the listening RPC socket unix:/tmp/dist-test-taskKC9c0V/test-tmp/rpc-test-ea0f508e0a6e40a3be8212ecf9b6c65e.sock every 8 connection(s)
I20260928 16:35:11.760689 17521 rpc-test.cc:1846] Connecting to unix:/tmp/dist-test-taskKC9c0V/test-tmp/rpc-test-ea0f508e0a6e40a3be8212ecf9b6c65e.sock
I20260928 16:35:13.454196 17521 rpc-test.cc:1859] Sending 1024MB via ssl-enabled unix socket: real 1.676s	user 2.122s	sys 0.879s
I20260928 16:35:15.092324 17521 rpc-test.cc:1859] Sending 1024MB via ssl-enabled unix socket: real 1.638s	user 2.084s	sys 0.854s
I20260928 16:35:16.691501 17521 rpc-test.cc:1859] Sending 1024MB via ssl-enabled unix socket: real 1.599s	user 2.012s	sys 0.854s
I20260928 16:35:18.343535 17521 rpc-test.cc:1859] Sending 1024MB via ssl-enabled unix socket: real 1.652s	user 2.087s	sys 0.886s
I20260928 16:35:20.019671 17521 rpc-test.cc:1859] Sending 1024MB via ssl-enabled unix socket: real 1.676s	user 2.108s	sys 0.909s
W20260928 16:35:20.020763 17979 connection.cc:196] Error closing socket: Network error: TlsSocket::Close: Broken pipe
[       OK ] Parameters/TestRpc.TestPerformanceBySocketType/SSL_UnixSocket (8294 ms)
[----------] 20 tests from Parameters/TestRpc (37466 ms total)

[----------] 1 test from Parameters/TestRpcSocketTxRxQueue
[ RUN      ] Parameters/TestRpcSocketTxRxQueue.AcceptorRxQueueSizeMetric/0
I20260928 16:35:20.028076 18007 acceptor_pool.cc:254] collecting diagnostics on the listening RPC socket 0.0.0.0:42837 every 1 connection(s)
I20260928 16:35:20.028154 18008 acceptor_pool.cc:254] collecting diagnostics on the listening RPC socket 0.0.0.0:42837 every 1 connection(s)
W20260928 16:35:20.029206 18003 negotiation.cc:337] Failed RPC negotiation. Trace:
0928 16:35:20.028882 (+     0us) reactor.cc:625] Submitting negotiation task for server connection from 127.0.0.1:51968 (local address 127.0.0.1:42837)
0928 16:35:20.029017 (+   135us) server_negotiation.cc:206] Beginning negotiation
0928 16:35:20.029022 (+     5us) server_negotiation.cc:399] Waiting for connection header
0928 16:35:20.029133 (+   111us) negotiation.cc:327] Negotiation complete: Network error: Server connection negotiation failed: server connection from 127.0.0.1:51968: BlockingRecv error: recv got EOF from 127.0.0.1:51968 (error 108)
Metrics: {"server-negotiator.queue_time_us":46}
[       OK ] Parameters/TestRpcSocketTxRxQueue.AcceptorRxQueueSizeMetric/0 (9 ms)
[----------] 1 test from Parameters/TestRpcSocketTxRxQueue (9 ms total)

[----------] Global test environment tear-down
[==========] 21 tests from 2 test suites ran. (37476 ms total)
[  PASSED  ] 20 tests.
[  FAILED  ] 1 test, listed below:
[  FAILED  ] Parameters/TestRpc.TestCallWithChainCertAndChainCA/SSL_UnixSocket, where GetParam() = (true, true)

 1 FAILED TEST