Diagnosed failure
Parameters/TestRpc.TestCallWithChainCertAndChainCA/SSL_UnixSocket: /data0/somelongdirectorytoavoidrpathissues/src/kudu/src/kudu/rpc/rpc-test.cc:270: Failure
Failed
Bad status: Runtime error: could not verify certificate chain (error with cert: subject=CN = localhost, ST = sadfjas, C = AS, emailAddress = sdflkdsajf, O = lskdfjlsad, OU = sldfkja, issuer=C = AS, ST = ASDfkjdhf, L = lskdjf, O = saldfja, OU = skdjf, CN = localhost, emailAddress = sadjflkadsj): : certificate has expired
Google Test trace:
/data0/somelongdirectorytoavoidrpathissues/src/kudu/src/kudu/rpc/rpc-test.cc:267: Connecting to unix:/tmp/dist-test-task7kIUff/test-tmp/rpc-test-d2a3243d989847e9a58b14262e141106.sock
I20260927 06:55:45.717439 379 test_util.cc:175] -----------------------------------------------
I20260927 06:55:45.717537 379 test_util.cc:176] Had fatal failures, leaving test files at /tmp/dist-test-task7kIUff/test-tmp/rpc-test.6.Parameters_TestRpc.TestCallWithChainCertAndChainCA_SSL_UnixSocket.1790492145592872-379-0
Full log
Note: This is test shard 7 of 8.
[==========] Running 21 tests from 2 test suites.
[----------] Global test environment set-up.
[----------] 20 tests from Parameters/TestRpc
[ RUN ] Parameters/TestRpc.TestMessengerCreateDestroy/SSL_UnixSocket
WARNING: Logging before InitGoogleLogging() is written to STDERR
I20260927 06:55:45.644353 379 rpc-test.cc:169] started messenger TestCreateDestroy
[ OK ] Parameters/TestRpc.TestMessengerCreateDestroy/SSL_UnixSocket (35 ms)
[ RUN ] Parameters/TestRpc.TestNegotiationDeadlock/SSL_UnixSocket
I20260927 06:55:45.655565 399 acceptor_pool.cc:254] collecting diagnostics on the listening RPC socket unix:/tmp/dist-test-task7kIUff/test-tmp/rpc-test-ebe9d85ea442483699eea99742f1732a.sock every 8 connection(s)
I20260927 06:55:45.655905 400 acceptor_pool.cc:254] collecting diagnostics on the listening RPC socket unix:/tmp/dist-test-task7kIUff/test-tmp/rpc-test-ebe9d85ea442483699eea99742f1732a.sock every 8 connection(s)
[ OK ] Parameters/TestRpc.TestNegotiationDeadlock/SSL_UnixSocket (28 ms)
[ RUN ] Parameters/TestRpc.TestCallWithChainCertAndChainCA/SSL_UnixSocket
I20260927 06:55:45.705006 415 acceptor_pool.cc:254] collecting diagnostics on the listening RPC socket unix:/tmp/dist-test-task7kIUff/test-tmp/rpc-test-d2a3243d989847e9a58b14262e141106.sock every 8 connection(s)
I20260927 06:55:45.705349 416 acceptor_pool.cc:254] collecting diagnostics on the listening RPC socket unix:/tmp/dist-test-task7kIUff/test-tmp/rpc-test-d2a3243d989847e9a58b14262e141106.sock every 8 connection(s)
/data0/somelongdirectorytoavoidrpathissues/src/kudu/src/kudu/rpc/rpc-test.cc:270: Failure
Failed
Bad status: Runtime error: could not verify certificate chain (error with cert: subject=CN = localhost, ST = sadfjas, C = AS, emailAddress = sdflkdsajf, O = lskdfjlsad, OU = sldfkja, issuer=C = AS, ST = ASDfkjdhf, L = lskdjf, O = saldfja, OU = skdjf, CN = localhost, emailAddress = sadjflkadsj): : certificate has expired
Google Test trace:
/data0/somelongdirectorytoavoidrpathissues/src/kudu/src/kudu/rpc/rpc-test.cc:267: Connecting to unix:/tmp/dist-test-task7kIUff/test-tmp/rpc-test-d2a3243d989847e9a58b14262e141106.sock
I20260927 06:55:45.717439 379 test_util.cc:175] -----------------------------------------------
I20260927 06:55:45.717537 379 test_util.cc:176] Had fatal failures, leaving test files at /tmp/dist-test-task7kIUff/test-tmp/rpc-test.6.Parameters_TestRpc.TestCallWithChainCertAndChainCA_SSL_UnixSocket.1790492145592872-379-0
[ FAILED ] Parameters/TestRpc.TestCallWithChainCertAndChainCA/SSL_UnixSocket, where GetParam() = (true, true) (41 ms)
[ RUN ] Parameters/TestRpc.TestCallWithPasswordProtectedKey/SSL_UnixSocket
I20260927 06:55:45.734889 440 acceptor_pool.cc:254] collecting diagnostics on the listening RPC socket unix:/tmp/dist-test-task7kIUff/test-tmp/rpc-test-236f3bf78fb043508212319a9db71578.sock every 8 connection(s)
I20260927 06:55:45.735168 441 acceptor_pool.cc:254] collecting diagnostics on the listening RPC socket unix:/tmp/dist-test-task7kIUff/test-tmp/rpc-test-236f3bf78fb043508212319a9db71578.sock every 8 connection(s)
W20260927 06:55:45.765486 437 connection.cc:196] Error closing socket: Network error: TlsSocket::Close: Broken pipe
[ OK ] Parameters/TestRpc.TestCallWithPasswordProtectedKey/SSL_UnixSocket (51 ms)
[ RUN ] Parameters/TestRpc.TestCallToBadServer/SSL_UnixSocket
I20260927 06:55:45.781709 379 rpc-test.cc:394] Status: Network error: Client connection negotiation failed: client connection to 0.0.0.0:0: connect: Connection refused (error 111)
I20260927 06:55:45.782742 379 rpc-test.cc:394] Status: Network error: Client connection negotiation failed: client connection to 0.0.0.0:0: connect: Connection refused (error 111)
I20260927 06:55:45.783447 379 rpc-test.cc:394] Status: Network error: Client connection negotiation failed: client connection to 0.0.0.0:0: connect: Connection refused (error 111)
I20260927 06:55:45.784152 379 rpc-test.cc:394] Status: Network error: Client connection negotiation failed: client connection to 0.0.0.0:0: connect: Connection refused (error 111)
I20260927 06:55:45.784803 379 rpc-test.cc:394] Status: Network error: Client connection negotiation failed: client connection to 0.0.0.0:0: connect: Connection refused (error 111)
[ OK ] Parameters/TestRpc.TestCallToBadServer/SSL_UnixSocket (18 ms)
[ RUN ] Parameters/TestRpc.TestWrongService/SSL_UnixSocket
I20260927 06:55:45.796612 475 acceptor_pool.cc:254] collecting diagnostics on the listening RPC socket unix:/tmp/dist-test-task7kIUff/test-tmp/rpc-test-84e01fb5bc9d4391a0b0b3b88fc1a4e8.sock every 8 connection(s)
I20260927 06:55:45.796980 476 acceptor_pool.cc:254] collecting diagnostics on the listening RPC socket unix:/tmp/dist-test-task7kIUff/test-tmp/rpc-test-84e01fb5bc9d4391a0b0b3b88fc1a4e8.sock every 8 connection(s)
I20260927 06:55:45.834517 472 messenger.cc:345] service WrongServiceName not registered on TestServer
W20260927 06:55:45.836747 472 connection.cc:196] Error closing socket: Network error: TlsSocket::Close: Broken pipe
[ OK ] Parameters/TestRpc.TestWrongService/SSL_UnixSocket (52 ms)
[ RUN ] Parameters/TestRpc.TestConnectionKeepalive/SSL_UnixSocket
I20260927 06:55:45.869341 498 acceptor_pool.cc:254] collecting diagnostics on the listening RPC socket unix:/tmp/dist-test-task7kIUff/test-tmp/rpc-test-2c96f9c7c8364c5c9e3a339609b15658.sock every 8 connection(s)
I20260927 06:55:45.869650 499 acceptor_pool.cc:254] collecting diagnostics on the listening RPC socket unix:/tmp/dist-test-task7kIUff/test-tmp/rpc-test-2c96f9c7c8364c5c9e3a339609b15658.sock every 8 connection(s)
I20260927 06:55:45.870731 379 rpc-test.cc:488] Connecting to unix:/tmp/dist-test-task7kIUff/test-tmp/rpc-test-2c96f9c7c8364c5c9e3a339609b15658.sock
W20260927 06:55:46.342773 511 connection.cc:196] Error closing socket: Network error: TlsSocket::Close: Broken pipe
[ OK ] Parameters/TestRpc.TestConnectionKeepalive/SSL_UnixSocket (1067 ms)
[ RUN ] Parameters/TestRpc.TestClientConnectionMetrics/SSL_UnixSocket
I20260927 06:55:46.925695 523 acceptor_pool.cc:254] collecting diagnostics on the listening RPC socket unix:/tmp/dist-test-task7kIUff/test-tmp/rpc-test-16f42b5d56624b5792ad07ad039f71f3.sock every 8 connection(s)
I20260927 06:55:46.925935 524 acceptor_pool.cc:254] collecting diagnostics on the listening RPC socket unix:/tmp/dist-test-task7kIUff/test-tmp/rpc-test-16f42b5d56624b5792ad07ad039f71f3.sock every 8 connection(s)
I20260927 06:55:46.926940 379 rpc-test.cc:569] Connecting to unix:/tmp/dist-test-task7kIUff/test-tmp/rpc-test-16f42b5d56624b5792ad07ad039f71f3.sock
W20260927 06:56:09.563853 520 connection.cc:196] Error closing socket: Network error: TlsSocket::Close: Broken pipe
[ OK ] Parameters/TestRpc.TestClientConnectionMetrics/SSL_UnixSocket (22663 ms)
[ RUN ] Parameters/TestRpc.TestCredentialsPolicy/SSL_UnixSocket
I20260927 06:56:09.611095 546 acceptor_pool.cc:254] collecting diagnostics on the listening RPC socket unix:/tmp/dist-test-task7kIUff/test-tmp/rpc-test-3234e861456c49dab96fd9ee5be710c8.sock every 8 connection(s)
I20260927 06:56:09.611392 547 acceptor_pool.cc:254] collecting diagnostics on the listening RPC socket unix:/tmp/dist-test-task7kIUff/test-tmp/rpc-test-3234e861456c49dab96fd9ee5be710c8.sock every 8 connection(s)
I20260927 06:56:09.612396 379 rpc-test.cc:700] Connecting to unix:/tmp/dist-test-task7kIUff/test-tmp/rpc-test-3234e861456c49dab96fd9ee5be710c8.sock
W20260927 06:56:09.673797 545 connection.cc:196] Error closing socket: Network error: TlsSocket::Close: Broken pipe
W20260927 06:56:09.682857 545 connection.cc:196] Error closing socket: Network error: TlsSocket::Close: Broken pipe
[ OK ] Parameters/TestRpc.TestCredentialsPolicy/SSL_UnixSocket (114 ms)
[ RUN ] Parameters/TestRpc.TestCallLongerThanKeepalive/SSL_UnixSocket
I20260927 06:56:09.698165 571 acceptor_pool.cc:254] collecting diagnostics on the listening RPC socket unix:/tmp/dist-test-task7kIUff/test-tmp/rpc-test-1317402f8d0044a687c7044230d10464.sock every 8 connection(s)
I20260927 06:56:09.698469 572 acceptor_pool.cc:254] collecting diagnostics on the listening RPC socket unix:/tmp/dist-test-task7kIUff/test-tmp/rpc-test-1317402f8d0044a687c7044230d10464.sock every 8 connection(s)
I20260927 06:56:09.717482 575 rpc-test-base.h:222] got call: sleep_micros: 3000000 deferred: true
I20260927 06:56:12.719322 575 rpcz_store.cc:275] Call kudu.rpc.GenericCalculatorService.Sleep from unix:<unnamed> (request call id 0) took 3001 ms. Trace:
I20260927 06:56:12.719471 575 rpcz_store.cc:276] 0927 06:56:09.717346 (+ 0us) service_pool.cc:170] Inserting onto call queue
0927 06:56:09.717437 (+ 91us) service_pool.cc:227] Handling call
0927 06:56:12.719261 (+3001824us) inbound_call.cc:173] Queueing success response
Metrics: {}
[ OK ] Parameters/TestRpc.TestCallLongerThanKeepalive/SSL_UnixSocket (3041 ms)
[ RUN ] Parameters/TestRpc.TestRpcSidecar/SSL_UnixSocket
I20260927 06:56:12.762092 596 acceptor_pool.cc:254] collecting diagnostics on the listening RPC socket unix:/tmp/dist-test-task7kIUff/test-tmp/rpc-test-097f838bb77a4108831255e55a0ee23e.sock every 8 connection(s)
I20260927 06:56:12.762319 597 acceptor_pool.cc:254] collecting diagnostics on the listening RPC socket unix:/tmp/dist-test-task7kIUff/test-tmp/rpc-test-097f838bb77a4108831255e55a0ee23e.sock every 8 connection(s)
W20260927 06:56:12.880200 593 connection.cc:196] Error closing socket: Network error: TlsSocket::Close: Broken pipe
[ OK ] Parameters/TestRpc.TestRpcSidecar/SSL_UnixSocket (155 ms)
[ RUN ] Parameters/TestRpc.TestRpcSidecarLimits/SSL_UnixSocket
I20260927 06:56:15.118810 621 acceptor_pool.cc:254] collecting diagnostics on the listening RPC socket unix:/tmp/dist-test-task7kIUff/test-tmp/rpc-test-26f7c2db076943248aba629a506f7488.sock every 8 connection(s)
I20260927 06:56:15.119432 622 acceptor_pool.cc:254] collecting diagnostics on the listening RPC socket unix:/tmp/dist-test-task7kIUff/test-tmp/rpc-test-26f7c2db076943248aba629a506f7488.sock every 8 connection(s)
W20260927 06:56:15.155519 379 serialization.cc:72] Serialized kudu.rpc_test.PushStringsRequestPB (2147483654 bytes) is larger than the maximum configured RPC message size (52428800 bytes). Sending anyway, but peer may reject the data.
W20260927 06:56:15.161836 618 connection.cc:535] server connection from unix:<unnamed> recv error: Network error: RPC frame had a length of 2147483714, but we only support messages up to 52428800 bytes long.
W20260927 06:56:15.162025 618 connection.cc:158] shutting down server connection from unix:<unnamed> with pending inbound data: 4/2147483714 bytes received; last active 0 ns ago: status Network error: RPC frame had a length of 2147483714, but we only support messages up to 52428800 bytes long.
W20260927 06:56:15.162569 634 connection.cc:196] Error closing socket: Network error: TlsSocket::Close: Broken pipe
I20260927 06:56:15.178114 646 acceptor_pool.cc:254] collecting diagnostics on the listening RPC socket unix:/tmp/dist-test-task7kIUff/test-tmp/rpc-test-26f7c2db076943248aba629a506f7488.sock every 8 connection(s)
I20260927 06:56:15.178417 647 acceptor_pool.cc:254] collecting diagnostics on the listening RPC socket unix:/tmp/dist-test-task7kIUff/test-tmp/rpc-test-26f7c2db076943248aba629a506f7488.sock every 8 connection(s)
W20260927 06:56:21.300392 643 connection.cc:577] server connection from unix:<unnamed>: received bad data: 'Corruption: Invalid packet: message had a length of 2147483710, but we only support messages up to 2147483647 bytes
'
W20260927 06:56:21.301033 659 connection.cc:196] Error closing socket: Network error: TlsSocket::Close: Broken pipe
[ OK ] Parameters/TestRpc.TestRpcSidecarLimits/SSL_UnixSocket (8892 ms)
[ RUN ] Parameters/TestRpc.TestCallTimeoutDoesntAffectNegotiation/SSL_UnixSocket
I20260927 06:56:21.794497 671 acceptor_pool.cc:254] collecting diagnostics on the listening RPC socket unix:/tmp/dist-test-task7kIUff/test-tmp/rpc-test-854a57c54de240ebb5d4e06db19814bf.sock every 8 connection(s)
I20260927 06:56:21.794773 672 acceptor_pool.cc:254] collecting diagnostics on the listening RPC socket unix:/tmp/dist-test-task7kIUff/test-tmp/rpc-test-854a57c54de240ebb5d4e06db19814bf.sock every 8 connection(s)
W20260927 06:56:21.819517 667 negotiation.cc:266] Injecting 500ms delay in negotiation
I20260927 06:56:21.869796 379 rpc-test-base.h:595] status: Timed out: connection negotiation to unix:/tmp/dist-test-task7kIUff/test-tmp/rpc-test-854a57c54de240ebb5d4e06db19814bf.sock for RPC Sleep timed out after 0.050s (ON_OUTBOUND_QUEUE), seconds elapsed: 0.051108
W20260927 06:56:22.326956 668 connection.cc:196] Error closing socket: Network error: TlsSocket::Close: Broken pipe
[ OK ] Parameters/TestRpc.TestCallTimeoutDoesntAffectNegotiation/SSL_UnixSocket (554 ms)
[ RUN ] Parameters/TestRpc.TestRpcHandlerLatencyMetric/SSL_UnixSocket
I20260927 06:56:22.349270 696 acceptor_pool.cc:254] collecting diagnostics on the listening RPC socket unix:/tmp/dist-test-task7kIUff/test-tmp/rpc-test-4d79680bb92443439938bb9aff1ffa08.sock every 8 connection(s)
I20260927 06:56:22.349550 697 acceptor_pool.cc:254] collecting diagnostics on the listening RPC socket unix:/tmp/dist-test-task7kIUff/test-tmp/rpc-test-4d79680bb92443439938bb9aff1ffa08.sock every 8 connection(s)
I20260927 06:56:22.386795 379 rpc-test.cc:1236] Sleep() min lat: 20638
I20260927 06:56:22.386940 379 rpc-test.cc:1237] Sleep() mean lat: 20638
I20260927 06:56:22.387115 379 rpc-test.cc:1238] Sleep() max lat: 20638
I20260927 06:56:22.387190 379 rpc-test.cc:1239] Sleep() #calls: 1
[ OK ] Parameters/TestRpc.TestRpcHandlerLatencyMetric/SSL_UnixSocket (62 ms)
[ RUN ] Parameters/TestRpc.TimedOutOnResponseMetricServiceQueue/SSL_UnixSocket
I20260927 06:56:22.405112 722 acceptor_pool.cc:254] collecting diagnostics on the listening RPC socket unix:/tmp/dist-test-task7kIUff/test-tmp/rpc-test-7e880d6a412e48d6ae95c660171fc40c.sock every 8 connection(s)
I20260927 06:56:22.405345 723 acceptor_pool.cc:254] collecting diagnostics on the listening RPC socket unix:/tmp/dist-test-task7kIUff/test-tmp/rpc-test-7e880d6a412e48d6ae95c660171fc40c.sock every 8 connection(s)
W20260927 06:56:22.464417 724 rpcz_store.cc:267] Call kudu.rpc_test.CalculatorService.Sleep from unix:<unnamed> (request call id 2) took 20 ms (client timeout 20 ms). Trace:
W20260927 06:56:22.464620 724 rpcz_store.cc:269] 0927 06:56:22.443892 (+ 0us) service_pool.cc:170] Inserting onto call queue
0927 06:56:22.464330 (+ 20438us) service_pool.cc:214] Skipping call since client already timed out
0927 06:56:22.464384 (+ 54us) inbound_call.cc:173] Queueing failure response
Metrics: {}
[ OK ] Parameters/TestRpc.TimedOutOnResponseMetricServiceQueue/SSL_UnixSocket (76 ms)
[ RUN ] Parameters/TestRpc.RpcPendingConnectionsMetric/SSL_UnixSocket
I20260927 06:56:22.474854 745 acceptor_pool.cc:254] collecting diagnostics on the listening RPC socket 0.0.0.0:42685 every 8 connection(s)
I20260927 06:56:22.475092 746 acceptor_pool.cc:254] collecting diagnostics on the listening RPC socket 0.0.0.0:42685 every 8 connection(s)
W20260927 06:56:22.485924 741 negotiation.cc:337] Failed RPC negotiation. Trace:
0927 06:56:22.485271 (+ 0us) reactor.cc:625] Submitting negotiation task for server connection from 127.0.0.1:36002 (local address 127.0.0.1:42685)
0927 06:56:22.485467 (+ 196us) server_negotiation.cc:206] Beginning negotiation
0927 06:56:22.485471 (+ 4us) server_negotiation.cc:399] Waiting for connection header
0927 06:56:22.485612 (+ 141us) negotiation.cc:327] Negotiation complete: Network error: Server connection negotiation failed: server connection from 127.0.0.1:36002: BlockingRecv error: recv got EOF from 127.0.0.1:36002 (error 108)
Metrics: {"server-negotiator.queue_time_us":71}
[ OK ] Parameters/TestRpc.RpcPendingConnectionsMetric/SSL_UnixSocket (29 ms)
[ RUN ] Parameters/TestRpc.TestRpcContextClientDeadline/SSL_UnixSocket
I20260927 06:56:22.516280 761 acceptor_pool.cc:254] collecting diagnostics on the listening RPC socket unix:/tmp/dist-test-task7kIUff/test-tmp/rpc-test-4b78d579e2e549a6b6a797fc733fdd78.sock every 8 connection(s)
I20260927 06:56:22.516492 762 acceptor_pool.cc:254] collecting diagnostics on the listening RPC socket unix:/tmp/dist-test-task7kIUff/test-tmp/rpc-test-4b78d579e2e549a6b6a797fc733fdd78.sock every 8 connection(s)
[ OK ] Parameters/TestRpc.TestRpcContextClientDeadline/SSL_UnixSocket (69 ms)
[ RUN ] Parameters/TestRpc.TestApplicationFeatureFlagUnsupportedServer/SSL_UnixSocket
I20260927 06:56:22.579655 786 acceptor_pool.cc:254] collecting diagnostics on the listening RPC socket unix:/tmp/dist-test-task7kIUff/test-tmp/rpc-test-e60148e6caf646c38933ca5c4fabbec5.sock every 8 connection(s)
I20260927 06:56:22.579908 787 acceptor_pool.cc:254] collecting diagnostics on the listening RPC socket unix:/tmp/dist-test-task7kIUff/test-tmp/rpc-test-e60148e6caf646c38933ca5c4fabbec5.sock every 8 connection(s)
W20260927 06:56:22.607729 783 connection.cc:196] Error closing socket: Network error: TlsSocket::Close: Broken pipe
[ OK ] Parameters/TestRpc.TestApplicationFeatureFlagUnsupportedServer/SSL_UnixSocket (43 ms)
[ RUN ] Parameters/TestRpc.TestCancellationAsync/SSL_UnixSocket
I20260927 06:56:22.629631 811 acceptor_pool.cc:254] collecting diagnostics on the listening RPC socket unix:/tmp/dist-test-task7kIUff/test-tmp/rpc-test-b02c855897e94833a7b82f01f78b3a54.sock every 8 connection(s)
I20260927 06:56:22.629853 812 acceptor_pool.cc:254] collecting diagnostics on the listening RPC socket unix:/tmp/dist-test-task7kIUff/test-tmp/rpc-test-b02c855897e94833a7b82f01f78b3a54.sock every 8 connection(s)
I20260927 06:56:22.630806 379 rpc-test.cc:1716] Connecting to unix:/tmp/dist-test-task7kIUff/test-tmp/rpc-test-b02c855897e94833a7b82f01f78b3a54.sock
I20260927 06:56:22.640821 379 test_util.cc:268] Using random seed: 1921317026
I20260927 06:56:22.678651 815 rpc-test-base.h:240] got call: sleep_micros: 500 pattern: 4294967295 num_repetitions: 2097152 sidecar_idx: 0
I20260927 06:56:22.700030 814 rpc-test-base.h:240] got call: sleep_micros: 500 pattern: 4294967295 num_repetitions: 2097152 sidecar_idx: 0
I20260927 06:56:22.730078 813 rpc-test-base.h:240] got call: sleep_micros: 500 pattern: 4294967295 num_repetitions: 2097152 sidecar_idx: 0
I20260927 06:56:22.760427 815 rpc-test-base.h:240] got call: sleep_micros: 500 pattern: 4294967295 num_repetitions: 2097152 sidecar_idx: 0
I20260927 06:56:22.791138 813 rpc-test-base.h:240] got call: sleep_micros: 500 pattern: 4294967295 num_repetitions: 2097152 sidecar_idx: 0
I20260927 06:56:22.820262 815 rpc-test-base.h:240] got call: sleep_micros: 500 pattern: 4294967295 num_repetitions: 2097152 sidecar_idx: 0
I20260927 06:56:22.852771 813 rpc-test-base.h:240] got call: sleep_micros: 500 pattern: 4294967295 num_repetitions: 2097152 sidecar_idx: 0
W20260927 06:56:22.855365 808 connection.cc:196] Error closing socket: Network error: TlsSocket::Close: Broken pipe
W20260927 06:56:22.872388 808 connection.cc:441] server connection from unix:<unnamed> torn down before Call kudu.rpc.GenericCalculatorService.SleepWithSidecar from unix:<unnamed> (request call id 8) could send its response
W20260927 06:56:22.888131 808 connection.cc:441] server connection from unix:<unnamed> torn down before Call kudu.rpc.GenericCalculatorService.SleepWithSidecar from unix:<unnamed> (request call id 9) could send its response
[ OK ] Parameters/TestRpc.TestCancellationAsync/SSL_UnixSocket (279 ms)
[ RUN ] Parameters/TestRpc.TestPerformanceBySocketType/SSL_UnixSocket
I20260927 06:56:22.905937 836 acceptor_pool.cc:254] collecting diagnostics on the listening RPC socket unix:/tmp/dist-test-task7kIUff/test-tmp/rpc-test-f748b69b95f04ae1abbf1b6da15c1c93.sock every 8 connection(s)
I20260927 06:56:22.906180 837 acceptor_pool.cc:254] collecting diagnostics on the listening RPC socket unix:/tmp/dist-test-task7kIUff/test-tmp/rpc-test-f748b69b95f04ae1abbf1b6da15c1c93.sock every 8 connection(s)
I20260927 06:56:22.907317 379 rpc-test.cc:1846] Connecting to unix:/tmp/dist-test-task7kIUff/test-tmp/rpc-test-f748b69b95f04ae1abbf1b6da15c1c93.sock
I20260927 06:56:26.290123 379 rpc-test.cc:1859] Sending 1024MB via ssl-enabled unix socket: real 3.368s user 3.305s sys 2.361s
I20260927 06:56:29.651444 379 rpc-test.cc:1859] Sending 1024MB via ssl-enabled unix socket: real 3.361s user 3.331s sys 2.321s
I20260927 06:56:33.225840 379 rpc-test.cc:1859] Sending 1024MB via ssl-enabled unix socket: real 3.574s user 3.685s sys 2.374s
I20260927 06:56:36.609434 379 rpc-test.cc:1859] Sending 1024MB via ssl-enabled unix socket: real 3.383s user 3.275s sys 2.392s
I20260927 06:56:39.962862 379 rpc-test.cc:1859] Sending 1024MB via ssl-enabled unix socket: real 3.353s user 3.328s sys 2.313s
W20260927 06:56:39.964843 833 connection.cc:196] Error closing socket: Network error: TlsSocket::Close: Broken pipe
[ OK ] Parameters/TestRpc.TestPerformanceBySocketType/SSL_UnixSocket (17078 ms)
[----------] 20 tests from Parameters/TestRpc (54358 ms total)
[----------] 1 test from Parameters/TestRpcSocketTxRxQueue
[ RUN ] Parameters/TestRpcSocketTxRxQueue.AcceptorRxQueueSizeMetric/0
I20260927 06:56:39.982102 861 acceptor_pool.cc:254] collecting diagnostics on the listening RPC socket 0.0.0.0:42623 every 1 connection(s)
I20260927 06:56:39.982332 862 acceptor_pool.cc:254] collecting diagnostics on the listening RPC socket 0.0.0.0:42623 every 1 connection(s)
W20260927 06:56:39.984149 857 negotiation.cc:337] Failed RPC negotiation. Trace:
0927 06:56:39.983700 (+ 0us) reactor.cc:625] Submitting negotiation task for server connection from 127.0.0.1:43686 (local address 127.0.0.1:42623)
0927 06:56:39.983876 (+ 176us) server_negotiation.cc:206] Beginning negotiation
0927 06:56:39.983880 (+ 4us) server_negotiation.cc:399] Waiting for connection header
0927 06:56:39.984016 (+ 136us) negotiation.cc:327] Negotiation complete: Network error: Server connection negotiation failed: server connection from 127.0.0.1:43686: BlockingRecv error: recv got EOF from 127.0.0.1:43686 (error 108)
Metrics: {"server-negotiator.queue_time_us":61}
[ OK ] Parameters/TestRpcSocketTxRxQueue.AcceptorRxQueueSizeMetric/0 (17 ms)
[----------] 1 test from Parameters/TestRpcSocketTxRxQueue (17 ms total)
[----------] Global test environment tear-down
[==========] 21 tests from 2 test suites ran. (54376 ms total)
[ PASSED ] 20 tests.
[ FAILED ] 1 test, listed below:
[ FAILED ] Parameters/TestRpc.TestCallWithChainCertAndChainCA/SSL_UnixSocket, where GetParam() = (true, true)
1 FAILED TEST