Diagnosed failure

Parameters/TestRpc.TestCallWithChainCertAndChainCA/SSL_TCP: /data0/somelongdirectorytoavoidrpathissues/src/kudu/src/kudu/rpc/rpc-test.cc:270: Failure
Failed
Bad status: Runtime error: could not verify certificate chain (error with cert: subject=CN = localhost, ST = sadfjas, C = AS, emailAddress = sdflkdsajf, O = lskdfjlsad, OU = sldfkja, issuer=C = AS, ST = ASDfkjdhf, L = lskdjf, O = saldfja, OU = skdjf, CN = localhost, emailAddress = sadjflkadsj): : certificate has expired
Google Test trace:
/data0/somelongdirectorytoavoidrpathissues/src/kudu/src/kudu/rpc/rpc-test.cc:267: Connecting to 0.0.0.0:46801
I20260929 16:26:09.618556  1269 test_util.cc:175] -----------------------------------------------
I20260929 16:26:09.618644  1269 test_util.cc:176] Had fatal failures, leaving test files at /tmp/dist-test-tasklEZ77x/test-tmp/rpc-test.5.Parameters_TestRpc.TestCallWithChainCertAndChainCA_SSL_TCP.1790699169541995-1269-0

Full log

Note: This is test shard 6 of 8.
[==========] Running 21 tests from 2 test suites.
[----------] Global test environment set-up.
[----------] 20 tests from Parameters/TestRpc
[ RUN      ] Parameters/TestRpc.TestMessengerCreateDestroy/SSL_TCP
WARNING: Logging before InitGoogleLogging() is written to STDERR
I20260929 16:26:09.574841  1269 rpc-test.cc:169] started messenger TestCreateDestroy
[       OK ] Parameters/TestRpc.TestMessengerCreateDestroy/SSL_TCP (27 ms)
[ RUN      ] Parameters/TestRpc.TestNegotiationDeadlock/SSL_TCP
I20260929 16:26:09.583305  1289 acceptor_pool.cc:254] collecting diagnostics on the listening RPC socket 0.0.0.0:38227 every 8 connection(s)
I20260929 16:26:09.583333  1290 acceptor_pool.cc:254] collecting diagnostics on the listening RPC socket 0.0.0.0:38227 every 8 connection(s)
[       OK ] Parameters/TestRpc.TestNegotiationDeadlock/SSL_TCP (20 ms)
[ RUN      ] Parameters/TestRpc.TestCallWithChainCertAndChainCA/SSL_TCP
I20260929 16:26:09.611760  1306 acceptor_pool.cc:254] collecting diagnostics on the listening RPC socket 0.0.0.0:46801 every 8 connection(s)
I20260929 16:26:09.611724  1305 acceptor_pool.cc:254] collecting diagnostics on the listening RPC socket 0.0.0.0:46801 every 8 connection(s)
/data0/somelongdirectorytoavoidrpathissues/src/kudu/src/kudu/rpc/rpc-test.cc:270: Failure
Failed
Bad status: Runtime error: could not verify certificate chain (error with cert: subject=CN = localhost, ST = sadfjas, C = AS, emailAddress = sdflkdsajf, O = lskdfjlsad, OU = sldfkja, issuer=C = AS, ST = ASDfkjdhf, L = lskdjf, O = saldfja, OU = skdjf, CN = localhost, emailAddress = sadjflkadsj): : certificate has expired
Google Test trace:
/data0/somelongdirectorytoavoidrpathissues/src/kudu/src/kudu/rpc/rpc-test.cc:267: Connecting to 0.0.0.0:46801
I20260929 16:26:09.618556  1269 test_util.cc:175] -----------------------------------------------
I20260929 16:26:09.618644  1269 test_util.cc:176] Had fatal failures, leaving test files at /tmp/dist-test-tasklEZ77x/test-tmp/rpc-test.5.Parameters_TestRpc.TestCallWithChainCertAndChainCA_SSL_TCP.1790699169541995-1269-0
[  FAILED  ] Parameters/TestRpc.TestCallWithChainCertAndChainCA/SSL_TCP, where GetParam() = (true, false) (20 ms)
[ RUN      ] Parameters/TestRpc.TestCallWithPasswordProtectedKey/SSL_TCP
I20260929 16:26:09.627518  1331 acceptor_pool.cc:254] collecting diagnostics on the listening RPC socket 0.0.0.0:36259 every 8 connection(s)
I20260929 16:26:09.627678  1330 acceptor_pool.cc:254] collecting diagnostics on the listening RPC socket 0.0.0.0:36259 every 8 connection(s)
[       OK ] Parameters/TestRpc.TestCallWithPasswordProtectedKey/SSL_TCP (27 ms)
[ RUN      ] Parameters/TestRpc.TestCallToBadServer/SSL_TCP
I20260929 16:26:09.658799  1269 rpc-test.cc:394] Status: Network error: Client connection negotiation failed: client connection to 0.0.0.0:0: connect: Connection refused (error 111)
I20260929 16:26:09.659648  1269 rpc-test.cc:394] Status: Network error: Client connection negotiation failed: client connection to 0.0.0.0:0: connect: Connection refused (error 111)
I20260929 16:26:09.660208  1269 rpc-test.cc:394] Status: Network error: Client connection negotiation failed: client connection to 0.0.0.0:0: connect: Connection refused (error 111)
I20260929 16:26:09.660724  1269 rpc-test.cc:394] Status: Network error: Client connection negotiation failed: client connection to 0.0.0.0:0: connect: Connection refused (error 111)
I20260929 16:26:09.661192  1269 rpc-test.cc:394] Status: Network error: Client connection negotiation failed: client connection to 0.0.0.0:0: connect: Connection refused (error 111)
[       OK ] Parameters/TestRpc.TestCallToBadServer/SSL_TCP (15 ms)
[ RUN      ] Parameters/TestRpc.TestWrongService/SSL_TCP
I20260929 16:26:09.675356  1365 acceptor_pool.cc:254] collecting diagnostics on the listening RPC socket 0.0.0.0:32849 every 8 connection(s)
I20260929 16:26:09.675374  1366 acceptor_pool.cc:254] collecting diagnostics on the listening RPC socket 0.0.0.0:32849 every 8 connection(s)
I20260929 16:26:09.700368  1363 messenger.cc:345] service WrongServiceName not registered on TestServer
[       OK ] Parameters/TestRpc.TestWrongService/SSL_TCP (41 ms)
[ RUN      ] Parameters/TestRpc.TestConnectionKeepalive/SSL_TCP
I20260929 16:26:09.723227  1388 acceptor_pool.cc:254] collecting diagnostics on the listening RPC socket 0.0.0.0:46559 every 8 connection(s)
I20260929 16:26:09.723253  1389 acceptor_pool.cc:254] collecting diagnostics on the listening RPC socket 0.0.0.0:46559 every 8 connection(s)
I20260929 16:26:09.723580  1269 rpc-test.cc:488] Connecting to 0.0.0.0:46559
[       OK ] Parameters/TestRpc.TestConnectionKeepalive/SSL_TCP (1057 ms)
[ RUN      ] Parameters/TestRpc.TestClientConnectionMetrics/SSL_TCP
I20260929 16:26:10.779908  1414 acceptor_pool.cc:254] collecting diagnostics on the listening RPC socket 0.0.0.0:37653 every 8 connection(s)
I20260929 16:26:10.779922  1413 acceptor_pool.cc:254] collecting diagnostics on the listening RPC socket 0.0.0.0:37653 every 8 connection(s)
I20260929 16:26:10.780233  1269 rpc-test.cc:569] Connecting to 0.0.0.0:37653
[       OK ] Parameters/TestRpc.TestClientConnectionMetrics/SSL_TCP (18572 ms)
[ RUN      ] Parameters/TestRpc.TestCredentialsPolicy/SSL_TCP
I20260929 16:26:29.344310  1437 acceptor_pool.cc:254] collecting diagnostics on the listening RPC socket 0.0.0.0:33351 every 8 connection(s)
I20260929 16:26:29.344302  1436 acceptor_pool.cc:254] collecting diagnostics on the listening RPC socket 0.0.0.0:33351 every 8 connection(s)
I20260929 16:26:29.344630  1269 rpc-test.cc:700] Connecting to 0.0.0.0:33351
[       OK ] Parameters/TestRpc.TestCredentialsPolicy/SSL_TCP (46 ms)
[ RUN      ] Parameters/TestRpc.TestCallLongerThanKeepalive/SSL_TCP
I20260929 16:26:29.393283  1462 acceptor_pool.cc:254] collecting diagnostics on the listening RPC socket 0.0.0.0:33885 every 8 connection(s)
I20260929 16:26:29.393388  1461 acceptor_pool.cc:254] collecting diagnostics on the listening RPC socket 0.0.0.0:33885 every 8 connection(s)
I20260929 16:26:29.422151  1465 rpc-test-base.h:222] got call: sleep_micros: 3000000 deferred: true
I20260929 16:26:32.423132  1465 rpcz_store.cc:275] Call kudu.rpc.GenericCalculatorService.Sleep from 127.0.0.1:44246 (request call id 0) took 3001 ms. Trace:
I20260929 16:26:32.423316  1465 rpcz_store.cc:276] 0929 16:26:29.422049 (+     0us) service_pool.cc:170] Inserting onto call queue
0929 16:26:29.422115 (+    66us) service_pool.cc:227] Handling call
0929 16:26:32.423108 (+3000993us) inbound_call.cc:173] Queueing success response
Metrics: {}
[       OK ] Parameters/TestRpc.TestCallLongerThanKeepalive/SSL_TCP (3047 ms)
[ RUN      ] Parameters/TestRpc.TestRpcSidecar/SSL_TCP
I20260929 16:26:32.450937  1486 acceptor_pool.cc:254] collecting diagnostics on the listening RPC socket 0.0.0.0:43653 every 8 connection(s)
I20260929 16:26:32.451340  1487 acceptor_pool.cc:254] collecting diagnostics on the listening RPC socket 0.0.0.0:43653 every 8 connection(s)
[       OK ] Parameters/TestRpc.TestRpcSidecar/SSL_TCP (113 ms)
[ RUN      ] Parameters/TestRpc.TestRpcSidecarLimits/SSL_TCP
I20260929 16:26:34.185403  1512 acceptor_pool.cc:254] collecting diagnostics on the listening RPC socket 0.0.0.0:45919 every 8 connection(s)
I20260929 16:26:34.185671  1511 acceptor_pool.cc:254] collecting diagnostics on the listening RPC socket 0.0.0.0:45919 every 8 connection(s)
W20260929 16:26:34.193459  1269 serialization.cc:72] Serialized kudu.rpc_test.PushStringsRequestPB (2147483654 bytes) is larger than the maximum configured RPC message size (52428800 bytes). Sending anyway, but peer may reject the data.
W20260929 16:26:34.198909  1508 connection.cc:535] server connection from 127.0.0.1:44148 recv error: Network error: RPC frame had a length of 2147483714, but we only support messages up to 52428800 bytes long.
W20260929 16:26:34.199087  1508 connection.cc:158] shutting down server connection from 127.0.0.1:44148 with pending inbound data: 4/2147483714 bytes received; last active 0 ns ago: status Network error: RPC frame had a length of 2147483714, but we only support messages up to 52428800 bytes long.
W20260929 16:26:34.199589  1524 connection.cc:196] Error closing socket: Network error: TlsSocket::Close: Connection reset by peer
I20260929 16:26:34.211791  1537 acceptor_pool.cc:254] collecting diagnostics on the listening RPC socket 0.0.0.0:40779 every 8 connection(s)
I20260929 16:26:34.211939  1536 acceptor_pool.cc:254] collecting diagnostics on the listening RPC socket 0.0.0.0:40779 every 8 connection(s)
W20260929 16:26:38.908041  1533 connection.cc:577] server connection from 127.0.0.1:48910: received bad data: 'Corruption: Invalid packet: message had a length of 2147483710, but we only support messages up to 2147483647 bytes
'
[       OK ] Parameters/TestRpc.TestRpcSidecarLimits/SSL_TCP (6369 ms)
[ RUN      ] Parameters/TestRpc.TestCallTimeoutDoesntAffectNegotiation/SSL_TCP
I20260929 16:26:38.929311  1561 acceptor_pool.cc:254] collecting diagnostics on the listening RPC socket 0.0.0.0:36089 every 8 connection(s)
I20260929 16:26:38.929373  1562 acceptor_pool.cc:254] collecting diagnostics on the listening RPC socket 0.0.0.0:36089 every 8 connection(s)
W20260929 16:26:38.944409  1557 negotiation.cc:266] Injecting 500ms delay in negotiation
I20260929 16:26:38.994666  1269 rpc-test-base.h:595] status: Timed out: connection negotiation to 0.0.0.0:36089 for RPC Sleep timed out after 0.050s (ON_OUTBOUND_QUEUE), seconds elapsed: 0.051069
[       OK ] Parameters/TestRpc.TestCallTimeoutDoesntAffectNegotiation/SSL_TCP (540 ms)
[ RUN      ] Parameters/TestRpc.TestRpcHandlerLatencyMetric/SSL_TCP
I20260929 16:26:39.480201  1586 acceptor_pool.cc:254] collecting diagnostics on the listening RPC socket 0.0.0.0:34995 every 8 connection(s)
I20260929 16:26:39.480228  1587 acceptor_pool.cc:254] collecting diagnostics on the listening RPC socket 0.0.0.0:34995 every 8 connection(s)
I20260929 16:26:39.535409  1269 rpc-test.cc:1236] Sleep() min lat: 20608
I20260929 16:26:39.535619  1269 rpc-test.cc:1237] Sleep() mean lat: 20608
I20260929 16:26:39.535655  1269 rpc-test.cc:1238] Sleep() max lat: 20608
I20260929 16:26:39.535670  1269 rpc-test.cc:1239] Sleep() #calls: 1
[       OK ] Parameters/TestRpc.TestRpcHandlerLatencyMetric/SSL_TCP (85 ms)
[ RUN      ] Parameters/TestRpc.TimedOutOnResponseMetricServiceQueue/SSL_TCP
I20260929 16:26:39.560972  1612 acceptor_pool.cc:254] collecting diagnostics on the listening RPC socket 0.0.0.0:38123 every 8 connection(s)
I20260929 16:26:39.561015  1613 acceptor_pool.cc:254] collecting diagnostics on the listening RPC socket 0.0.0.0:38123 every 8 connection(s)
W20260929 16:26:39.620512  1614 rpcz_store.cc:267] Call kudu.rpc_test.CalculatorService.Sleep from 127.0.0.1:33846 (request call id 2) took 20 ms (client timeout 20 ms). Trace:
W20260929 16:26:39.620678  1614 rpcz_store.cc:269] 0929 16:26:39.599958 (+     0us) service_pool.cc:170] Inserting onto call queue
0929 16:26:39.620440 (+ 20482us) service_pool.cc:214] Skipping call since client already timed out
0929 16:26:39.620490 (+    50us) inbound_call.cc:173] Queueing failure response
Metrics: {}
[       OK ] Parameters/TestRpc.TimedOutOnResponseMetricServiceQueue/SSL_TCP (84 ms)
[ RUN      ] Parameters/TestRpc.RpcPendingConnectionsMetric/SSL_TCP
I20260929 16:26:39.626572  1635 acceptor_pool.cc:254] collecting diagnostics on the listening RPC socket 0.0.0.0:42361 every 8 connection(s)
I20260929 16:26:39.626649  1636 acceptor_pool.cc:254] collecting diagnostics on the listening RPC socket 0.0.0.0:42361 every 8 connection(s)
W20260929 16:26:39.628055  1631 negotiation.cc:337] Failed RPC negotiation. Trace:
0929 16:26:39.627548 (+     0us) reactor.cc:625] Submitting negotiation task for server connection from 127.0.0.1:57830 (local address 127.0.0.1:42361)
0929 16:26:39.627709 (+   161us) server_negotiation.cc:206] Beginning negotiation
0929 16:26:39.627712 (+     3us) server_negotiation.cc:399] Waiting for connection header
0929 16:26:39.627809 (+    97us) negotiation.cc:327] Negotiation complete: Network error: Server connection negotiation failed: server connection from 127.0.0.1:57830: BlockingRecv error: recv got EOF from 127.0.0.1:57830 (error 108)
Metrics: {"server-negotiator.queue_time_us":55}
[       OK ] Parameters/TestRpc.RpcPendingConnectionsMetric/SSL_TCP (16 ms)
[ RUN      ] Parameters/TestRpc.TestRpcContextClientDeadline/SSL_TCP
I20260929 16:26:39.652371  1651 acceptor_pool.cc:254] collecting diagnostics on the listening RPC socket 0.0.0.0:39599 every 8 connection(s)
I20260929 16:26:39.652441  1652 acceptor_pool.cc:254] collecting diagnostics on the listening RPC socket 0.0.0.0:39599 every 8 connection(s)
[       OK ] Parameters/TestRpc.TestRpcContextClientDeadline/SSL_TCP (57 ms)
[ RUN      ] Parameters/TestRpc.TestApplicationFeatureFlagUnsupportedServer/SSL_TCP
I20260929 16:26:39.706976  1676 acceptor_pool.cc:254] collecting diagnostics on the listening RPC socket 0.0.0.0:43063 every 8 connection(s)
I20260929 16:26:39.706983  1677 acceptor_pool.cc:254] collecting diagnostics on the listening RPC socket 0.0.0.0:43063 every 8 connection(s)
[       OK ] Parameters/TestRpc.TestApplicationFeatureFlagUnsupportedServer/SSL_TCP (28 ms)
[ RUN      ] Parameters/TestRpc.TestCancellationAsync/SSL_TCP
I20260929 16:26:39.736845  1702 acceptor_pool.cc:254] collecting diagnostics on the listening RPC socket 0.0.0.0:38477 every 8 connection(s)
I20260929 16:26:39.737042  1701 acceptor_pool.cc:254] collecting diagnostics on the listening RPC socket 0.0.0.0:38477 every 8 connection(s)
I20260929 16:26:39.737188  1269 rpc-test.cc:1716] Connecting to 0.0.0.0:38477
I20260929 16:26:39.761245  1269 test_util.cc:268] Using random seed: -1514960040
I20260929 16:26:39.791429  1705 rpc-test-base.h:240] got call: sleep_micros: 500 pattern: 4294967295 num_repetitions: 2097152 sidecar_idx: 0
I20260929 16:26:39.819427  1705 rpc-test-base.h:240] got call: sleep_micros: 500 pattern: 4294967295 num_repetitions: 2097152 sidecar_idx: 0
I20260929 16:26:39.846211  1705 rpc-test-base.h:240] got call: sleep_micros: 500 pattern: 4294967295 num_repetitions: 2097152 sidecar_idx: 0
I20260929 16:26:39.872748  1705 rpc-test-base.h:240] got call: sleep_micros: 500 pattern: 4294967295 num_repetitions: 2097152 sidecar_idx: 0
I20260929 16:26:39.900454  1705 rpc-test-base.h:240] got call: sleep_micros: 500 pattern: 4294967295 num_repetitions: 2097152 sidecar_idx: 0
I20260929 16:26:39.928777  1705 rpc-test-base.h:240] got call: sleep_micros: 500 pattern: 4294967295 num_repetitions: 2097152 sidecar_idx: 0
I20260929 16:26:39.957306  1705 rpc-test-base.h:240] got call: sleep_micros: 500 pattern: 4294967295 num_repetitions: 2097152 sidecar_idx: 0
I20260929 16:26:39.987906  1705 rpc-test-base.h:240] got call: sleep_micros: 500 pattern: 4294967295 num_repetitions: 2097152 sidecar_idx: 0
W20260929 16:26:40.006523  1698 connection.cc:441] server connection from 127.0.0.1:60000 torn down before Call kudu.rpc.GenericCalculatorService.SleepWithSidecar from 127.0.0.1:60000 (request call id 9) could send its response
[       OK ] Parameters/TestRpc.TestCancellationAsync/SSL_TCP (282 ms)
[ RUN      ] Parameters/TestRpc.TestPerformanceBySocketType/SSL_TCP
I20260929 16:26:40.034359  1726 acceptor_pool.cc:254] collecting diagnostics on the listening RPC socket 0.0.0.0:41567 every 8 connection(s)
I20260929 16:26:40.034408  1727 acceptor_pool.cc:254] collecting diagnostics on the listening RPC socket 0.0.0.0:41567 every 8 connection(s)
I20260929 16:26:40.034790  1269 rpc-test.cc:1846] Connecting to 0.0.0.0:41567
I20260929 16:26:43.015911  1269 rpc-test.cc:1859] Sending 1024MB via ssl-enabled tcp socket: real 2.959s	user 2.884s	sys 2.325s
I20260929 16:26:46.097090  1269 rpc-test.cc:1859] Sending 1024MB via ssl-enabled tcp socket: real 3.081s	user 2.853s	sys 2.529s
I20260929 16:26:49.067888  1269 rpc-test.cc:1859] Sending 1024MB via ssl-enabled tcp socket: real 2.971s	user 2.984s	sys 2.251s
I20260929 16:26:52.019908  1269 rpc-test.cc:1859] Sending 1024MB via ssl-enabled tcp socket: real 2.952s	user 2.805s	sys 2.376s
I20260929 16:26:54.978507  1269 rpc-test.cc:1859] Sending 1024MB via ssl-enabled tcp socket: real 2.958s	user 2.815s	sys 2.372s
[       OK ] Parameters/TestRpc.TestPerformanceBySocketType/SSL_TCP (14972 ms)
[----------] 20 tests from Parameters/TestRpc (45432 ms total)

[----------] 1 test from Parameters/TestRpcSocketTxRxQueue
[ RUN      ] Parameters/TestRpcSocketTxRxQueue.OverCapacity/0
W20260929 16:26:55.263527  1770 negotiation.cc:337] Failed RPC negotiation. Trace:
0929 16:26:54.995805 (+     0us) reactor.cc:625] Submitting negotiation task for client connection to 0.0.0.0:42731 (local address 127.0.0.1:59880)
0929 16:26:54.995968 (+   163us) negotiation.cc:107] Waiting for socket to connect
0929 16:26:54.995988 (+    20us) client_negotiation.cc:174] Beginning negotiation
0929 16:26:54.996100 (+   112us) client_negotiation.cc:252] Sending NEGOTIATE NegotiatePB request
0929 16:26:55.263276 (+267176us) negotiation.cc:327] Negotiation complete: Network error: Client connection negotiation failed: client connection to 0.0.0.0:42731: BlockingRecv error: recv error from unknown peer: Transport endpoint is not connected (error 107)
Metrics: {"client-negotiator.queue_time_us":61}
W20260929 16:26:55.263625  1752 negotiation.cc:337] Failed RPC negotiation. Trace:
0929 16:26:54.992735 (+     0us) reactor.cc:625] Submitting negotiation task for client connection to 0.0.0.0:42731 (local address 127.0.0.1:59868)
0929 16:26:54.992872 (+   137us) negotiation.cc:107] Waiting for socket to connect
0929 16:26:54.992887 (+    15us) client_negotiation.cc:174] Beginning negotiation
0929 16:26:54.992987 (+   100us) client_negotiation.cc:252] Sending NEGOTIATE NegotiatePB request
0929 16:26:55.263332 (+270345us) negotiation.cc:327] Negotiation complete: Network error: Client connection negotiation failed: client connection to 0.0.0.0:42731: BlockingRecv error: recv error from unknown peer: Transport endpoint is not connected (error 107)
Metrics: {"client-negotiator.queue_time_us":52}
W20260929 16:26:55.263751  1788 negotiation.cc:337] Failed RPC negotiation. Trace:
0929 16:26:54.998773 (+     0us) reactor.cc:625] Submitting negotiation task for client connection to 0.0.0.0:42731 (local address 127.0.0.1:59904)
0929 16:26:54.998891 (+   118us) negotiation.cc:107] Waiting for socket to connect
0929 16:26:54.998903 (+    12us) client_negotiation.cc:174] Beginning negotiation
0929 16:26:54.999023 (+   120us) client_negotiation.cc:252] Sending NEGOTIATE NegotiatePB request
0929 16:26:55.263670 (+264647us) negotiation.cc:327] Negotiation complete: Network error: Client connection negotiation failed: client connection to 0.0.0.0:42731: BlockingRecv error: recv error from unknown peer: Transport endpoint is not connected (error 107)
Metrics: {"client-negotiator.queue_time_us":54}
W20260929 16:26:55.263916  1761 negotiation.cc:337] Failed RPC negotiation. Trace:
0929 16:26:54.994356 (+     0us) reactor.cc:625] Submitting negotiation task for client connection to 0.0.0.0:42731 (local address 127.0.0.1:59870)
0929 16:26:54.994513 (+   157us) negotiation.cc:107] Waiting for socket to connect
0929 16:26:54.994527 (+    14us) client_negotiation.cc:174] Beginning negotiation
0929 16:26:54.994676 (+   149us) client_negotiation.cc:252] Sending NEGOTIATE NegotiatePB request
0929 16:26:55.263276 (+268600us) negotiation.cc:327] Negotiation complete: Network error: Client connection negotiation failed: client connection to 0.0.0.0:42731: BlockingRecv error: recv error from unknown peer: Transport endpoint is not connected (error 107)
Metrics: {"client-negotiator.queue_time_us":67}
W20260929 16:26:55.263545  1779 negotiation.cc:337] Failed RPC negotiation. Trace:
0929 16:26:54.997264 (+     0us) reactor.cc:625] Submitting negotiation task for client connection to 0.0.0.0:42731 (local address 127.0.0.1:59892)
0929 16:26:54.997472 (+   208us) negotiation.cc:107] Waiting for socket to connect
0929 16:26:54.997493 (+    21us) client_negotiation.cc:174] Beginning negotiation
0929 16:26:54.997612 (+   119us) client_negotiation.cc:252] Sending NEGOTIATE NegotiatePB request
0929 16:26:55.263439 (+265827us) negotiation.cc:327] Negotiation complete: Network error: Client connection negotiation failed: client connection to 0.0.0.0:42731: BlockingRecv error: recv error from unknown peer: Transport endpoint is not connected (error 107)
Metrics: {"client-negotiator.queue_time_us":73}
W20260929 16:26:55.264168  1743 negotiation.cc:337] Failed RPC negotiation. Trace:
0929 16:26:54.991128 (+     0us) reactor.cc:625] Submitting negotiation task for client connection to 0.0.0.0:42731 (local address 127.0.0.1:59866)
0929 16:26:54.991318 (+   190us) negotiation.cc:107] Waiting for socket to connect
0929 16:26:54.991340 (+    22us) client_negotiation.cc:174] Beginning negotiation
0929 16:26:54.991555 (+   215us) client_negotiation.cc:252] Sending NEGOTIATE NegotiatePB request
0929 16:26:55.263332 (+271777us) negotiation.cc:327] Negotiation complete: Network error: Client connection negotiation failed: client connection to 0.0.0.0:42731: BlockingRecv error: recv error from unknown peer: Transport endpoint is not connected (error 107)
Metrics: {"client-negotiator.queue_time_us":71}
[       OK ] Parameters/TestRpcSocketTxRxQueue.OverCapacity/0 (1040 ms)
[----------] 1 test from Parameters/TestRpcSocketTxRxQueue (1040 ms total)

[----------] Global test environment tear-down
[==========] 21 tests from 2 test suites ran. (46473 ms total)
[  PASSED  ] 20 tests.
[  FAILED  ] 1 test, listed below:
[  FAILED  ] Parameters/TestRpc.TestCallWithChainCertAndChainCA/SSL_TCP, where GetParam() = (true, false)

 1 FAILED TEST