Diagnosed failure

Parameters/TestRpc.TestCallWithChainCertAndChainCA/SSL_TCP: /data0/somelongdirectorytoavoidrpathissues/src/kudu/src/kudu/rpc/rpc-test.cc:270: Failure
Failed
Bad status: Runtime error: could not verify certificate chain (error with cert: subject=CN = localhost, ST = sadfjas, C = AS, emailAddress = sdflkdsajf, O = lskdfjlsad, OU = sldfkja, issuer=C = AS, ST = ASDfkjdhf, L = lskdjf, O = saldfja, OU = skdjf, CN = localhost, emailAddress = sadjflkadsj): : certificate has expired
Google Test trace:
/data0/somelongdirectorytoavoidrpathissues/src/kudu/src/kudu/rpc/rpc-test.cc:267: Connecting to 0.0.0.0:44411
I20260925 14:50:58.292217   772 test_util.cc:175] -----------------------------------------------
I20260925 14:50:58.292277   772 test_util.cc:176] Had fatal failures, leaving test files at /tmp/dist-test-taskJUHO9R/test-tmp/rpc-test.5.Parameters_TestRpc.TestCallWithChainCertAndChainCA_SSL_TCP.1790347858233015-772-0

Full log

Note: This is test shard 6 of 8.
[==========] Running 21 tests from 2 test suites.
[----------] Global test environment set-up.
[----------] 20 tests from Parameters/TestRpc
[ RUN      ] Parameters/TestRpc.TestMessengerCreateDestroy/SSL_TCP
WARNING: Logging before InitGoogleLogging() is written to STDERR
I20260925 14:50:58.262831   772 rpc-test.cc:169] started messenger TestCreateDestroy
[       OK ] Parameters/TestRpc.TestMessengerCreateDestroy/SSL_TCP (28 ms)
[ RUN      ] Parameters/TestRpc.TestNegotiationDeadlock/SSL_TCP
I20260925 14:50:58.271987   792 acceptor_pool.cc:254] collecting diagnostics on the listening RPC socket 0.0.0.0:39437 every 8 connection(s)
I20260925 14:50:58.271998   793 acceptor_pool.cc:254] collecting diagnostics on the listening RPC socket 0.0.0.0:39437 every 8 connection(s)
[       OK ] Parameters/TestRpc.TestNegotiationDeadlock/SSL_TCP (15 ms)
[ RUN      ] Parameters/TestRpc.TestCallWithChainCertAndChainCA/SSL_TCP
I20260925 14:50:58.288142   809 acceptor_pool.cc:254] collecting diagnostics on the listening RPC socket 0.0.0.0:44411 every 8 connection(s)
I20260925 14:50:58.288115   808 acceptor_pool.cc:254] collecting diagnostics on the listening RPC socket 0.0.0.0:44411 every 8 connection(s)
/data0/somelongdirectorytoavoidrpathissues/src/kudu/src/kudu/rpc/rpc-test.cc:270: Failure
Failed
Bad status: Runtime error: could not verify certificate chain (error with cert: subject=CN = localhost, ST = sadfjas, C = AS, emailAddress = sdflkdsajf, O = lskdfjlsad, OU = sldfkja, issuer=C = AS, ST = ASDfkjdhf, L = lskdjf, O = saldfja, OU = skdjf, CN = localhost, emailAddress = sadjflkadsj): : certificate has expired
Google Test trace:
/data0/somelongdirectorytoavoidrpathissues/src/kudu/src/kudu/rpc/rpc-test.cc:267: Connecting to 0.0.0.0:44411
I20260925 14:50:58.292217   772 test_util.cc:175] -----------------------------------------------
I20260925 14:50:58.292277   772 test_util.cc:176] Had fatal failures, leaving test files at /tmp/dist-test-taskJUHO9R/test-tmp/rpc-test.5.Parameters_TestRpc.TestCallWithChainCertAndChainCA_SSL_TCP.1790347858233015-772-0
[  FAILED  ] Parameters/TestRpc.TestCallWithChainCertAndChainCA/SSL_TCP, where GetParam() = (true, false) (13 ms)
[ RUN      ] Parameters/TestRpc.TestCallWithPasswordProtectedKey/SSL_TCP
I20260925 14:50:58.306103   833 acceptor_pool.cc:254] collecting diagnostics on the listening RPC socket 0.0.0.0:46197 every 8 connection(s)
I20260925 14:50:58.306137   834 acceptor_pool.cc:254] collecting diagnostics on the listening RPC socket 0.0.0.0:46197 every 8 connection(s)
[       OK ] Parameters/TestRpc.TestCallWithPasswordProtectedKey/SSL_TCP (27 ms)
[ RUN      ] Parameters/TestRpc.TestCallToBadServer/SSL_TCP
I20260925 14:50:58.324765   772 rpc-test.cc:394] Status: Network error: Client connection negotiation failed: client connection to 0.0.0.0:0: connect: Connection refused (error 111)
I20260925 14:50:58.325037   772 rpc-test.cc:394] Status: Network error: Client connection negotiation failed: client connection to 0.0.0.0:0: connect: Connection refused (error 111)
I20260925 14:50:58.325214   772 rpc-test.cc:394] Status: Network error: Client connection negotiation failed: client connection to 0.0.0.0:0: connect: Connection refused (error 111)
I20260925 14:50:58.325433   772 rpc-test.cc:394] Status: Network error: Client connection negotiation failed: client connection to 0.0.0.0:0: connect: Connection refused (error 111)
I20260925 14:50:58.325595   772 rpc-test.cc:394] Status: Network error: Client connection negotiation failed: client connection to 0.0.0.0:0: connect: Connection refused (error 111)
[       OK ] Parameters/TestRpc.TestCallToBadServer/SSL_TCP (6 ms)
[ RUN      ] Parameters/TestRpc.TestWrongService/SSL_TCP
I20260925 14:50:58.351470   868 acceptor_pool.cc:254] collecting diagnostics on the listening RPC socket 0.0.0.0:34909 every 8 connection(s)
I20260925 14:50:58.351509   869 acceptor_pool.cc:254] collecting diagnostics on the listening RPC socket 0.0.0.0:34909 every 8 connection(s)
I20260925 14:50:58.367269   866 messenger.cc:345] service WrongServiceName not registered on TestServer
[       OK ] Parameters/TestRpc.TestWrongService/SSL_TCP (42 ms)
[ RUN      ] Parameters/TestRpc.TestConnectionKeepalive/SSL_TCP
I20260925 14:50:58.378862   891 acceptor_pool.cc:254] collecting diagnostics on the listening RPC socket 0.0.0.0:44623 every 8 connection(s)
I20260925 14:50:58.378897   892 acceptor_pool.cc:254] collecting diagnostics on the listening RPC socket 0.0.0.0:44623 every 8 connection(s)
I20260925 14:50:58.379058   772 rpc-test.cc:488] Connecting to 0.0.0.0:44623
[       OK ] Parameters/TestRpc.TestConnectionKeepalive/SSL_TCP (1044 ms)
[ RUN      ] Parameters/TestRpc.TestClientConnectionMetrics/SSL_TCP
I20260925 14:50:59.425597   916 acceptor_pool.cc:254] collecting diagnostics on the listening RPC socket 0.0.0.0:35309 every 8 connection(s)
I20260925 14:50:59.425635   917 acceptor_pool.cc:254] collecting diagnostics on the listening RPC socket 0.0.0.0:35309 every 8 connection(s)
I20260925 14:50:59.425784   772 rpc-test.cc:569] Connecting to 0.0.0.0:35309
[       OK ] Parameters/TestRpc.TestClientConnectionMetrics/SSL_TCP (8675 ms)
[ RUN      ] Parameters/TestRpc.TestCredentialsPolicy/SSL_TCP
I20260925 14:51:08.104532   939 acceptor_pool.cc:254] collecting diagnostics on the listening RPC socket 0.0.0.0:40697 every 8 connection(s)
I20260925 14:51:08.104573   940 acceptor_pool.cc:254] collecting diagnostics on the listening RPC socket 0.0.0.0:40697 every 8 connection(s)
I20260925 14:51:08.104776   772 rpc-test.cc:700] Connecting to 0.0.0.0:40697
[       OK ] Parameters/TestRpc.TestCredentialsPolicy/SSL_TCP (36 ms)
[ RUN      ] Parameters/TestRpc.TestCallLongerThanKeepalive/SSL_TCP
I20260925 14:51:08.143263   964 acceptor_pool.cc:254] collecting diagnostics on the listening RPC socket 0.0.0.0:40767 every 8 connection(s)
I20260925 14:51:08.143307   965 acceptor_pool.cc:254] collecting diagnostics on the listening RPC socket 0.0.0.0:40767 every 8 connection(s)
I20260925 14:51:08.155078   968 rpc-test-base.h:222] got call: sleep_micros: 3000000 deferred: true
I20260925 14:51:11.155845   968 rpcz_store.cc:275] Call kudu.rpc.GenericCalculatorService.Sleep from 127.0.0.1:49444 (request call id 0) took 3000 ms. Trace:
I20260925 14:51:11.155987   968 rpcz_store.cc:276] 0925 14:51:08.155006 (+     0us) service_pool.cc:170] Inserting onto call queue
0925 14:51:08.155043 (+    37us) service_pool.cc:227] Handling call
0925 14:51:11.155829 (+3000786us) inbound_call.cc:173] Queueing success response
Metrics: {}
[       OK ] Parameters/TestRpc.TestCallLongerThanKeepalive/SSL_TCP (3031 ms)
[ RUN      ] Parameters/TestRpc.TestRpcSidecar/SSL_TCP
I20260925 14:51:11.174299   989 acceptor_pool.cc:254] collecting diagnostics on the listening RPC socket 0.0.0.0:41687 every 8 connection(s)
I20260925 14:51:11.174340   990 acceptor_pool.cc:254] collecting diagnostics on the listening RPC socket 0.0.0.0:41687 every 8 connection(s)
[       OK ] Parameters/TestRpc.TestRpcSidecar/SSL_TCP (62 ms)
[ RUN      ] Parameters/TestRpc.TestRpcSidecarLimits/SSL_TCP
I20260925 14:51:13.005939  1014 acceptor_pool.cc:254] collecting diagnostics on the listening RPC socket 0.0.0.0:37701 every 8 connection(s)
I20260925 14:51:13.005976  1015 acceptor_pool.cc:254] collecting diagnostics on the listening RPC socket 0.0.0.0:37701 every 8 connection(s)
W20260925 14:51:13.020572   772 serialization.cc:72] Serialized kudu.rpc_test.PushStringsRequestPB (2147483654 bytes) is larger than the maximum configured RPC message size (52428800 bytes). Sending anyway, but peer may reject the data.
W20260925 14:51:13.023983  1011 connection.cc:535] server connection from 127.0.0.1:47210 recv error: Network error: RPC frame had a length of 2147483714, but we only support messages up to 52428800 bytes long.
W20260925 14:51:13.024044  1011 connection.cc:158] shutting down server connection from 127.0.0.1:47210 with pending inbound data: 4/2147483714 bytes received; last active 0 ns ago: status Network error: RPC frame had a length of 2147483714, but we only support messages up to 52428800 bytes long.
W20260925 14:51:13.024256  1027 connection.cc:196] Error closing socket: Network error: TlsSocket::Close: Connection reset by peer
I20260925 14:51:13.035746  1039 acceptor_pool.cc:254] collecting diagnostics on the listening RPC socket 0.0.0.0:36967 every 8 connection(s)
I20260925 14:51:13.035830  1040 acceptor_pool.cc:254] collecting diagnostics on the listening RPC socket 0.0.0.0:36967 every 8 connection(s)
W20260925 14:51:16.867825  1036 connection.cc:577] server connection from 127.0.0.1:46292: received bad data: 'Corruption: Invalid packet: message had a length of 2147483710, but we only support messages up to 2147483647 bytes
'
[       OK ] Parameters/TestRpc.TestRpcSidecarLimits/SSL_TCP (5651 ms)
[ RUN      ] Parameters/TestRpc.TestCallTimeoutDoesntAffectNegotiation/SSL_TCP
I20260925 14:51:16.884167  1064 acceptor_pool.cc:254] collecting diagnostics on the listening RPC socket 0.0.0.0:37839 every 8 connection(s)
I20260925 14:51:16.884202  1065 acceptor_pool.cc:254] collecting diagnostics on the listening RPC socket 0.0.0.0:37839 every 8 connection(s)
W20260925 14:51:16.894810  1060 negotiation.cc:266] Injecting 500ms delay in negotiation
I20260925 14:51:16.945024   772 rpc-test-base.h:595] status: Timed out: connection negotiation to 0.0.0.0:37839 for RPC Sleep timed out after 0.050s (ON_OUTBOUND_QUEUE), seconds elapsed: 0.050745
[       OK ] Parameters/TestRpc.TestCallTimeoutDoesntAffectNegotiation/SSL_TCP (529 ms)
[ RUN      ] Parameters/TestRpc.TestRpcHandlerLatencyMetric/SSL_TCP
I20260925 14:51:17.413718  1089 acceptor_pool.cc:254] collecting diagnostics on the listening RPC socket 0.0.0.0:41469 every 8 connection(s)
I20260925 14:51:17.413745  1090 acceptor_pool.cc:254] collecting diagnostics on the listening RPC socket 0.0.0.0:41469 every 8 connection(s)
I20260925 14:51:17.448093   772 rpc-test.cc:1236] Sleep() min lat: 20326
I20260925 14:51:17.448166   772 rpc-test.cc:1237] Sleep() mean lat: 20326
I20260925 14:51:17.448194   772 rpc-test.cc:1238] Sleep() max lat: 20326
I20260925 14:51:17.448207   772 rpc-test.cc:1239] Sleep() #calls: 1
[       OK ] Parameters/TestRpc.TestRpcHandlerLatencyMetric/SSL_TCP (48 ms)
[ RUN      ] Parameters/TestRpc.TimedOutOnResponseMetricServiceQueue/SSL_TCP
I20260925 14:51:17.458510  1115 acceptor_pool.cc:254] collecting diagnostics on the listening RPC socket 0.0.0.0:42535 every 8 connection(s)
I20260925 14:51:17.458540  1116 acceptor_pool.cc:254] collecting diagnostics on the listening RPC socket 0.0.0.0:42535 every 8 connection(s)
W20260925 14:51:17.530723  1117 rpcz_store.cc:267] Call kudu.rpc_test.CalculatorService.Sleep from 127.0.0.1:35564 (request call id 2) took 20 ms (client timeout 20 ms). Trace:
W20260925 14:51:17.530853  1117 rpcz_store.cc:269] 0925 14:51:17.510367 (+     0us) service_pool.cc:170] Inserting onto call queue
0925 14:51:17.530700 (+ 20333us) service_pool.cc:214] Skipping call since client already timed out
0925 14:51:17.530709 (+     9us) inbound_call.cc:173] Queueing failure response
Metrics: {}
[       OK ] Parameters/TestRpc.TimedOutOnResponseMetricServiceQueue/SSL_TCP (82 ms)
[ RUN      ] Parameters/TestRpc.RpcPendingConnectionsMetric/SSL_TCP
I20260925 14:51:17.534543  1138 acceptor_pool.cc:254] collecting diagnostics on the listening RPC socket 0.0.0.0:44471 every 8 connection(s)
I20260925 14:51:17.534612  1139 acceptor_pool.cc:254] collecting diagnostics on the listening RPC socket 0.0.0.0:44471 every 8 connection(s)
W20260925 14:51:17.543448  1134 negotiation.cc:337] Failed RPC negotiation. Trace:
0925 14:51:17.543143 (+     0us) reactor.cc:625] Submitting negotiation task for server connection from 127.0.0.1:50166 (local address 127.0.0.1:44471)
0925 14:51:17.543233 (+    90us) server_negotiation.cc:206] Beginning negotiation
0925 14:51:17.543235 (+     2us) server_negotiation.cc:399] Waiting for connection header
0925 14:51:17.543347 (+   112us) negotiation.cc:327] Negotiation complete: Network error: Server connection negotiation failed: server connection from 127.0.0.1:50166: BlockingRecv error: recv got EOF from 127.0.0.1:50166 (error 108)
Metrics: {"server-negotiator.queue_time_us":46}
[       OK ] Parameters/TestRpc.RpcPendingConnectionsMetric/SSL_TCP (21 ms)
[ RUN      ] Parameters/TestRpc.TestRpcContextClientDeadline/SSL_TCP
I20260925 14:51:17.586835  1154 acceptor_pool.cc:254] collecting diagnostics on the listening RPC socket 0.0.0.0:41281 every 8 connection(s)
I20260925 14:51:17.586858  1155 acceptor_pool.cc:254] collecting diagnostics on the listening RPC socket 0.0.0.0:41281 every 8 connection(s)
[       OK ] Parameters/TestRpc.TestRpcContextClientDeadline/SSL_TCP (72 ms)
[ RUN      ] Parameters/TestRpc.TestApplicationFeatureFlagUnsupportedServer/SSL_TCP
I20260925 14:51:17.645875  1179 acceptor_pool.cc:254] collecting diagnostics on the listening RPC socket 0.0.0.0:36803 every 8 connection(s)
I20260925 14:51:17.645910  1180 acceptor_pool.cc:254] collecting diagnostics on the listening RPC socket 0.0.0.0:36803 every 8 connection(s)
[       OK ] Parameters/TestRpc.TestApplicationFeatureFlagUnsupportedServer/SSL_TCP (29 ms)
[ RUN      ] Parameters/TestRpc.TestCancellationAsync/SSL_TCP
I20260925 14:51:17.660873  1204 acceptor_pool.cc:254] collecting diagnostics on the listening RPC socket 0.0.0.0:37705 every 8 connection(s)
I20260925 14:51:17.660921  1205 acceptor_pool.cc:254] collecting diagnostics on the listening RPC socket 0.0.0.0:37705 every 8 connection(s)
I20260925 14:51:17.661072   772 rpc-test.cc:1716] Connecting to 0.0.0.0:37705
I20260925 14:51:17.682221   772 test_util.cc:268] Using random seed: -649720790
I20260925 14:51:17.703114  1208 rpc-test-base.h:240] got call: sleep_micros: 500 pattern: 4294967295 num_repetitions: 2097152 sidecar_idx: 0
I20260925 14:51:17.716673  1208 rpc-test-base.h:240] got call: sleep_micros: 500 pattern: 4294967295 num_repetitions: 2097152 sidecar_idx: 0
I20260925 14:51:17.731196  1208 rpc-test-base.h:240] got call: sleep_micros: 500 pattern: 4294967295 num_repetitions: 2097152 sidecar_idx: 0
I20260925 14:51:17.746099  1208 rpc-test-base.h:240] got call: sleep_micros: 500 pattern: 4294967295 num_repetitions: 2097152 sidecar_idx: 0
I20260925 14:51:17.760753  1208 rpc-test-base.h:240] got call: sleep_micros: 500 pattern: 4294967295 num_repetitions: 2097152 sidecar_idx: 0
I20260925 14:51:17.778437  1208 rpc-test-base.h:240] got call: sleep_micros: 500 pattern: 4294967295 num_repetitions: 2097152 sidecar_idx: 0
I20260925 14:51:17.792448  1208 rpc-test-base.h:240] got call: sleep_micros: 500 pattern: 4294967295 num_repetitions: 2097152 sidecar_idx: 0
I20260925 14:51:17.807256  1208 rpc-test-base.h:240] got call: sleep_micros: 500 pattern: 4294967295 num_repetitions: 2097152 sidecar_idx: 0
W20260925 14:51:17.811266  1201 connection.cc:441] server connection from 127.0.0.1:32996 torn down before Call kudu.rpc.GenericCalculatorService.SleepWithSidecar from 127.0.0.1:32996 (request call id 9) could send its response
[       OK ] Parameters/TestRpc.TestCancellationAsync/SSL_TCP (156 ms)
[ RUN      ] Parameters/TestRpc.TestPerformanceBySocketType/SSL_TCP
I20260925 14:51:17.822528  1230 acceptor_pool.cc:254] collecting diagnostics on the listening RPC socket 0.0.0.0:44683 every 8 connection(s)
I20260925 14:51:17.822506  1229 acceptor_pool.cc:254] collecting diagnostics on the listening RPC socket 0.0.0.0:44683 every 8 connection(s)
I20260925 14:51:17.822719   772 rpc-test.cc:1846] Connecting to 0.0.0.0:44683
I20260925 14:51:19.557228   772 rpc-test.cc:1859] Sending 1024MB via ssl-enabled tcp socket: real 1.726s	user 1.574s	sys 1.473s
I20260925 14:51:21.288615   772 rpc-test.cc:1859] Sending 1024MB via ssl-enabled tcp socket: real 1.731s	user 1.637s	sys 1.403s
I20260925 14:51:23.044962   772 rpc-test.cc:1859] Sending 1024MB via ssl-enabled tcp socket: real 1.756s	user 1.676s	sys 1.436s
I20260925 14:51:24.743359   772 rpc-test.cc:1859] Sending 1024MB via ssl-enabled tcp socket: real 1.698s	user 1.565s	sys 1.429s
I20260925 14:51:26.447759   772 rpc-test.cc:1859] Sending 1024MB via ssl-enabled tcp socket: real 1.704s	user 1.588s	sys 1.419s
[       OK ] Parameters/TestRpc.TestPerformanceBySocketType/SSL_TCP (8637 ms)
[----------] 20 tests from Parameters/TestRpc (28214 ms total)

[----------] 1 test from Parameters/TestRpcSocketTxRxQueue
[ RUN      ] Parameters/TestRpcSocketTxRxQueue.OverCapacity/0
W20260925 14:51:26.719609  1273 negotiation.cc:337] Failed RPC negotiation. Trace:
0925 14:51:26.458192 (+     0us) reactor.cc:625] Submitting negotiation task for client connection to 0.0.0.0:33717 (local address 127.0.0.1:48792)
0925 14:51:26.458226 (+    34us) negotiation.cc:107] Waiting for socket to connect
0925 14:51:26.458234 (+     8us) client_negotiation.cc:174] Beginning negotiation
0925 14:51:26.458269 (+    35us) client_negotiation.cc:252] Sending NEGOTIATE NegotiatePB request
0925 14:51:26.719557 (+261288us) negotiation.cc:327] Negotiation complete: Network error: Client connection negotiation failed: client connection to 0.0.0.0:33717: BlockingRecv error: recv error from unknown peer: Transport endpoint is not connected (error 107)
Metrics: {"client-negotiator.queue_time_us":17}
W20260925 14:51:26.719609  1291 negotiation.cc:337] Failed RPC negotiation. Trace:
0925 14:51:26.459828 (+     0us) reactor.cc:625] Submitting negotiation task for client connection to 0.0.0.0:33717 (local address 127.0.0.1:48796)
0925 14:51:26.459882 (+    54us) negotiation.cc:107] Waiting for socket to connect
0925 14:51:26.459891 (+     9us) client_negotiation.cc:174] Beginning negotiation
0925 14:51:26.459931 (+    40us) client_negotiation.cc:252] Sending NEGOTIATE NegotiatePB request
0925 14:51:26.719474 (+259543us) negotiation.cc:327] Negotiation complete: Network error: Client connection negotiation failed: client connection to 0.0.0.0:33717: BlockingRecv error: recv error from unknown peer: Transport endpoint is not connected (error 107)
Metrics: {"client-negotiator.queue_time_us":34}
W20260925 14:51:26.719592  1282 negotiation.cc:337] Failed RPC negotiation. Trace:
0925 14:51:26.459050 (+     0us) reactor.cc:625] Submitting negotiation task for client connection to 0.0.0.0:33717 (local address 127.0.0.1:48794)
0925 14:51:26.459103 (+    53us) negotiation.cc:107] Waiting for socket to connect
0925 14:51:26.459110 (+     7us) client_negotiation.cc:174] Beginning negotiation
0925 14:51:26.459146 (+    36us) client_negotiation.cc:252] Sending NEGOTIATE NegotiatePB request
0925 14:51:26.719501 (+260355us) negotiation.cc:327] Negotiation complete: Network error: Client connection negotiation failed: client connection to 0.0.0.0:33717: BlockingRecv error: recv error from unknown peer: Transport endpoint is not connected (error 107)
Metrics: {"client-negotiator.queue_time_us":36}
W20260925 14:51:26.719592  1246 negotiation.cc:337] Failed RPC negotiation. Trace:
0925 14:51:26.455189 (+     0us) reactor.cc:625] Submitting negotiation task for client connection to 0.0.0.0:33717 (local address 127.0.0.1:48752)
0925 14:51:26.455256 (+    67us) negotiation.cc:107] Waiting for socket to connect
0925 14:51:26.455267 (+    11us) client_negotiation.cc:174] Beginning negotiation
0925 14:51:26.455328 (+    61us) client_negotiation.cc:252] Sending NEGOTIATE NegotiatePB request
0925 14:51:26.719446 (+264118us) negotiation.cc:327] Negotiation complete: Network error: Client connection negotiation failed: client connection to 0.0.0.0:33717: BlockingRecv error: recv error from unknown peer: Transport endpoint is not connected (error 107)
Metrics: {"client-negotiator.queue_time_us":42}
W20260925 14:51:26.719952  1255 negotiation.cc:337] Failed RPC negotiation. Trace:
0925 14:51:26.456316 (+     0us) reactor.cc:625] Submitting negotiation task for client connection to 0.0.0.0:33717 (local address 127.0.0.1:48764)
0925 14:51:26.456360 (+    44us) negotiation.cc:107] Waiting for socket to connect
0925 14:51:26.456368 (+     8us) client_negotiation.cc:174] Beginning negotiation
0925 14:51:26.456412 (+    44us) client_negotiation.cc:252] Sending NEGOTIATE NegotiatePB request
0925 14:51:26.719447 (+263035us) negotiation.cc:327] Negotiation complete: Network error: Client connection negotiation failed: client connection to 0.0.0.0:33717: BlockingRecv error: recv error from unknown peer: Transport endpoint is not connected (error 107)
Metrics: {"client-negotiator.queue_time_us":17}
W20260925 14:51:26.719957  1264 negotiation.cc:337] Failed RPC negotiation. Trace:
0925 14:51:26.457167 (+     0us) reactor.cc:625] Submitting negotiation task for client connection to 0.0.0.0:33717 (local address 127.0.0.1:48778)
0925 14:51:26.457201 (+    34us) negotiation.cc:107] Waiting for socket to connect
0925 14:51:26.457209 (+     8us) client_negotiation.cc:174] Beginning negotiation
0925 14:51:26.457244 (+    35us) client_negotiation.cc:252] Sending NEGOTIATE NegotiatePB request
0925 14:51:26.719475 (+262231us) negotiation.cc:327] Negotiation complete: Network error: Client connection negotiation failed: client connection to 0.0.0.0:33717: BlockingRecv error: recv error from unknown peer: Transport endpoint is not connected (error 107)
Metrics: {"client-negotiator.queue_time_us":17}
[       OK ] Parameters/TestRpcSocketTxRxQueue.OverCapacity/0 (1032 ms)
[----------] 1 test from Parameters/TestRpcSocketTxRxQueue (1032 ms total)

[----------] Global test environment tear-down
[==========] 21 tests from 2 test suites ran. (29246 ms total)
[  PASSED  ] 20 tests.
[  FAILED  ] 1 test, listed below:
[  FAILED  ] Parameters/TestRpc.TestCallWithChainCertAndChainCA/SSL_TCP, where GetParam() = (true, false)

 1 FAILED TEST