Diagnosed failure

Parameters/TestRpc.TestCallWithChainCertAndChainCA/SSL_TCP: /data0/somelongdirectorytoavoidrpathissues/src/kudu/src/kudu/rpc/rpc-test.cc:270: Failure
Failed
Bad status: Runtime error: could not verify certificate chain (error with cert: subject=CN = localhost, ST = sadfjas, C = AS, emailAddress = sdflkdsajf, O = lskdfjlsad, OU = sldfkja, issuer=C = AS, ST = ASDfkjdhf, L = lskdjf, O = saldfja, OU = skdjf, CN = localhost, emailAddress = sadjflkadsj): : certificate has expired
Google Test trace:
/data0/somelongdirectorytoavoidrpathissues/src/kudu/src/kudu/rpc/rpc-test.cc:267: Connecting to 0.0.0.0:42475
I20260924 23:06:01.617821  1267 test_util.cc:175] -----------------------------------------------
I20260924 23:06:01.617906  1267 test_util.cc:176] Had fatal failures, leaving test files at /tmp/dist-test-tasklsSADm/test-tmp/rpc-test.5.Parameters_TestRpc.TestCallWithChainCertAndChainCA_SSL_TCP.1790291161531215-1267-0

Full log

Note: This is test shard 6 of 8.
[==========] Running 21 tests from 2 test suites.
[----------] Global test environment set-up.
[----------] 20 tests from Parameters/TestRpc
[ RUN      ] Parameters/TestRpc.TestMessengerCreateDestroy/SSL_TCP
WARNING: Logging before InitGoogleLogging() is written to STDERR
I20260924 23:06:01.574268  1267 rpc-test.cc:169] started messenger TestCreateDestroy
[       OK ] Parameters/TestRpc.TestMessengerCreateDestroy/SSL_TCP (41 ms)
[ RUN      ] Parameters/TestRpc.TestNegotiationDeadlock/SSL_TCP
I20260924 23:06:01.582471  1287 acceptor_pool.cc:254] collecting diagnostics on the listening RPC socket 0.0.0.0:39759 every 8 connection(s)
I20260924 23:06:01.582475  1288 acceptor_pool.cc:254] collecting diagnostics on the listening RPC socket 0.0.0.0:39759 every 8 connection(s)
[       OK ] Parameters/TestRpc.TestNegotiationDeadlock/SSL_TCP (14 ms)
[ RUN      ] Parameters/TestRpc.TestCallWithChainCertAndChainCA/SSL_TCP
I20260924 23:06:01.613489  1303 acceptor_pool.cc:254] collecting diagnostics on the listening RPC socket 0.0.0.0:42475 every 8 connection(s)
I20260924 23:06:01.613514  1304 acceptor_pool.cc:254] collecting diagnostics on the listening RPC socket 0.0.0.0:42475 every 8 connection(s)
/data0/somelongdirectorytoavoidrpathissues/src/kudu/src/kudu/rpc/rpc-test.cc:270: Failure
Failed
Bad status: Runtime error: could not verify certificate chain (error with cert: subject=CN = localhost, ST = sadfjas, C = AS, emailAddress = sdflkdsajf, O = lskdfjlsad, OU = sldfkja, issuer=C = AS, ST = ASDfkjdhf, L = lskdjf, O = saldfja, OU = skdjf, CN = localhost, emailAddress = sadjflkadsj): : certificate has expired
Google Test trace:
/data0/somelongdirectorytoavoidrpathissues/src/kudu/src/kudu/rpc/rpc-test.cc:267: Connecting to 0.0.0.0:42475
I20260924 23:06:01.617821  1267 test_util.cc:175] -----------------------------------------------
I20260924 23:06:01.617906  1267 test_util.cc:176] Had fatal failures, leaving test files at /tmp/dist-test-tasklsSADm/test-tmp/rpc-test.5.Parameters_TestRpc.TestCallWithChainCertAndChainCA_SSL_TCP.1790291161531215-1267-0
[  FAILED  ] Parameters/TestRpc.TestCallWithChainCertAndChainCA/SSL_TCP, where GetParam() = (true, false) (28 ms)
[ RUN      ] Parameters/TestRpc.TestCallWithPasswordProtectedKey/SSL_TCP
I20260924 23:06:01.632006  1328 acceptor_pool.cc:254] collecting diagnostics on the listening RPC socket 0.0.0.0:41877 every 8 connection(s)
I20260924 23:06:01.632146  1329 acceptor_pool.cc:254] collecting diagnostics on the listening RPC socket 0.0.0.0:41877 every 8 connection(s)
[       OK ] Parameters/TestRpc.TestCallWithPasswordProtectedKey/SSL_TCP (27 ms)
[ RUN      ] Parameters/TestRpc.TestCallToBadServer/SSL_TCP
I20260924 23:06:01.685077  1267 rpc-test.cc:394] Status: Network error: Client connection negotiation failed: client connection to 0.0.0.0:0: connect: Connection refused (error 111)
I20260924 23:06:01.685442  1267 rpc-test.cc:394] Status: Network error: Client connection negotiation failed: client connection to 0.0.0.0:0: connect: Connection refused (error 111)
I20260924 23:06:01.685701  1267 rpc-test.cc:394] Status: Network error: Client connection negotiation failed: client connection to 0.0.0.0:0: connect: Connection refused (error 111)
I20260924 23:06:01.685911  1267 rpc-test.cc:394] Status: Network error: Client connection negotiation failed: client connection to 0.0.0.0:0: connect: Connection refused (error 111)
I20260924 23:06:01.686112  1267 rpc-test.cc:394] Status: Network error: Client connection negotiation failed: client connection to 0.0.0.0:0: connect: Connection refused (error 111)
[       OK ] Parameters/TestRpc.TestCallToBadServer/SSL_TCP (40 ms)
[ RUN      ] Parameters/TestRpc.TestWrongService/SSL_TCP
I20260924 23:06:01.702733  1363 acceptor_pool.cc:254] collecting diagnostics on the listening RPC socket 0.0.0.0:42091 every 8 connection(s)
I20260924 23:06:01.702769  1364 acceptor_pool.cc:254] collecting diagnostics on the listening RPC socket 0.0.0.0:42091 every 8 connection(s)
I20260924 23:06:01.722486  1360 messenger.cc:345] service WrongServiceName not registered on TestServer
[       OK ] Parameters/TestRpc.TestWrongService/SSL_TCP (37 ms)
[ RUN      ] Parameters/TestRpc.TestConnectionKeepalive/SSL_TCP
I20260924 23:06:01.729741  1386 acceptor_pool.cc:254] collecting diagnostics on the listening RPC socket 0.0.0.0:41623 every 8 connection(s)
I20260924 23:06:01.729790  1387 acceptor_pool.cc:254] collecting diagnostics on the listening RPC socket 0.0.0.0:41623 every 8 connection(s)
I20260924 23:06:01.729957  1267 rpc-test.cc:488] Connecting to 0.0.0.0:41623
[       OK ] Parameters/TestRpc.TestConnectionKeepalive/SSL_TCP (1040 ms)
[ RUN      ] Parameters/TestRpc.TestClientConnectionMetrics/SSL_TCP
I20260924 23:06:02.784544  1412 acceptor_pool.cc:254] collecting diagnostics on the listening RPC socket 0.0.0.0:40639 every 8 connection(s)
I20260924 23:06:02.784709  1267 rpc-test.cc:569] Connecting to 0.0.0.0:40639
I20260924 23:06:02.784518  1411 acceptor_pool.cc:254] collecting diagnostics on the listening RPC socket 0.0.0.0:40639 every 8 connection(s)
[       OK ] Parameters/TestRpc.TestClientConnectionMetrics/SSL_TCP (11038 ms)
[ RUN      ] Parameters/TestRpc.TestCredentialsPolicy/SSL_TCP
I20260924 23:06:13.826666  1434 acceptor_pool.cc:254] collecting diagnostics on the listening RPC socket 0.0.0.0:36281 every 8 connection(s)
I20260924 23:06:13.826714  1435 acceptor_pool.cc:254] collecting diagnostics on the listening RPC socket 0.0.0.0:36281 every 8 connection(s)
I20260924 23:06:13.826880  1267 rpc-test.cc:700] Connecting to 0.0.0.0:36281
[       OK ] Parameters/TestRpc.TestCredentialsPolicy/SSL_TCP (48 ms)
[ RUN      ] Parameters/TestRpc.TestCallLongerThanKeepalive/SSL_TCP
I20260924 23:06:13.871815  1459 acceptor_pool.cc:254] collecting diagnostics on the listening RPC socket 0.0.0.0:33535 every 8 connection(s)
I20260924 23:06:13.871852  1460 acceptor_pool.cc:254] collecting diagnostics on the listening RPC socket 0.0.0.0:33535 every 8 connection(s)
I20260924 23:06:13.886530  1463 rpc-test-base.h:222] got call: sleep_micros: 3000000 deferred: true
I20260924 23:06:16.887205  1463 rpcz_store.cc:275] Call kudu.rpc.GenericCalculatorService.Sleep from 127.0.0.1:34150 (request call id 0) took 3000 ms. Trace:
I20260924 23:06:16.887311  1463 rpcz_store.cc:276] 0924 23:06:13.886466 (+     0us) service_pool.cc:170] Inserting onto call queue
0924 23:06:13.886505 (+    39us) service_pool.cc:227] Handling call
0924 23:06:16.887188 (+3000683us) inbound_call.cc:173] Queueing success response
Metrics: {}
[       OK ] Parameters/TestRpc.TestCallLongerThanKeepalive/SSL_TCP (3039 ms)
[ RUN      ] Parameters/TestRpc.TestRpcSidecar/SSL_TCP
I20260924 23:06:16.897753  1484 acceptor_pool.cc:254] collecting diagnostics on the listening RPC socket 0.0.0.0:34753 every 8 connection(s)
I20260924 23:06:16.897864  1485 acceptor_pool.cc:254] collecting diagnostics on the listening RPC socket 0.0.0.0:34753 every 8 connection(s)
[       OK ] Parameters/TestRpc.TestRpcSidecar/SSL_TCP (54 ms)
[ RUN      ] Parameters/TestRpc.TestRpcSidecarLimits/SSL_TCP
I20260924 23:06:18.658224  1509 acceptor_pool.cc:254] collecting diagnostics on the listening RPC socket 0.0.0.0:39063 every 8 connection(s)
I20260924 23:06:18.658281  1510 acceptor_pool.cc:254] collecting diagnostics on the listening RPC socket 0.0.0.0:39063 every 8 connection(s)
W20260924 23:06:18.669893  1267 serialization.cc:72] Serialized kudu.rpc_test.PushStringsRequestPB (2147483654 bytes) is larger than the maximum configured RPC message size (52428800 bytes). Sending anyway, but peer may reject the data.
W20260924 23:06:18.673545  1506 connection.cc:535] server connection from 127.0.0.1:59778 recv error: Network error: RPC frame had a length of 2147483714, but we only support messages up to 52428800 bytes long.
W20260924 23:06:18.673606  1506 connection.cc:158] shutting down server connection from 127.0.0.1:59778 with pending inbound data: 4/2147483714 bytes received; last active 0 ns ago: status Network error: RPC frame had a length of 2147483714, but we only support messages up to 52428800 bytes long.
W20260924 23:06:18.673846  1522 connection.cc:196] Error closing socket: Network error: TlsSocket::Close: Connection reset by peer
I20260924 23:06:18.681344  1534 acceptor_pool.cc:254] collecting diagnostics on the listening RPC socket 0.0.0.0:46709 every 8 connection(s)
I20260924 23:06:18.681370  1535 acceptor_pool.cc:254] collecting diagnostics on the listening RPC socket 0.0.0.0:46709 every 8 connection(s)
W20260924 23:06:22.529731  1533 connection.cc:577] server connection from 127.0.0.1:40002: received bad data: 'Corruption: Invalid packet: message had a length of 2147483710, but we only support messages up to 2147483647 bytes
'
[       OK ] Parameters/TestRpc.TestRpcSidecarLimits/SSL_TCP (5586 ms)
[ RUN      ] Parameters/TestRpc.TestCallTimeoutDoesntAffectNegotiation/SSL_TCP
I20260924 23:06:22.544807  1559 acceptor_pool.cc:254] collecting diagnostics on the listening RPC socket 0.0.0.0:37909 every 8 connection(s)
I20260924 23:06:22.544916  1560 acceptor_pool.cc:254] collecting diagnostics on the listening RPC socket 0.0.0.0:37909 every 8 connection(s)
W20260924 23:06:22.553884  1555 negotiation.cc:266] Injecting 500ms delay in negotiation
I20260924 23:06:22.604120  1267 rpc-test-base.h:595] status: Timed out: connection negotiation to 0.0.0.0:37909 for RPC Sleep timed out after 0.050s (ON_OUTBOUND_QUEUE), seconds elapsed: 0.0505805
[       OK ] Parameters/TestRpc.TestCallTimeoutDoesntAffectNegotiation/SSL_TCP (526 ms)
[ RUN      ] Parameters/TestRpc.TestRpcHandlerLatencyMetric/SSL_TCP
I20260924 23:06:23.072572  1584 acceptor_pool.cc:254] collecting diagnostics on the listening RPC socket 0.0.0.0:45389 every 8 connection(s)
I20260924 23:06:23.072675  1585 acceptor_pool.cc:254] collecting diagnostics on the listening RPC socket 0.0.0.0:45389 every 8 connection(s)
I20260924 23:06:23.114565  1267 rpc-test.cc:1236] Sleep() min lat: 20338
I20260924 23:06:23.114641  1267 rpc-test.cc:1237] Sleep() mean lat: 20338
I20260924 23:06:23.114668  1267 rpc-test.cc:1238] Sleep() max lat: 20338
I20260924 23:06:23.114681  1267 rpc-test.cc:1239] Sleep() #calls: 1
[       OK ] Parameters/TestRpc.TestRpcHandlerLatencyMetric/SSL_TCP (57 ms)
[ RUN      ] Parameters/TestRpc.TimedOutOnResponseMetricServiceQueue/SSL_TCP
I20260924 23:06:23.147549  1610 acceptor_pool.cc:254] collecting diagnostics on the listening RPC socket 0.0.0.0:45137 every 8 connection(s)
I20260924 23:06:23.147624  1611 acceptor_pool.cc:254] collecting diagnostics on the listening RPC socket 0.0.0.0:45137 every 8 connection(s)
W20260924 23:06:23.203866  1612 rpcz_store.cc:267] Call kudu.rpc_test.CalculatorService.Sleep from 127.0.0.1:35792 (request call id 2) took 20 ms (client timeout 20 ms). Trace:
W20260924 23:06:23.203974  1612 rpcz_store.cc:269] 0924 23:06:23.183544 (+     0us) service_pool.cc:170] Inserting onto call queue
0924 23:06:23.203825 (+ 20281us) service_pool.cc:214] Skipping call since client already timed out
0924 23:06:23.203834 (+     9us) inbound_call.cc:173] Queueing failure response
Metrics: {}
[       OK ] Parameters/TestRpc.TimedOutOnResponseMetricServiceQueue/SSL_TCP (89 ms)
[ RUN      ] Parameters/TestRpc.RpcPendingConnectionsMetric/SSL_TCP
I20260924 23:06:23.207579  1633 acceptor_pool.cc:254] collecting diagnostics on the listening RPC socket 0.0.0.0:43025 every 8 connection(s)
I20260924 23:06:23.207648  1634 acceptor_pool.cc:254] collecting diagnostics on the listening RPC socket 0.0.0.0:43025 every 8 connection(s)
W20260924 23:06:23.208289  1629 negotiation.cc:337] Failed RPC negotiation. Trace:
0924 23:06:23.208090 (+     0us) reactor.cc:625] Submitting negotiation task for server connection from 127.0.0.1:43862 (local address 127.0.0.1:43025)
0924 23:06:23.208155 (+    65us) server_negotiation.cc:206] Beginning negotiation
0924 23:06:23.208157 (+     2us) server_negotiation.cc:399] Waiting for connection header
0924 23:06:23.208235 (+    78us) negotiation.cc:327] Negotiation complete: Network error: Server connection negotiation failed: server connection from 127.0.0.1:43862: BlockingRecv error: recv got EOF from 127.0.0.1:43862 (error 108)
Metrics: {"server-negotiator.queue_time_us":35}
[       OK ] Parameters/TestRpc.RpcPendingConnectionsMetric/SSL_TCP (13 ms)
[ RUN      ] Parameters/TestRpc.TestRpcContextClientDeadline/SSL_TCP
I20260924 23:06:23.229288  1649 acceptor_pool.cc:254] collecting diagnostics on the listening RPC socket 0.0.0.0:46279 every 8 connection(s)
I20260924 23:06:23.229316  1650 acceptor_pool.cc:254] collecting diagnostics on the listening RPC socket 0.0.0.0:46279 every 8 connection(s)
[       OK ] Parameters/TestRpc.TestRpcContextClientDeadline/SSL_TCP (43 ms)
[ RUN      ] Parameters/TestRpc.TestApplicationFeatureFlagUnsupportedServer/SSL_TCP
I20260924 23:06:23.272996  1674 acceptor_pool.cc:254] collecting diagnostics on the listening RPC socket 0.0.0.0:45003 every 8 connection(s)
I20260924 23:06:23.273069  1675 acceptor_pool.cc:254] collecting diagnostics on the listening RPC socket 0.0.0.0:45003 every 8 connection(s)
[       OK ] Parameters/TestRpc.TestApplicationFeatureFlagUnsupportedServer/SSL_TCP (28 ms)
[ RUN      ] Parameters/TestRpc.TestCancellationAsync/SSL_TCP
I20260924 23:06:23.299444  1699 acceptor_pool.cc:254] collecting diagnostics on the listening RPC socket 0.0.0.0:38207 every 8 connection(s)
I20260924 23:06:23.299491  1700 acceptor_pool.cc:254] collecting diagnostics on the listening RPC socket 0.0.0.0:38207 every 8 connection(s)
I20260924 23:06:23.299677  1267 rpc-test.cc:1716] Connecting to 0.0.0.0:38207
I20260924 23:06:23.324991  1267 test_util.cc:268] Using random seed: -1509503172
I20260924 23:06:23.341313  1703 rpc-test-base.h:240] got call: sleep_micros: 500 pattern: 4294967295 num_repetitions: 2097152 sidecar_idx: 0
I20260924 23:06:23.353943  1703 rpc-test-base.h:240] got call: sleep_micros: 500 pattern: 4294967295 num_repetitions: 2097152 sidecar_idx: 0
I20260924 23:06:23.366582  1703 rpc-test-base.h:240] got call: sleep_micros: 500 pattern: 4294967295 num_repetitions: 2097152 sidecar_idx: 0
I20260924 23:06:23.380874  1703 rpc-test-base.h:240] got call: sleep_micros: 500 pattern: 4294967295 num_repetitions: 2097152 sidecar_idx: 0
I20260924 23:06:23.395357  1703 rpc-test-base.h:240] got call: sleep_micros: 500 pattern: 4294967295 num_repetitions: 2097152 sidecar_idx: 0
I20260924 23:06:23.410151  1703 rpc-test-base.h:240] got call: sleep_micros: 500 pattern: 4294967295 num_repetitions: 2097152 sidecar_idx: 0
I20260924 23:06:23.424556  1703 rpc-test-base.h:240] got call: sleep_micros: 500 pattern: 4294967295 num_repetitions: 2097152 sidecar_idx: 0
I20260924 23:06:23.438735  1703 rpc-test-base.h:240] got call: sleep_micros: 500 pattern: 4294967295 num_repetitions: 2097152 sidecar_idx: 0
W20260924 23:06:23.442183  1696 connection.cc:441] server connection from 127.0.0.1:47886 torn down before Call kudu.rpc.GenericCalculatorService.SleepWithSidecar from 127.0.0.1:47886 (request call id 9) could send its response
[       OK ] Parameters/TestRpc.TestCancellationAsync/SSL_TCP (151 ms)
[ RUN      ] Parameters/TestRpc.TestPerformanceBySocketType/SSL_TCP
I20260924 23:06:23.467054  1725 acceptor_pool.cc:254] collecting diagnostics on the listening RPC socket 0.0.0.0:42659 every 8 connection(s)
I20260924 23:06:23.467056  1724 acceptor_pool.cc:254] collecting diagnostics on the listening RPC socket 0.0.0.0:42659 every 8 connection(s)
I20260924 23:06:23.467211  1267 rpc-test.cc:1846] Connecting to 0.0.0.0:42659
I20260924 23:06:25.313633  1267 rpc-test.cc:1859] Sending 1024MB via ssl-enabled tcp socket: real 1.835s	user 1.660s	sys 1.575s
I20260924 23:06:27.099159  1267 rpc-test.cc:1859] Sending 1024MB via ssl-enabled tcp socket: real 1.785s	user 1.693s	sys 1.481s
I20260924 23:06:28.841012  1267 rpc-test.cc:1859] Sending 1024MB via ssl-enabled tcp socket: real 1.742s	user 1.532s	sys 1.538s
I20260924 23:06:30.596710  1267 rpc-test.cc:1859] Sending 1024MB via ssl-enabled tcp socket: real 1.756s	user 1.539s	sys 1.541s
I20260924 23:06:32.320119  1267 rpc-test.cc:1859] Sending 1024MB via ssl-enabled tcp socket: real 1.723s	user 1.479s	sys 1.555s
[       OK ] Parameters/TestRpc.TestPerformanceBySocketType/SSL_TCP (8878 ms)
[----------] 20 tests from Parameters/TestRpc (30788 ms total)

[----------] 1 test from Parameters/TestRpcSocketTxRxQueue
[ RUN      ] Parameters/TestRpcSocketTxRxQueue.OverCapacity/0
W20260924 23:06:32.586491  1768 negotiation.cc:337] Failed RPC negotiation. Trace:
0924 23:06:32.326350 (+     0us) reactor.cc:625] Submitting negotiation task for client connection to 0.0.0.0:40117 (local address 127.0.0.1:56160)
0924 23:06:32.326400 (+    50us) negotiation.cc:107] Waiting for socket to connect
0924 23:06:32.326407 (+     7us) client_negotiation.cc:174] Beginning negotiation
0924 23:06:32.326442 (+    35us) client_negotiation.cc:252] Sending NEGOTIATE NegotiatePB request
0924 23:06:32.586392 (+259950us) negotiation.cc:327] Negotiation complete: Network error: Client connection negotiation failed: client connection to 0.0.0.0:40117: BlockingRecv error: recv error from unknown peer: Transport endpoint is not connected (error 107)
Metrics: {"client-negotiator.queue_time_us":32}
W20260924 23:06:32.586652  1759 negotiation.cc:337] Failed RPC negotiation. Trace:
0924 23:06:32.325494 (+     0us) reactor.cc:625] Submitting negotiation task for client connection to 0.0.0.0:40117 (local address 127.0.0.1:56146)
0924 23:06:32.325530 (+    36us) negotiation.cc:107] Waiting for socket to connect
0924 23:06:32.325537 (+     7us) client_negotiation.cc:174] Beginning negotiation
0924 23:06:32.325574 (+    37us) client_negotiation.cc:252] Sending NEGOTIATE NegotiatePB request
0924 23:06:32.586469 (+260895us) negotiation.cc:327] Negotiation complete: Network error: Client connection negotiation failed: client connection to 0.0.0.0:40117: BlockingRecv error: recv error from unknown peer: Transport endpoint is not connected (error 107)
Metrics: {"client-negotiator.queue_time_us":18}
W20260924 23:06:32.586655  1750 negotiation.cc:337] Failed RPC negotiation. Trace:
0924 23:06:32.324596 (+     0us) reactor.cc:625] Submitting negotiation task for client connection to 0.0.0.0:40117 (local address 127.0.0.1:56132)
0924 23:06:32.324641 (+    45us) negotiation.cc:107] Waiting for socket to connect
0924 23:06:32.324650 (+     9us) client_negotiation.cc:174] Beginning negotiation
0924 23:06:32.324692 (+    42us) client_negotiation.cc:252] Sending NEGOTIATE NegotiatePB request
0924 23:06:32.586469 (+261777us) negotiation.cc:327] Negotiation complete: Network error: Client connection negotiation failed: client connection to 0.0.0.0:40117: BlockingRecv error: recv error from unknown peer: Transport endpoint is not connected (error 107)
Metrics: {"client-negotiator.queue_time_us":18}
W20260924 23:06:32.586491  1741 negotiation.cc:337] Failed RPC negotiation. Trace:
0924 23:06:32.323531 (+     0us) reactor.cc:625] Submitting negotiation task for client connection to 0.0.0.0:40117 (local address 127.0.0.1:56122)
0924 23:06:32.323619 (+    88us) negotiation.cc:107] Waiting for socket to connect
0924 23:06:32.323660 (+    41us) client_negotiation.cc:174] Beginning negotiation
0924 23:06:32.323726 (+    66us) client_negotiation.cc:252] Sending NEGOTIATE NegotiatePB request
0924 23:06:32.586358 (+262632us) negotiation.cc:327] Negotiation complete: Network error: Client connection negotiation failed: client connection to 0.0.0.0:40117: BlockingRecv error: recv error from unknown peer: Transport endpoint is not connected (error 107)
Metrics: {"client-negotiator.queue_time_us":55}
W20260924 23:06:32.586936  1777 negotiation.cc:337] Failed RPC negotiation. Trace:
0924 23:06:32.327203 (+     0us) reactor.cc:625] Submitting negotiation task for client connection to 0.0.0.0:40117 (local address 127.0.0.1:56176)
0924 23:06:32.327236 (+    33us) negotiation.cc:107] Waiting for socket to connect
0924 23:06:32.327248 (+    12us) client_negotiation.cc:174] Beginning negotiation
0924 23:06:32.327282 (+    34us) client_negotiation.cc:252] Sending NEGOTIATE NegotiatePB request
0924 23:06:32.586764 (+259482us) negotiation.cc:327] Negotiation complete: Network error: Client connection negotiation failed: client connection to 0.0.0.0:40117: BlockingRecv error: recv error from unknown peer: Transport endpoint is not connected (error 107)
Metrics: {"client-negotiator.queue_time_us":16}
W20260924 23:06:32.587105  1786 negotiation.cc:337] Failed RPC negotiation. Trace:
0924 23:06:32.328138 (+     0us) reactor.cc:625] Submitting negotiation task for client connection to 0.0.0.0:40117 (local address 127.0.0.1:56180)
0924 23:06:32.328192 (+    54us) negotiation.cc:107] Waiting for socket to connect
0924 23:06:32.328217 (+    25us) client_negotiation.cc:174] Beginning negotiation
0924 23:06:32.328265 (+    48us) client_negotiation.cc:252] Sending NEGOTIATE NegotiatePB request
0924 23:06:32.586920 (+258655us) negotiation.cc:327] Negotiation complete: Network error: Client connection negotiation failed: client connection to 0.0.0.0:40117: BlockingRecv error: recv error from unknown peer: Transport endpoint is not connected (error 107)
Metrics: {"client-negotiator.queue_time_us":33}
[       OK ] Parameters/TestRpcSocketTxRxQueue.OverCapacity/0 (1022 ms)
[----------] 1 test from Parameters/TestRpcSocketTxRxQueue (1022 ms total)

[----------] Global test environment tear-down
[==========] 21 tests from 2 test suites ran. (31810 ms total)
[  PASSED  ] 20 tests.
[  FAILED  ] 1 test, listed below:
[  FAILED  ] Parameters/TestRpc.TestCallWithChainCertAndChainCA/SSL_TCP, where GetParam() = (true, false)

 1 FAILED TEST