Parameters/TestRpc.TestCallWithChainCertAndRootCA/SSL_TCP: /data0/somelongdirectorytoavoidrpathissues/src/kudu/src/kudu/rpc/rpc-test.cc:303: Failure
Failed
Bad status: Runtime error: could not verify certificate chain (error with cert: subject=CN = localhost, ST = sadfjas, C = AS, emailAddress = sdflkdsajf, O = lskdfjlsad, OU = sldfkja, issuer=C = AS, ST = ASDfkjdhf, L = lskdjf, O = saldfja, OU = skdjf, CN = localhost, emailAddress = sadjflkadsj): : certificate has expired
Google Test trace:
/data0/somelongdirectorytoavoidrpathissues/src/kudu/src/kudu/rpc/rpc-test.cc:300: Connecting to 0.0.0.0:46615
I20260928 23:51:16.452019 14451 test_util.cc:175] -----------------------------------------------
I20260928 23:51:16.452229 14451 test_util.cc:176] Had fatal failures, leaving test files at /tmp/dist-test-taskeGOv3h/test-tmp/rpc-test.1.Parameters_TestRpc.TestCallWithChainCertAndRootCA_SSL_TCP.1790639475001619-14451-0
Note: This is test shard 2 of 8.
[==========] Running 21 tests from 2 test suites.
[----------] Global test environment set-up.
[----------] 1 test from TestRpc
[ RUN ] TestRpc.TestMethodsByName
[ OK ] TestRpc.TestMethodsByName (7 ms)
[----------] 1 test from TestRpc (7 ms total)
[----------] 20 tests from Parameters/TestRpc
[ RUN ] Parameters/TestRpc.TestAcceptorPoolStartStop/SSL_TCP
WARNING: Logging before InitGoogleLogging() is written to STDERR
I20260928 23:51:15.120123 14466 acceptor_pool.cc:254] collecting diagnostics on the listening RPC socket 0.0.0.0:46155 every 8 connection(s)
I20260928 23:51:15.121774 14467 acceptor_pool.cc:254] collecting diagnostics on the listening RPC socket 0.0.0.0:46155 every 8 connection(s)
I20260928 23:51:16.207734 14478 acceptor_pool.cc:254] collecting diagnostics on the listening RPC socket 0.0.0.0:39777 every 8 connection(s)
I20260928 23:51:16.209115 14479 acceptor_pool.cc:254] collecting diagnostics on the listening RPC socket 0.0.0.0:39777 every 8 connection(s)
I20260928 23:51:16.240355 14489 acceptor_pool.cc:254] collecting diagnostics on the listening RPC socket 0.0.0.0:40429 every 8 connection(s)
I20260928 23:51:16.241607 14490 acceptor_pool.cc:254] collecting diagnostics on the listening RPC socket 0.0.0.0:40429 every 8 connection(s)
I20260928 23:51:16.269199 14500 acceptor_pool.cc:254] collecting diagnostics on the listening RPC socket 0.0.0.0:45115 every 8 connection(s)
I20260928 23:51:16.269865 14501 acceptor_pool.cc:254] collecting diagnostics on the listening RPC socket 0.0.0.0:45115 every 8 connection(s)
I20260928 23:51:16.297725 14511 acceptor_pool.cc:254] collecting diagnostics on the listening RPC socket 0.0.0.0:39897 every 8 connection(s)
I20260928 23:51:16.298511 14512 acceptor_pool.cc:254] collecting diagnostics on the listening RPC socket 0.0.0.0:39897 every 8 connection(s)
[ OK ] Parameters/TestRpc.TestAcceptorPoolStartStop/SSL_TCP (1236 ms)
[ RUN ] Parameters/TestRpc.TestCall/SSL_TCP
I20260928 23:51:16.320041 14524 acceptor_pool.cc:254] collecting diagnostics on the listening RPC socket 0.0.0.0:34657 every 8 connection(s)
I20260928 23:51:16.322325 14525 acceptor_pool.cc:254] collecting diagnostics on the listening RPC socket 0.0.0.0:34657 every 8 connection(s)
I20260928 23:51:16.327723 14451 rpc-test.cc:234] Connecting to 0.0.0.0:34657
[ OK ] Parameters/TestRpc.TestCall/SSL_TCP (107 ms)
[ RUN ] Parameters/TestRpc.TestCallWithChainCertAndRootCA/SSL_TCP
I20260928 23:51:16.429541 14549 acceptor_pool.cc:254] collecting diagnostics on the listening RPC socket 0.0.0.0:46615 every 8 connection(s)
I20260928 23:51:16.430434 14550 acceptor_pool.cc:254] collecting diagnostics on the listening RPC socket 0.0.0.0:46615 every 8 connection(s)
/data0/somelongdirectorytoavoidrpathissues/src/kudu/src/kudu/rpc/rpc-test.cc:303: Failure
Failed
Bad status: Runtime error: could not verify certificate chain (error with cert: subject=CN = localhost, ST = sadfjas, C = AS, emailAddress = sdflkdsajf, O = lskdfjlsad, OU = sldfkja, issuer=C = AS, ST = ASDfkjdhf, L = lskdjf, O = saldfja, OU = skdjf, CN = localhost, emailAddress = sadjflkadsj): : certificate has expired
Google Test trace:
/data0/somelongdirectorytoavoidrpathissues/src/kudu/src/kudu/rpc/rpc-test.cc:300: Connecting to 0.0.0.0:46615
I20260928 23:51:16.452019 14451 test_util.cc:175] -----------------------------------------------
I20260928 23:51:16.452229 14451 test_util.cc:176] Had fatal failures, leaving test files at /tmp/dist-test-taskeGOv3h/test-tmp/rpc-test.1.Parameters_TestRpc.TestCallWithChainCertAndRootCA_SSL_TCP.1790639475001619-14451-0
[ FAILED ] Parameters/TestRpc.TestCallWithChainCertAndRootCA/SSL_TCP, where GetParam() = (true, false) (41 ms)
[ RUN ] Parameters/TestRpc.TestCallWithBadPasswordProtectedKey/SSL_TCP
[ OK ] Parameters/TestRpc.TestCallWithBadPasswordProtectedKey/SSL_TCP (39 ms)
[ RUN ] Parameters/TestRpc.TestInvalidMethodCall/SSL_TCP
I20260928 23:51:16.513792 14586 acceptor_pool.cc:254] collecting diagnostics on the listening RPC socket 0.0.0.0:46023 every 8 connection(s)
I20260928 23:51:16.514601 14587 acceptor_pool.cc:254] collecting diagnostics on the listening RPC socket 0.0.0.0:46023 every 8 connection(s)
I20260928 23:51:16.518033 14451 rpc-test.cc:406] Connecting to 0.0.0.0:46023
[ OK ] Parameters/TestRpc.TestInvalidMethodCall/SSL_TCP (62 ms)
[ RUN ] Parameters/TestRpc.TestHighFDs/SSL_TCP
I20260928 23:51:16.766440 14611 acceptor_pool.cc:254] collecting diagnostics on the listening RPC socket 0.0.0.0:33515 every 8 connection(s)
I20260928 23:51:16.767190 14612 acceptor_pool.cc:254] collecting diagnostics on the listening RPC socket 0.0.0.0:33515 every 8 connection(s)
[ OK ] Parameters/TestRpc.TestHighFDs/SSL_TCP (267 ms)
[ RUN ] Parameters/TestRpc.TestConnectionAlwaysKeepalive/SSL_TCP
I20260928 23:51:16.844540 14634 acceptor_pool.cc:254] collecting diagnostics on the listening RPC socket 0.0.0.0:33501 every 8 connection(s)
I20260928 23:51:16.845294 14635 acceptor_pool.cc:254] collecting diagnostics on the listening RPC socket 0.0.0.0:33501 every 8 connection(s)
I20260928 23:51:16.848801 14451 rpc-test.cc:532] Connecting to 0.0.0.0:33501
[ OK ] Parameters/TestRpc.TestConnectionAlwaysKeepalive/SSL_TCP (3072 ms)
[ RUN ] Parameters/TestRpc.TestReopenOutboundConnections/SSL_TCP
I20260928 23:51:19.928936 14657 acceptor_pool.cc:254] collecting diagnostics on the listening RPC socket 0.0.0.0:36613 every 8 connection(s)
I20260928 23:51:19.929695 14658 acceptor_pool.cc:254] collecting diagnostics on the listening RPC socket 0.0.0.0:36613 every 8 connection(s)
I20260928 23:51:19.933130 14451 rpc-test.cc:658] Connecting to 0.0.0.0:36613
[ OK ] Parameters/TestRpc.TestReopenOutboundConnections/SSL_TCP (416 ms)
[ RUN ] Parameters/TestRpc.TestConnectionNetworkPlane/SSL_TCP
I20260928 23:51:20.337911 14680 acceptor_pool.cc:254] collecting diagnostics on the listening RPC socket 0.0.0.0:38641 every 8 connection(s)
I20260928 23:51:20.338613 14681 acceptor_pool.cc:254] collecting diagnostics on the listening RPC socket 0.0.0.0:38641 every 8 connection(s)
I20260928 23:51:20.341765 14451 rpc-test.cc:772] Connecting to 0.0.0.0:38641
[ OK ] Parameters/TestRpc.TestConnectionNetworkPlane/SSL_TCP (95 ms)
[ RUN ] Parameters/TestRpc.TestTCPKeepalive/SSL_TCP
I20260928 23:51:20.432178 14705 acceptor_pool.cc:254] collecting diagnostics on the listening RPC socket 0.0.0.0:35647 every 8 connection(s)
I20260928 23:51:20.432893 14706 acceptor_pool.cc:254] collecting diagnostics on the listening RPC socket 0.0.0.0:35647 every 8 connection(s)
I20260928 23:51:20.467960 14709 rpc-test-base.h:222] got call: sleep_micros: 8000000 deferred: true
I20260928 23:51:28.472414 14709 rpcz_store.cc:275] Call kudu.rpc.GenericCalculatorService.Sleep from 127.0.0.1:53662 (request call id 0) took 8004 ms. Trace:
I20260928 23:51:28.472831 14709 rpcz_store.cc:276] 0928 23:51:20.467649 (+ 0us) service_pool.cc:170] Inserting onto call queue
0928 23:51:20.467770 (+ 121us) service_pool.cc:227] Handling call
0928 23:51:28.472212 (+8004442us) inbound_call.cc:173] Queueing success response
Metrics: {}
[ OK ] Parameters/TestRpc.TestTCPKeepalive/SSL_TCP (8081 ms)
[ RUN ] Parameters/TestRpc.TestMaxSmallSidecars/SSL_TCP
I20260928 23:51:28.517952 14731 acceptor_pool.cc:254] collecting diagnostics on the listening RPC socket 0.0.0.0:37055 every 8 connection(s)
I20260928 23:51:28.518683 14732 acceptor_pool.cc:254] collecting diagnostics on the listening RPC socket 0.0.0.0:37055 every 8 connection(s)
[ OK ] Parameters/TestRpc.TestMaxSmallSidecars/SSL_TCP (205 ms)
[ RUN ] Parameters/TestRpc.TestCallTimeout/SSL_TCP
I20260928 23:51:28.710732 14756 acceptor_pool.cc:254] collecting diagnostics on the listening RPC socket 0.0.0.0:39153 every 8 connection(s)
I20260928 23:51:28.711504 14757 acceptor_pool.cc:254] collecting diagnostics on the listening RPC socket 0.0.0.0:39153 every 8 connection(s)
I20260928 23:51:28.730360 14451 rpc-test-base.h:595] status: Timed out: connection negotiation to 0.0.0.0:39153 for RPC Sleep timed out after 0.000s (ON_OUTBOUND_QUEUE), seconds elapsed: 0.00264898
I20260928 23:51:28.738838 14760 rpc-test-base.h:222] got call: sleep_micros: 700000
I20260928 23:51:28.931675 14451 rpc-test-base.h:595] status: Timed out: Sleep RPC to 0.0.0.0:39153 timed out after 0.200s (SENT), seconds elapsed: 0.200943
I20260928 23:51:28.933095 14759 rpc-test-base.h:222] got call: sleep_micros: 2000000
W20260928 23:51:29.439594 14760 rpcz_store.cc:267] Call kudu.rpc.GenericCalculatorService.Sleep from 127.0.0.1:54674 (request call id 1) took 700 ms (client timeout 200 ms). Trace:
W20260928 23:51:29.439965 14760 rpcz_store.cc:269] 0928 23:51:28.738656 (+ 0us) service_pool.cc:170] Inserting onto call queue
0928 23:51:28.738769 (+ 113us) service_pool.cc:227] Handling call
0928 23:51:29.439515 (+700746us) inbound_call.cc:173] Queueing success response
Metrics: {}
I20260928 23:51:30.433513 14451 rpc-test-base.h:595] status: Timed out: Sleep RPC to 0.0.0.0:39153 timed out after 1.500s (SENT), seconds elapsed: 1.5015
W20260928 23:51:30.933746 14759 rpcz_store.cc:267] Call kudu.rpc.GenericCalculatorService.Sleep from 127.0.0.1:54674 (request call id 2) took 2000 ms (client timeout 1500 ms). Trace:
W20260928 23:51:30.934108 14759 rpcz_store.cc:269] 0928 23:51:28.932829 (+ 0us) service_pool.cc:170] Inserting onto call queue
0928 23:51:28.932954 (+ 125us) service_pool.cc:227] Handling call
0928 23:51:30.933670 (+2000716us) inbound_call.cc:173] Queueing success response
Metrics: {}
W20260928 23:51:30.934685 14753 connection.cc:441] server connection from 127.0.0.1:54674 torn down before Call kudu.rpc.GenericCalculatorService.Sleep from 127.0.0.1:54674 (request call id 2) could send its response
[ OK ] Parameters/TestRpc.TestCallTimeout/SSL_TCP (2248 ms)
[ RUN ] Parameters/TestRpc.TestServerShutsDown/SSL_TCP
I20260928 23:51:30.942981 14451 rpc-test.cc:1125] Connecting to 0.0.0.0:43341
W20260928 23:51:30.953724 14773 negotiation.cc:337] Failed RPC negotiation. Trace:
0928 23:51:30.951748 (+ 0us) reactor.cc:625] Submitting negotiation task for client connection to 0.0.0.0:43341 (local address 127.0.0.1:51432)
0928 23:51:30.952375 (+ 627us) negotiation.cc:107] Waiting for socket to connect
0928 23:51:30.952414 (+ 39us) client_negotiation.cc:174] Beginning negotiation
0928 23:51:30.952668 (+ 254us) client_negotiation.cc:252] Sending NEGOTIATE NegotiatePB request
0928 23:51:30.952916 (+ 248us) negotiation.cc:327] Negotiation complete: Network error: Client connection negotiation failed: client connection to 0.0.0.0:43341: BlockingWrite error: write error: Broken pipe (error 32)
Metrics: {"client-negotiator.queue_time_us":145}
[ OK ] Parameters/TestRpc.TestServerShutsDown/SSL_TCP (15 ms)
[ RUN ] Parameters/TestRpc.TimedOutOnResponseMetric/SSL_TCP
I20260928 23:51:30.976146 14790 acceptor_pool.cc:254] collecting diagnostics on the listening RPC socket 0.0.0.0:41313 every 8 connection(s)
I20260928 23:51:30.976837 14791 acceptor_pool.cc:254] collecting diagnostics on the listening RPC socket 0.0.0.0:41313 every 8 connection(s)
W20260928 23:51:31.231352 14794 rpcz_store.cc:267] Call kudu.rpc_test.CalculatorService.Sleep from 127.0.0.1:49426 (request call id 3) took 50 ms (client timeout 25 ms). Trace:
W20260928 23:51:31.231648 14794 rpcz_store.cc:269] 0928 23:51:31.180647 (+ 0us) service_pool.cc:170] Inserting onto call queue
0928 23:51:31.180799 (+ 152us) service_pool.cc:227] Handling call
0928 23:51:31.231261 (+ 50462us) inbound_call.cc:173] Queueing success response
Related trace 'test_child':
Metrics: {"test_sleep_us":50000,"child_traces":[["test_child",{"related_trace_metric":1}]]}
W20260928 23:51:31.290959 14794 rpcz_store.cc:267] Call kudu.rpc_test.CalculatorService.Sleep from 127.0.0.1:49426 (request call id 4) took 50 ms (client timeout 50 ms). Trace:
W20260928 23:51:31.291340 14794 rpcz_store.cc:269] 0928 23:51:31.240339 (+ 0us) service_pool.cc:170] Inserting onto call queue
0928 23:51:31.240481 (+ 142us) service_pool.cc:227] Handling call
0928 23:51:31.290878 (+ 50397us) inbound_call.cc:173] Queueing success response
Related trace 'test_child':
Metrics: {"test_sleep_us":50000,"child_traces":[["test_child",{"related_trace_metric":1}]]}
W20260928 23:51:31.294057 14788 connection.cc:196] Error closing socket: Network error: TlsSocket::Close: Connection reset by peer
[ OK ] Parameters/TestRpc.TimedOutOnResponseMetric/SSL_TCP (343 ms)
[ RUN ] Parameters/TestRpc.AcceptorDispatchingTimesMetric/SSL_TCP
I20260928 23:51:31.310675 14815 acceptor_pool.cc:254] collecting diagnostics on the listening RPC socket 0.0.0.0:35357 every 8 connection(s)
I20260928 23:51:31.311403 14816 acceptor_pool.cc:254] collecting diagnostics on the listening RPC socket 0.0.0.0:35357 every 8 connection(s)
W20260928 23:51:31.316250 14811 negotiation.cc:337] Failed RPC negotiation. Trace:
0928 23:51:31.315106 (+ 0us) reactor.cc:625] Submitting negotiation task for server connection from 127.0.0.1:45216 (local address 127.0.0.1:35357)
0928 23:51:31.315517 (+ 411us) server_negotiation.cc:206] Beginning negotiation
0928 23:51:31.315534 (+ 17us) server_negotiation.cc:399] Waiting for connection header
0928 23:51:31.315760 (+ 226us) negotiation.cc:327] Negotiation complete: Network error: Server connection negotiation failed: server connection from 127.0.0.1:45216: BlockingRecv error: recv got EOF from 127.0.0.1:45216 (error 108)
Metrics: {"server-negotiator.queue_time_us":118}
[ OK ] Parameters/TestRpc.AcceptorDispatchingTimesMetric/SSL_TCP (21 ms)
[ RUN ] Parameters/TestRpc.TestRpcCallbackDestroysMessenger/SSL_TCP
[ OK ] Parameters/TestRpc.TestRpcCallbackDestroysMessenger/SSL_TCP (20 ms)
[ RUN ] Parameters/TestRpc.TestApplicationFeatureFlag/SSL_TCP
I20260928 23:51:31.379799 14840 acceptor_pool.cc:254] collecting diagnostics on the listening RPC socket 0.0.0.0:46013 every 8 connection(s)
I20260928 23:51:31.380568 14841 acceptor_pool.cc:254] collecting diagnostics on the listening RPC socket 0.0.0.0:46013 every 8 connection(s)
W20260928 23:51:31.412490 14837 messenger.cc:357] Unable to handle RPC call: Not implemented: call requires unsupported application feature flags: 99
[ OK ] Parameters/TestRpc.TestApplicationFeatureFlag/SSL_TCP (81 ms)
[ RUN ] Parameters/TestRpc.TestCancellation/SSL_TCP
I20260928 23:51:31.443862 14865 acceptor_pool.cc:254] collecting diagnostics on the listening RPC socket 0.0.0.0:43331 every 8 connection(s)
I20260928 23:51:31.444598 14866 acceptor_pool.cc:254] collecting diagnostics on the listening RPC socket 0.0.0.0:43331 every 8 connection(s)
I20260928 23:51:31.447979 14451 rpc-test.cc:1648] Connecting to 0.0.0.0:43331
I20260928 23:51:31.552774 14451 rpc-test-base.h:595] status: Aborted: Sleep RPC to 0.0.0.0:43331 is cancelled in state READY, seconds elapsed: 0.000382687
I20260928 23:51:31.703769 14451 rpc-test-base.h:595] status: Aborted: Sleep RPC to 0.0.0.0:43331 is cancelled in state SENT, seconds elapsed: 0.00103719
I20260928 23:51:31.748435 14868 rpc-test-base.h:222] got call: sleep_micros: 510000
I20260928 23:51:31.887022 14451 rpc-test-base.h:595] status: Aborted: Sleep RPC to 0.0.0.0:43331 is cancelled in state SENT, seconds elapsed: 0.00120806
I20260928 23:51:31.930976 14867 rpc-test-base.h:222] got call: sleep_micros: 510000
I20260928 23:51:32.064800 14451 rpc-test-base.h:595] status: Aborted: Sleep RPC to 0.0.0.0:43331 is cancelled in state SENT, seconds elapsed: 0.000966468
W20260928 23:51:32.101883 14869 rpcz_store.cc:267] Call kudu.rpc.GenericCalculatorService.Sleep from 127.0.0.1:45350 (request call id 11) took 14 ms (client timeout 10 ms). Trace:
W20260928 23:51:32.102228 14869 rpcz_store.cc:269] 0928 23:51:32.087167 (+ 0us) service_pool.cc:170] Inserting onto call queue
0928 23:51:32.101589 (+ 14422us) service_pool.cc:214] Skipping call since client already timed out
0928 23:51:32.101700 (+ 111us) inbound_call.cc:173] Queueing failure response
Metrics: {}
I20260928 23:51:32.102762 14869 rpc-test-base.h:222] got call: sleep_micros: 1500000
W20260928 23:51:32.259068 14868 rpcz_store.cc:267] Call kudu.rpc.GenericCalculatorService.Sleep from 127.0.0.1:45350 (request call id 3) took 511 ms (client timeout 10 ms). Trace:
W20260928 23:51:32.259399 14868 rpcz_store.cc:269] 0928 23:51:31.747932 (+ 0us) service_pool.cc:170] Inserting onto call queue
0928 23:51:31.748362 (+ 430us) service_pool.cc:227] Handling call
0928 23:51:32.259006 (+510644us) inbound_call.cc:173] Queueing success response
Metrics: {}
W20260928 23:51:32.441732 14867 rpcz_store.cc:267] Call kudu.rpc.GenericCalculatorService.Sleep from 127.0.0.1:45350 (request call id 7) took 511 ms (client timeout 10 ms). Trace:
W20260928 23:51:32.442055 14867 rpcz_store.cc:269] 0928 23:51:31.930725 (+ 0us) service_pool.cc:170] Inserting onto call queue
0928 23:51:31.930886 (+ 161us) service_pool.cc:227] Handling call
0928 23:51:32.441674 (+510788us) inbound_call.cc:173] Queueing success response
Metrics: {}
I20260928 23:51:33.066551 14451 rpc-test-base.h:595] status: Timed out: Sleep RPC to 0.0.0.0:43331 timed out after 1.000s (SENT), seconds elapsed: 1.00133
I20260928 23:51:33.068077 14867 rpc-test-base.h:222] got call: sleep_micros: 1500000
W20260928 23:51:33.603264 14869 rpcz_store.cc:267] Call kudu.rpc.GenericCalculatorService.Sleep from 127.0.0.1:45350 (request call id 12) took 1515 ms (client timeout 1000 ms). Trace:
W20260928 23:51:33.603578 14869 rpcz_store.cc:269] 0928 23:51:32.087485 (+ 0us) service_pool.cc:170] Inserting onto call queue
0928 23:51:32.102729 (+ 15244us) service_pool.cc:227] Handling call
0928 23:51:33.603205 (+1500476us) inbound_call.cc:173] Queueing success response
Metrics: {}
I20260928 23:51:34.068228 14451 rpc-test-base.h:595] status: Timed out: Sleep RPC to 0.0.0.0:43331 timed out after 1.000s (SENT), seconds elapsed: 1.00125
W20260928 23:51:34.069880 14862 messenger.cc:357] Unable to handle RPC call: Not implemented: call requires unsupported application feature flags: 99, 1
W20260928 23:51:34.071327 14862 messenger.cc:357] Unable to handle RPC call: Not implemented: call requires unsupported application feature flags: 99, 1
W20260928 23:51:34.568681 14867 rpcz_store.cc:267] Call kudu.rpc.GenericCalculatorService.Sleep from 127.0.0.1:45350 (request call id 13) took 1500 ms (client timeout 1000 ms). Trace:
W20260928 23:51:34.568997 14867 rpcz_store.cc:269] 0928 23:51:33.067844 (+ 0us) service_pool.cc:170] Inserting onto call queue
0928 23:51:33.068018 (+ 174us) service_pool.cc:227] Handling call
0928 23:51:34.568619 (+1500601us) inbound_call.cc:173] Queueing success response
Metrics: {}
W20260928 23:51:34.569691 14862 connection.cc:441] server connection from 127.0.0.1:45350 torn down before Call kudu.rpc.GenericCalculatorService.Sleep from 127.0.0.1:45350 (request call id 13) could send its response
[ OK ] Parameters/TestRpc.TestCancellation/SSL_TCP (3152 ms)
[ RUN ] Parameters/TestRpc.TestCancellationMultiThreads/SSL_TCP
I20260928 23:51:34.600531 14890 acceptor_pool.cc:254] collecting diagnostics on the listening RPC socket 0.0.0.0:39021 every 8 connection(s)
I20260928 23:51:34.601238 14891 acceptor_pool.cc:254] collecting diagnostics on the listening RPC socket 0.0.0.0:39021 every 8 connection(s)
I20260928 23:51:34.604614 14451 rpc-test.cc:1808] Connecting to 0.0.0.0:39021
I20260928 23:51:34.750000 14904 test_util.cc:268] Using random seed: -1090429181
I20260928 23:51:34.751482 14905 test_util.cc:268] Using random seed: -1090427692
I20260928 23:51:34.752884 14906 test_util.cc:268] Using random seed: -1090426294
I20260928 23:51:34.754380 14907 test_util.cc:268] Using random seed: -1090424811
I20260928 23:51:34.755820 14908 test_util.cc:268] Using random seed: -1090423473
I20260928 23:51:34.757225 14909 test_util.cc:268] Using random seed: -1090422087
I20260928 23:51:34.758776 14910 test_util.cc:268] Using random seed: -1090420529
I20260928 23:51:34.760381 14911 test_util.cc:268] Using random seed: -1090418938
I20260928 23:51:34.761834 14912 test_util.cc:268] Using random seed: -1090417470
I20260928 23:51:34.763497 14913 test_util.cc:268] Using random seed: -1090415895
I20260928 23:51:34.764843 14914 test_util.cc:268] Using random seed: -1090414483
I20260928 23:51:34.766294 14915 test_util.cc:268] Using random seed: -1090413041
I20260928 23:51:34.767575 14916 test_util.cc:268] Using random seed: -1090411720
I20260928 23:51:34.769583 14917 test_util.cc:268] Using random seed: -1090409754
I20260928 23:51:34.771678 14918 test_util.cc:268] Using random seed: -1090407764
I20260928 23:51:34.773540 14919 test_util.cc:268] Using random seed: -1090405862
I20260928 23:51:34.775305 14920 test_util.cc:268] Using random seed: -1090403960
I20260928 23:51:34.776697 14921 test_util.cc:268] Using random seed: -1090402566
I20260928 23:51:34.778316 14922 test_util.cc:268] Using random seed: -1090400961
I20260928 23:51:34.779973 14923 test_util.cc:268] Using random seed: -1090399302
I20260928 23:51:34.781464 14924 test_util.cc:268] Using random seed: -1090397839
I20260928 23:51:34.783605 14925 test_util.cc:268] Using random seed: -1090395739
I20260928 23:51:34.785415 14926 test_util.cc:268] Using random seed: -1090393932
I20260928 23:51:34.787571 14927 test_util.cc:268] Using random seed: -1090391730
I20260928 23:51:34.789549 14928 test_util.cc:268] Using random seed: -1090389797
I20260928 23:51:34.791375 14929 test_util.cc:268] Using random seed: -1090387994
I20260928 23:51:34.793144 14930 test_util.cc:268] Using random seed: -1090386190
I20260928 23:51:34.795018 14931 test_util.cc:268] Using random seed: -1090384323
I20260928 23:51:34.796833 14932 test_util.cc:268] Using random seed: -1090382479
I20260928 23:51:34.798617 14933 test_util.cc:268] Using random seed: -1090380673
[ OK ] Parameters/TestRpc.TestCancellationMultiThreads/SSL_TCP (18700 ms)
[ RUN ] Parameters/TestRpc.TestCallId/SSL_TCP
I20260928 23:51:53.302915 14947 acceptor_pool.cc:254] collecting diagnostics on the listening RPC socket 0.0.0.0:34015 every 8 connection(s)
I20260928 23:51:53.303768 14948 acceptor_pool.cc:254] collecting diagnostics on the listening RPC socket 0.0.0.0:34015 every 8 connection(s)
[ OK ] Parameters/TestRpc.TestCallId/SSL_TCP (88 ms)
[----------] 20 tests from Parameters/TestRpc (38299 ms total)
[----------] Global test environment tear-down
[==========] 21 tests from 2 test suites ran. (38308 ms total)
[ PASSED ] 20 tests.
[ FAILED ] 1 test, listed below:
[ FAILED ] Parameters/TestRpc.TestCallWithChainCertAndRootCA/SSL_TCP, where GetParam() = (true, false)
1 FAILED TEST