Diagnosed failure
Parameters/TestRpc.TestCallWithChainCertAndChainCA/SSL_UnixSocket: /data0/somelongdirectorytoavoidrpathissues/src/kudu/src/kudu/rpc/rpc-test.cc:270: Failure
Failed
Bad status: Runtime error: could not verify certificate chain (error with cert: subject=CN = localhost, ST = sadfjas, C = AS, emailAddress = sdflkdsajf, O = lskdfjlsad, OU = sldfkja, issuer=C = AS, ST = ASDfkjdhf, L = lskdjf, O = saldfja, OU = skdjf, CN = localhost, emailAddress = sadjflkadsj): : certificate has expired
Google Test trace:
/data0/somelongdirectorytoavoidrpathissues/src/kudu/src/kudu/rpc/rpc-test.cc:267: Connecting to unix:/tmp/dist-test-tasktG7Pfw/test-tmp/rpc-test-6adf7f044e634c8c8ca936a3afe37b56.sock
I20260924 10:34:21.029623 383 test_util.cc:175] -----------------------------------------------
I20260924 10:34:21.029695 383 test_util.cc:176] Had fatal failures, leaving test files at /tmp/dist-test-tasktG7Pfw/test-tmp/rpc-test.6.Parameters_TestRpc.TestCallWithChainCertAndChainCA_SSL_UnixSocket.1790246060957834-383-0
Full log
Note: This is test shard 7 of 8.
[==========] Running 21 tests from 2 test suites.
[----------] Global test environment set-up.
[----------] 20 tests from Parameters/TestRpc
[ RUN ] Parameters/TestRpc.TestMessengerCreateDestroy/SSL_UnixSocket
WARNING: Logging before InitGoogleLogging() is written to STDERR
I20260924 10:34:20.980975 383 rpc-test.cc:169] started messenger TestCreateDestroy
[ OK ] Parameters/TestRpc.TestMessengerCreateDestroy/SSL_UnixSocket (18 ms)
[ RUN ] Parameters/TestRpc.TestNegotiationDeadlock/SSL_UnixSocket
I20260924 10:34:20.993134 403 acceptor_pool.cc:254] collecting diagnostics on the listening RPC socket unix:/tmp/dist-test-tasktG7Pfw/test-tmp/rpc-test-2201708cb0584a8898cd286d279c1a60.sock every 8 connection(s)
I20260924 10:34:20.993134 404 acceptor_pool.cc:254] collecting diagnostics on the listening RPC socket unix:/tmp/dist-test-tasktG7Pfw/test-tmp/rpc-test-2201708cb0584a8898cd286d279c1a60.sock every 8 connection(s)
[ OK ] Parameters/TestRpc.TestNegotiationDeadlock/SSL_UnixSocket (21 ms)
[ RUN ] Parameters/TestRpc.TestCallWithChainCertAndChainCA/SSL_UnixSocket
I20260924 10:34:21.022871 419 acceptor_pool.cc:254] collecting diagnostics on the listening RPC socket unix:/tmp/dist-test-tasktG7Pfw/test-tmp/rpc-test-6adf7f044e634c8c8ca936a3afe37b56.sock every 8 connection(s)
I20260924 10:34:21.022905 420 acceptor_pool.cc:254] collecting diagnostics on the listening RPC socket unix:/tmp/dist-test-tasktG7Pfw/test-tmp/rpc-test-6adf7f044e634c8c8ca936a3afe37b56.sock every 8 connection(s)
/data0/somelongdirectorytoavoidrpathissues/src/kudu/src/kudu/rpc/rpc-test.cc:270: Failure
Failed
Bad status: Runtime error: could not verify certificate chain (error with cert: subject=CN = localhost, ST = sadfjas, C = AS, emailAddress = sdflkdsajf, O = lskdfjlsad, OU = sldfkja, issuer=C = AS, ST = ASDfkjdhf, L = lskdjf, O = saldfja, OU = skdjf, CN = localhost, emailAddress = sadjflkadsj): : certificate has expired
Google Test trace:
/data0/somelongdirectorytoavoidrpathissues/src/kudu/src/kudu/rpc/rpc-test.cc:267: Connecting to unix:/tmp/dist-test-tasktG7Pfw/test-tmp/rpc-test-6adf7f044e634c8c8ca936a3afe37b56.sock
I20260924 10:34:21.029623 383 test_util.cc:175] -----------------------------------------------
I20260924 10:34:21.029695 383 test_util.cc:176] Had fatal failures, leaving test files at /tmp/dist-test-tasktG7Pfw/test-tmp/rpc-test.6.Parameters_TestRpc.TestCallWithChainCertAndChainCA_SSL_UnixSocket.1790246060957834-383-0
[ FAILED ] Parameters/TestRpc.TestCallWithChainCertAndChainCA/SSL_UnixSocket, where GetParam() = (true, true) (24 ms)
[ RUN ] Parameters/TestRpc.TestCallWithPasswordProtectedKey/SSL_UnixSocket
I20260924 10:34:21.053983 445 acceptor_pool.cc:254] collecting diagnostics on the listening RPC socket unix:/tmp/dist-test-tasktG7Pfw/test-tmp/rpc-test-acb0832ae6e04b29aef3a3b13eb58434.sock every 8 connection(s)
I20260924 10:34:21.054158 444 acceptor_pool.cc:254] collecting diagnostics on the listening RPC socket unix:/tmp/dist-test-tasktG7Pfw/test-tmp/rpc-test-acb0832ae6e04b29aef3a3b13eb58434.sock every 8 connection(s)
W20260924 10:34:21.070147 441 connection.cc:196] Error closing socket: Network error: TlsSocket::Close: Broken pipe
[ OK ] Parameters/TestRpc.TestCallWithPasswordProtectedKey/SSL_UnixSocket (42 ms)
[ RUN ] Parameters/TestRpc.TestCallToBadServer/SSL_UnixSocket
I20260924 10:34:21.089337 383 rpc-test.cc:394] Status: Network error: Client connection negotiation failed: client connection to 0.0.0.0:0: connect: Connection refused (error 111)
I20260924 10:34:21.090124 383 rpc-test.cc:394] Status: Network error: Client connection negotiation failed: client connection to 0.0.0.0:0: connect: Connection refused (error 111)
I20260924 10:34:21.090754 383 rpc-test.cc:394] Status: Network error: Client connection negotiation failed: client connection to 0.0.0.0:0: connect: Connection refused (error 111)
I20260924 10:34:21.091423 383 rpc-test.cc:394] Status: Network error: Client connection negotiation failed: client connection to 0.0.0.0:0: connect: Connection refused (error 111)
I20260924 10:34:21.091931 383 rpc-test.cc:394] Status: Network error: Client connection negotiation failed: client connection to 0.0.0.0:0: connect: Connection refused (error 111)
[ OK ] Parameters/TestRpc.TestCallToBadServer/SSL_UnixSocket (20 ms)
[ RUN ] Parameters/TestRpc.TestWrongService/SSL_UnixSocket
I20260924 10:34:21.105145 479 acceptor_pool.cc:254] collecting diagnostics on the listening RPC socket unix:/tmp/dist-test-tasktG7Pfw/test-tmp/rpc-test-0dd4898745cd42e481347c936f874ec8.sock every 8 connection(s)
I20260924 10:34:21.105186 480 acceptor_pool.cc:254] collecting diagnostics on the listening RPC socket unix:/tmp/dist-test-tasktG7Pfw/test-tmp/rpc-test-0dd4898745cd42e481347c936f874ec8.sock every 8 connection(s)
I20260924 10:34:21.133553 476 messenger.cc:345] service WrongServiceName not registered on TestServer
[ OK ] Parameters/TestRpc.TestWrongService/SSL_UnixSocket (43 ms)
[ RUN ] Parameters/TestRpc.TestConnectionKeepalive/SSL_UnixSocket
I20260924 10:34:21.146801 502 acceptor_pool.cc:254] collecting diagnostics on the listening RPC socket unix:/tmp/dist-test-tasktG7Pfw/test-tmp/rpc-test-cd7902dec8fd42ee86ad93372d6c6309.sock every 8 connection(s)
I20260924 10:34:21.146828 503 acceptor_pool.cc:254] collecting diagnostics on the listening RPC socket unix:/tmp/dist-test-tasktG7Pfw/test-tmp/rpc-test-cd7902dec8fd42ee86ad93372d6c6309.sock every 8 connection(s)
I20260924 10:34:21.147190 383 rpc-test.cc:488] Connecting to unix:/tmp/dist-test-tasktG7Pfw/test-tmp/rpc-test-cd7902dec8fd42ee86ad93372d6c6309.sock
W20260924 10:34:21.638109 515 connection.cc:196] Error closing socket: Network error: TlsSocket::Close: Broken pipe
[ OK ] Parameters/TestRpc.TestConnectionKeepalive/SSL_UnixSocket (1036 ms)
[ RUN ] Parameters/TestRpc.TestClientConnectionMetrics/SSL_UnixSocket
I20260924 10:34:22.188865 527 acceptor_pool.cc:254] collecting diagnostics on the listening RPC socket unix:/tmp/dist-test-tasktG7Pfw/test-tmp/rpc-test-67faf02ae8d74b928a42512e521c45ea.sock every 8 connection(s)
I20260924 10:34:22.188896 528 acceptor_pool.cc:254] collecting diagnostics on the listening RPC socket unix:/tmp/dist-test-tasktG7Pfw/test-tmp/rpc-test-67faf02ae8d74b928a42512e521c45ea.sock every 8 connection(s)
I20260924 10:34:22.189240 383 rpc-test.cc:569] Connecting to unix:/tmp/dist-test-tasktG7Pfw/test-tmp/rpc-test-67faf02ae8d74b928a42512e521c45ea.sock
W20260924 10:34:33.465081 524 connection.cc:196] Error closing socket: Network error: TlsSocket::Close: Broken pipe
[ OK ] Parameters/TestRpc.TestClientConnectionMetrics/SSL_UnixSocket (11293 ms)
[ RUN ] Parameters/TestRpc.TestCredentialsPolicy/SSL_UnixSocket
I20260924 10:34:33.477510 550 acceptor_pool.cc:254] collecting diagnostics on the listening RPC socket unix:/tmp/dist-test-tasktG7Pfw/test-tmp/rpc-test-b5db1cc690aa4047b9ffb88b45c2ceae.sock every 8 connection(s)
I20260924 10:34:33.477532 551 acceptor_pool.cc:254] collecting diagnostics on the listening RPC socket unix:/tmp/dist-test-tasktG7Pfw/test-tmp/rpc-test-b5db1cc690aa4047b9ffb88b45c2ceae.sock every 8 connection(s)
I20260924 10:34:33.477874 383 rpc-test.cc:700] Connecting to unix:/tmp/dist-test-tasktG7Pfw/test-tmp/rpc-test-b5db1cc690aa4047b9ffb88b45c2ceae.sock
W20260924 10:34:33.501914 549 connection.cc:196] Error closing socket: Network error: TlsSocket::Close: Broken pipe
W20260924 10:34:33.515956 549 connection.cc:196] Error closing socket: Network error: TlsSocket::Close: Broken pipe
[ OK ] Parameters/TestRpc.TestCredentialsPolicy/SSL_UnixSocket (52 ms)
[ RUN ] Parameters/TestRpc.TestCallLongerThanKeepalive/SSL_UnixSocket
I20260924 10:34:33.538369 575 acceptor_pool.cc:254] collecting diagnostics on the listening RPC socket unix:/tmp/dist-test-tasktG7Pfw/test-tmp/rpc-test-93ab91f713704b6985994c88a815b04b.sock every 8 connection(s)
I20260924 10:34:33.538450 576 acceptor_pool.cc:254] collecting diagnostics on the listening RPC socket unix:/tmp/dist-test-tasktG7Pfw/test-tmp/rpc-test-93ab91f713704b6985994c88a815b04b.sock every 8 connection(s)
I20260924 10:34:33.556509 579 rpc-test-base.h:222] got call: sleep_micros: 3000000 deferred: true
I20260924 10:34:36.557541 579 rpcz_store.cc:275] Call kudu.rpc.GenericCalculatorService.Sleep from unix:<unnamed> (request call id 0) took 3001 ms. Trace:
I20260924 10:34:36.557667 579 rpcz_store.cc:276] 0924 10:34:33.556415 (+ 0us) service_pool.cc:170] Inserting onto call queue
0924 10:34:33.556485 (+ 70us) service_pool.cc:227] Handling call
0924 10:34:36.557521 (+3001036us) inbound_call.cc:173] Queueing success response
Metrics: {}
W20260924 10:34:36.559549 572 connection.cc:196] Error closing socket: Network error: TlsSocket::Close: Broken pipe
[ OK ] Parameters/TestRpc.TestCallLongerThanKeepalive/SSL_UnixSocket (3041 ms)
[ RUN ] Parameters/TestRpc.TestRpcSidecar/SSL_UnixSocket
I20260924 10:34:36.580668 600 acceptor_pool.cc:254] collecting diagnostics on the listening RPC socket unix:/tmp/dist-test-tasktG7Pfw/test-tmp/rpc-test-3e152091210b4e51ab9a3a6eebdbf6e5.sock every 8 connection(s)
I20260924 10:34:36.580685 601 acceptor_pool.cc:254] collecting diagnostics on the listening RPC socket unix:/tmp/dist-test-tasktG7Pfw/test-tmp/rpc-test-3e152091210b4e51ab9a3a6eebdbf6e5.sock every 8 connection(s)
[ OK ] Parameters/TestRpc.TestRpcSidecar/SSL_UnixSocket (80 ms)
[ RUN ] Parameters/TestRpc.TestRpcSidecarLimits/SSL_UnixSocket
I20260924 10:34:38.510653 625 acceptor_pool.cc:254] collecting diagnostics on the listening RPC socket unix:/tmp/dist-test-tasktG7Pfw/test-tmp/rpc-test-1c9fde3c822e482d90100491cab575b5.sock every 8 connection(s)
I20260924 10:34:38.510661 626 acceptor_pool.cc:254] collecting diagnostics on the listening RPC socket unix:/tmp/dist-test-tasktG7Pfw/test-tmp/rpc-test-1c9fde3c822e482d90100491cab575b5.sock every 8 connection(s)
W20260924 10:34:38.545377 383 serialization.cc:72] Serialized kudu.rpc_test.PushStringsRequestPB (2147483654 bytes) is larger than the maximum configured RPC message size (52428800 bytes). Sending anyway, but peer may reject the data.
W20260924 10:34:38.549821 622 connection.cc:535] server connection from unix:<unnamed> recv error: Network error: RPC frame had a length of 2147483714, but we only support messages up to 52428800 bytes long.
W20260924 10:34:38.549989 622 connection.cc:158] shutting down server connection from unix:<unnamed> with pending inbound data: 4/2147483714 bytes received; last active 0 ns ago: status Network error: RPC frame had a length of 2147483714, but we only support messages up to 52428800 bytes long.
W20260924 10:34:38.550258 638 connection.cc:698] client connection to unix:/tmp/dist-test-tasktG7Pfw/test-tmp/rpc-test-1c9fde3c822e482d90100491cab575b5.sock send error: Network error: failed to write to TLS socket: Broken pipe
W20260924 10:34:38.550488 638 connection.cc:196] Error closing socket: Network error: TlsSocket::Close: Success
I20260924 10:34:38.564373 651 acceptor_pool.cc:254] collecting diagnostics on the listening RPC socket unix:/tmp/dist-test-tasktG7Pfw/test-tmp/rpc-test-1c9fde3c822e482d90100491cab575b5.sock every 8 connection(s)
I20260924 10:34:38.564306 650 acceptor_pool.cc:254] collecting diagnostics on the listening RPC socket unix:/tmp/dist-test-tasktG7Pfw/test-tmp/rpc-test-1c9fde3c822e482d90100491cab575b5.sock every 8 connection(s)
W20260924 10:34:43.767565 647 connection.cc:577] server connection from unix:<unnamed>: received bad data: 'Corruption: Invalid packet: message had a length of 2147483710, but we only support messages up to 2147483647 bytes
'
W20260924 10:34:43.768092 663 connection.cc:196] Error closing socket: Network error: TlsSocket::Close: Broken pipe
[ OK ] Parameters/TestRpc.TestRpcSidecarLimits/SSL_UnixSocket (7131 ms)
[ RUN ] Parameters/TestRpc.TestCallTimeoutDoesntAffectNegotiation/SSL_UnixSocket
I20260924 10:34:43.795166 676 acceptor_pool.cc:254] collecting diagnostics on the listening RPC socket unix:/tmp/dist-test-tasktG7Pfw/test-tmp/rpc-test-debedc26f0a443abb7511c639dcdd83a.sock every 8 connection(s)
I20260924 10:34:43.795203 675 acceptor_pool.cc:254] collecting diagnostics on the listening RPC socket unix:/tmp/dist-test-tasktG7Pfw/test-tmp/rpc-test-debedc26f0a443abb7511c639dcdd83a.sock every 8 connection(s)
W20260924 10:34:43.813880 671 negotiation.cc:266] Injecting 500ms delay in negotiation
I20260924 10:34:43.864205 383 rpc-test-base.h:595] status: Timed out: connection negotiation to unix:/tmp/dist-test-tasktG7Pfw/test-tmp/rpc-test-debedc26f0a443abb7511c639dcdd83a.sock for RPC Sleep timed out after 0.050s (ON_OUTBOUND_QUEUE), seconds elapsed: 0.0509194
W20260924 10:34:44.319579 672 connection.cc:196] Error closing socket: Network error: TlsSocket::Close: Broken pipe
[ OK ] Parameters/TestRpc.TestCallTimeoutDoesntAffectNegotiation/SSL_UnixSocket (547 ms)
[ RUN ] Parameters/TestRpc.TestRpcHandlerLatencyMetric/SSL_UnixSocket
I20260924 10:34:44.329165 700 acceptor_pool.cc:254] collecting diagnostics on the listening RPC socket unix:/tmp/dist-test-tasktG7Pfw/test-tmp/rpc-test-b718c01342b24907b660787524a41caf.sock every 8 connection(s)
I20260924 10:34:44.329385 701 acceptor_pool.cc:254] collecting diagnostics on the listening RPC socket unix:/tmp/dist-test-tasktG7Pfw/test-tmp/rpc-test-b718c01342b24907b660787524a41caf.sock every 8 connection(s)
I20260924 10:34:44.369889 383 rpc-test.cc:1236] Sleep() min lat: 20523
I20260924 10:34:44.369988 383 rpc-test.cc:1237] Sleep() mean lat: 20523
I20260924 10:34:44.370018 383 rpc-test.cc:1238] Sleep() max lat: 20523
I20260924 10:34:44.370031 383 rpc-test.cc:1239] Sleep() #calls: 1
[ OK ] Parameters/TestRpc.TestRpcHandlerLatencyMetric/SSL_UnixSocket (51 ms)
[ RUN ] Parameters/TestRpc.TimedOutOnResponseMetricServiceQueue/SSL_UnixSocket
I20260924 10:34:44.387848 726 acceptor_pool.cc:254] collecting diagnostics on the listening RPC socket unix:/tmp/dist-test-tasktG7Pfw/test-tmp/rpc-test-265d9a54ee044dcd8df1f3799a3530c0.sock every 8 connection(s)
I20260924 10:34:44.387867 727 acceptor_pool.cc:254] collecting diagnostics on the listening RPC socket unix:/tmp/dist-test-tasktG7Pfw/test-tmp/rpc-test-265d9a54ee044dcd8df1f3799a3530c0.sock every 8 connection(s)
W20260924 10:34:44.444476 728 rpcz_store.cc:267] Call kudu.rpc_test.CalculatorService.Sleep from unix:<unnamed> (request call id 2) took 20 ms (client timeout 20 ms). Trace:
W20260924 10:34:44.444598 728 rpcz_store.cc:269] 0924 10:34:44.423967 (+ 0us) service_pool.cc:170] Inserting onto call queue
0924 10:34:44.444363 (+ 20396us) service_pool.cc:214] Skipping call since client already timed out
0924 10:34:44.444398 (+ 35us) inbound_call.cc:173] Queueing failure response
Metrics: {}
W20260924 10:34:44.445827 723 connection.cc:196] Error closing socket: Network error: TlsSocket::Close: Broken pipe
[ OK ] Parameters/TestRpc.TimedOutOnResponseMetricServiceQueue/SSL_UnixSocket (74 ms)
[ RUN ] Parameters/TestRpc.RpcPendingConnectionsMetric/SSL_UnixSocket
I20260924 10:34:44.449828 749 acceptor_pool.cc:254] collecting diagnostics on the listening RPC socket 0.0.0.0:46197 every 8 connection(s)
I20260924 10:34:44.449922 750 acceptor_pool.cc:254] collecting diagnostics on the listening RPC socket 0.0.0.0:46197 every 8 connection(s)
W20260924 10:34:44.460301 745 negotiation.cc:337] Failed RPC negotiation. Trace:
0924 10:34:44.459561 (+ 0us) reactor.cc:625] Submitting negotiation task for server connection from 127.0.0.1:46342 (local address 127.0.0.1:46197)
0924 10:34:44.459816 (+ 255us) server_negotiation.cc:206] Beginning negotiation
0924 10:34:44.459824 (+ 8us) server_negotiation.cc:399] Waiting for connection header
0924 10:34:44.459977 (+ 153us) negotiation.cc:327] Negotiation complete: Network error: Server connection negotiation failed: server connection from 127.0.0.1:46342: BlockingRecv error: recv got EOF from 127.0.0.1:46342 (error 108)
Metrics: {"server-negotiator.queue_time_us":96}
[ OK ] Parameters/TestRpc.RpcPendingConnectionsMetric/SSL_UnixSocket (24 ms)
[ RUN ] Parameters/TestRpc.TestRpcContextClientDeadline/SSL_UnixSocket
I20260924 10:34:44.506860 765 acceptor_pool.cc:254] collecting diagnostics on the listening RPC socket unix:/tmp/dist-test-tasktG7Pfw/test-tmp/rpc-test-5dd8496264a8462c968d8475a26a2655.sock every 8 connection(s)
I20260924 10:34:44.506865 766 acceptor_pool.cc:254] collecting diagnostics on the listening RPC socket unix:/tmp/dist-test-tasktG7Pfw/test-tmp/rpc-test-5dd8496264a8462c968d8475a26a2655.sock every 8 connection(s)
W20260924 10:34:44.581456 762 connection.cc:196] Error closing socket: Network error: TlsSocket::Close: Broken pipe
[ OK ] Parameters/TestRpc.TestRpcContextClientDeadline/SSL_UnixSocket (111 ms)
[ RUN ] Parameters/TestRpc.TestApplicationFeatureFlagUnsupportedServer/SSL_UnixSocket
I20260924 10:34:44.592489 790 acceptor_pool.cc:254] collecting diagnostics on the listening RPC socket unix:/tmp/dist-test-tasktG7Pfw/test-tmp/rpc-test-528e4ffcce4e4860845ff00b604ab48f.sock every 8 connection(s)
I20260924 10:34:44.592535 791 acceptor_pool.cc:254] collecting diagnostics on the listening RPC socket unix:/tmp/dist-test-tasktG7Pfw/test-tmp/rpc-test-528e4ffcce4e4860845ff00b604ab48f.sock every 8 connection(s)
W20260924 10:34:44.628522 787 connection.cc:196] Error closing socket: Network error: TlsSocket::Close: Broken pipe
[ OK ] Parameters/TestRpc.TestApplicationFeatureFlagUnsupportedServer/SSL_UnixSocket (47 ms)
[ RUN ] Parameters/TestRpc.TestCancellationAsync/SSL_UnixSocket
I20260924 10:34:44.645020 815 acceptor_pool.cc:254] collecting diagnostics on the listening RPC socket unix:/tmp/dist-test-tasktG7Pfw/test-tmp/rpc-test-fcff29389da74dadbdff99ca55754682.sock every 8 connection(s)
I20260924 10:34:44.645155 816 acceptor_pool.cc:254] collecting diagnostics on the listening RPC socket unix:/tmp/dist-test-tasktG7Pfw/test-tmp/rpc-test-fcff29389da74dadbdff99ca55754682.sock every 8 connection(s)
I20260924 10:34:44.645490 383 rpc-test.cc:1716] Connecting to unix:/tmp/dist-test-tasktG7Pfw/test-tmp/rpc-test-fcff29389da74dadbdff99ca55754682.sock
I20260924 10:34:44.669288 383 test_util.cc:268] Using random seed: 636481380
I20260924 10:34:44.686923 819 rpc-test-base.h:240] got call: sleep_micros: 500 pattern: 4294967295 num_repetitions: 2097152 sidecar_idx: 0
I20260924 10:34:44.704427 818 rpc-test-base.h:240] got call: sleep_micros: 500 pattern: 4294967295 num_repetitions: 2097152 sidecar_idx: 0
I20260924 10:34:44.730406 819 rpc-test-base.h:240] got call: sleep_micros: 500 pattern: 4294967295 num_repetitions: 2097152 sidecar_idx: 0
I20260924 10:34:44.750094 819 rpc-test-base.h:240] got call: sleep_micros: 500 pattern: 4294967295 num_repetitions: 2097152 sidecar_idx: 0
I20260924 10:34:44.767534 818 rpc-test-base.h:240] got call: sleep_micros: 500 pattern: 4294967295 num_repetitions: 2097152 sidecar_idx: 0
I20260924 10:34:44.787359 818 rpc-test-base.h:240] got call: sleep_micros: 500 pattern: 4294967295 num_repetitions: 2097152 sidecar_idx: 0
I20260924 10:34:44.806527 818 rpc-test-base.h:240] got call: sleep_micros: 500 pattern: 4294967295 num_repetitions: 2097152 sidecar_idx: 0
I20260924 10:34:44.825964 818 rpc-test-base.h:240] got call: sleep_micros: 500 pattern: 4294967295 num_repetitions: 2097152 sidecar_idx: 0
W20260924 10:34:44.828153 812 connection.cc:196] Error closing socket: Network error: TlsSocket::Close: Broken pipe
W20260924 10:34:44.845067 812 connection.cc:441] server connection from unix:<unnamed> torn down before Call kudu.rpc.GenericCalculatorService.SleepWithSidecar from unix:<unnamed> (request call id 9) could send its response
[ OK ] Parameters/TestRpc.TestCancellationAsync/SSL_UnixSocket (216 ms)
[ RUN ] Parameters/TestRpc.TestPerformanceBySocketType/SSL_UnixSocket
I20260924 10:34:44.857391 841 acceptor_pool.cc:254] collecting diagnostics on the listening RPC socket unix:/tmp/dist-test-tasktG7Pfw/test-tmp/rpc-test-e8a38a7a3dd84d8f9dcc84aaf758f08b.sock every 8 connection(s)
I20260924 10:34:44.857558 840 acceptor_pool.cc:254] collecting diagnostics on the listening RPC socket unix:/tmp/dist-test-tasktG7Pfw/test-tmp/rpc-test-e8a38a7a3dd84d8f9dcc84aaf758f08b.sock every 8 connection(s)
I20260924 10:34:44.857676 383 rpc-test.cc:1846] Connecting to unix:/tmp/dist-test-tasktG7Pfw/test-tmp/rpc-test-e8a38a7a3dd84d8f9dcc84aaf758f08b.sock
I20260924 10:34:46.760555 383 rpc-test.cc:1859] Sending 1024MB via ssl-enabled unix socket: real 1.883s user 2.329s sys 1.001s
I20260924 10:34:48.602711 383 rpc-test.cc:1859] Sending 1024MB via ssl-enabled unix socket: real 1.842s user 2.299s sys 0.965s
I20260924 10:34:50.556730 383 rpc-test.cc:1859] Sending 1024MB via ssl-enabled unix socket: real 1.954s user 2.421s sys 1.045s
I20260924 10:34:52.383423 383 rpc-test.cc:1859] Sending 1024MB via ssl-enabled unix socket: real 1.827s user 2.172s sys 1.068s
I20260924 10:34:54.159739 383 rpc-test.cc:1859] Sending 1024MB via ssl-enabled unix socket: real 1.776s user 2.125s sys 1.017s
W20260924 10:34:54.160883 837 connection.cc:196] Error closing socket: Network error: TlsSocket::Close: Broken pipe
[ OK ] Parameters/TestRpc.TestPerformanceBySocketType/SSL_UnixSocket (9314 ms)
[----------] 20 tests from Parameters/TestRpc (33197 ms total)
[----------] 1 test from Parameters/TestRpcSocketTxRxQueue
[ RUN ] Parameters/TestRpcSocketTxRxQueue.AcceptorRxQueueSizeMetric/0
I20260924 10:34:54.170881 865 acceptor_pool.cc:254] collecting diagnostics on the listening RPC socket 0.0.0.0:41537 every 1 connection(s)
I20260924 10:34:54.170909 866 acceptor_pool.cc:254] collecting diagnostics on the listening RPC socket 0.0.0.0:41537 every 1 connection(s)
W20260924 10:34:54.171960 861 negotiation.cc:337] Failed RPC negotiation. Trace:
0924 10:34:54.171662 (+ 0us) reactor.cc:625] Submitting negotiation task for server connection from 127.0.0.1:56952 (local address 127.0.0.1:41537)
0924 10:34:54.171789 (+ 127us) server_negotiation.cc:206] Beginning negotiation
0924 10:34:54.171793 (+ 4us) server_negotiation.cc:399] Waiting for connection header
0924 10:34:54.171885 (+ 92us) negotiation.cc:327] Negotiation complete: Network error: Server connection negotiation failed: server connection from 127.0.0.1:56952: BlockingRecv error: recv got EOF from 127.0.0.1:56952 (error 108)
Metrics: {"server-negotiator.queue_time_us":47}
[ OK ] Parameters/TestRpcSocketTxRxQueue.AcceptorRxQueueSizeMetric/0 (12 ms)
[----------] 1 test from Parameters/TestRpcSocketTxRxQueue (12 ms total)
[----------] Global test environment tear-down
[==========] 21 tests from 2 test suites ran. (33209 ms total)
[ PASSED ] 20 tests.
[ FAILED ] 1 test, listed below:
[ FAILED ] Parameters/TestRpc.TestCallWithChainCertAndChainCA/SSL_UnixSocket, where GetParam() = (true, true)
1 FAILED TEST