Diagnosed failure
Parameters/TestRpc.TestCallWithChainCertAndChainCA/SSL_UnixSocket: /data0/somelongdirectorytoavoidrpathissues/src/kudu/src/kudu/rpc/rpc-test.cc:270: Failure
Failed
Bad status: Runtime error: could not verify certificate chain (error with cert: subject=CN = localhost, ST = sadfjas, C = AS, emailAddress = sdflkdsajf, O = lskdfjlsad, OU = sldfkja, issuer=C = AS, ST = ASDfkjdhf, L = lskdjf, O = saldfja, OU = skdjf, CN = localhost, emailAddress = sadjflkadsj): : certificate has expired
Google Test trace:
/data0/somelongdirectorytoavoidrpathissues/src/kudu/src/kudu/rpc/rpc-test.cc:267: Connecting to unix:/tmp/dist-test-taskeYIeGv/test-tmp/rpc-test-27c33d05813749f1a3fcb3a1384dffa2.sock
I20260925 03:12:13.771103 2943 test_util.cc:175] -----------------------------------------------
I20260925 03:12:13.771286 2943 test_util.cc:176] Had fatal failures, leaving test files at /tmp/dist-test-taskeYIeGv/test-tmp/rpc-test.6.Parameters_TestRpc.TestCallWithChainCertAndChainCA_SSL_UnixSocket.1790305932247635-2943-0
Full log
Note: This is test shard 7 of 8.
[==========] Running 21 tests from 2 test suites.
[----------] Global test environment set-up.
[----------] 20 tests from Parameters/TestRpc
[ RUN ] Parameters/TestRpc.TestMessengerCreateDestroy/SSL_UnixSocket
WARNING: Logging before InitGoogleLogging() is written to STDERR
I20260925 03:12:12.369032 2943 rpc-test.cc:169] started messenger TestCreateDestroy
[ OK ] Parameters/TestRpc.TestMessengerCreateDestroy/SSL_UnixSocket (1295 ms)
[ RUN ] Parameters/TestRpc.TestNegotiationDeadlock/SSL_UnixSocket
I20260925 03:12:13.640077 2965 acceptor_pool.cc:254] collecting diagnostics on the listening RPC socket unix:/tmp/dist-test-taskeYIeGv/test-tmp/rpc-test-5e033f42149944b8be3160001e21edd2.sock every 8 connection(s)
I20260925 03:12:13.642401 2966 acceptor_pool.cc:254] collecting diagnostics on the listening RPC socket unix:/tmp/dist-test-taskeYIeGv/test-tmp/rpc-test-5e033f42149944b8be3160001e21edd2.sock every 8 connection(s)
[ OK ] Parameters/TestRpc.TestNegotiationDeadlock/SSL_UnixSocket (97 ms)
[ RUN ] Parameters/TestRpc.TestCallWithChainCertAndChainCA/SSL_UnixSocket
I20260925 03:12:13.734439 2981 acceptor_pool.cc:254] collecting diagnostics on the listening RPC socket unix:/tmp/dist-test-taskeYIeGv/test-tmp/rpc-test-27c33d05813749f1a3fcb3a1384dffa2.sock every 8 connection(s)
I20260925 03:12:13.737532 2982 acceptor_pool.cc:254] collecting diagnostics on the listening RPC socket unix:/tmp/dist-test-taskeYIeGv/test-tmp/rpc-test-27c33d05813749f1a3fcb3a1384dffa2.sock every 8 connection(s)
/data0/somelongdirectorytoavoidrpathissues/src/kudu/src/kudu/rpc/rpc-test.cc:270: Failure
Failed
Bad status: Runtime error: could not verify certificate chain (error with cert: subject=CN = localhost, ST = sadfjas, C = AS, emailAddress = sdflkdsajf, O = lskdfjlsad, OU = sldfkja, issuer=C = AS, ST = ASDfkjdhf, L = lskdjf, O = saldfja, OU = skdjf, CN = localhost, emailAddress = sadjflkadsj): : certificate has expired
Google Test trace:
/data0/somelongdirectorytoavoidrpathissues/src/kudu/src/kudu/rpc/rpc-test.cc:267: Connecting to unix:/tmp/dist-test-taskeYIeGv/test-tmp/rpc-test-27c33d05813749f1a3fcb3a1384dffa2.sock
I20260925 03:12:13.771103 2943 test_util.cc:175] -----------------------------------------------
I20260925 03:12:13.771286 2943 test_util.cc:176] Had fatal failures, leaving test files at /tmp/dist-test-taskeYIeGv/test-tmp/rpc-test.6.Parameters_TestRpc.TestCallWithChainCertAndChainCA_SSL_UnixSocket.1790305932247635-2943-0
[ FAILED ] Parameters/TestRpc.TestCallWithChainCertAndChainCA/SSL_UnixSocket, where GetParam() = (true, true) (64 ms)
[ RUN ] Parameters/TestRpc.TestCallWithPasswordProtectedKey/SSL_UnixSocket
I20260925 03:12:13.796764 3006 acceptor_pool.cc:254] collecting diagnostics on the listening RPC socket unix:/tmp/dist-test-taskeYIeGv/test-tmp/rpc-test-99b7add8b06a4b51877d6012401351e9.sock every 8 connection(s)
I20260925 03:12:13.797600 3007 acceptor_pool.cc:254] collecting diagnostics on the listening RPC socket unix:/tmp/dist-test-taskeYIeGv/test-tmp/rpc-test-99b7add8b06a4b51877d6012401351e9.sock every 8 connection(s)
W20260925 03:12:13.848786 3003 connection.cc:196] Error closing socket: Network error: TlsSocket::Close: Broken pipe
[ OK ] Parameters/TestRpc.TestCallWithPasswordProtectedKey/SSL_UnixSocket (85 ms)
[ RUN ] Parameters/TestRpc.TestCallToBadServer/SSL_UnixSocket
I20260925 03:12:13.881560 2943 rpc-test.cc:394] Status: Network error: Client connection negotiation failed: client connection to 0.0.0.0:0: connect: Connection refused (error 111)
I20260925 03:12:13.883227 2943 rpc-test.cc:394] Status: Network error: Client connection negotiation failed: client connection to 0.0.0.0:0: connect: Connection refused (error 111)
I20260925 03:12:13.884630 2943 rpc-test.cc:394] Status: Network error: Client connection negotiation failed: client connection to 0.0.0.0:0: connect: Connection refused (error 111)
I20260925 03:12:13.886201 2943 rpc-test.cc:394] Status: Network error: Client connection negotiation failed: client connection to 0.0.0.0:0: connect: Connection refused (error 111)
I20260925 03:12:13.887763 2943 rpc-test.cc:394] Status: Network error: Client connection negotiation failed: client connection to 0.0.0.0:0: connect: Connection refused (error 111)
[ OK ] Parameters/TestRpc.TestCallToBadServer/SSL_UnixSocket (34 ms)
[ RUN ] Parameters/TestRpc.TestWrongService/SSL_UnixSocket
I20260925 03:12:13.914628 3042 acceptor_pool.cc:254] collecting diagnostics on the listening RPC socket unix:/tmp/dist-test-taskeYIeGv/test-tmp/rpc-test-82aa93943bee4be4bc714be3c027e369.sock every 8 connection(s)
I20260925 03:12:13.915634 3043 acceptor_pool.cc:254] collecting diagnostics on the listening RPC socket unix:/tmp/dist-test-taskeYIeGv/test-tmp/rpc-test-82aa93943bee4be4bc714be3c027e369.sock every 8 connection(s)
I20260925 03:12:13.953166 3039 messenger.cc:345] service WrongServiceName not registered on TestServer
W20260925 03:12:13.956261 3039 connection.cc:196] Error closing socket: Network error: TlsSocket::Close: Broken pipe
[ OK ] Parameters/TestRpc.TestWrongService/SSL_UnixSocket (71 ms)
[ RUN ] Parameters/TestRpc.TestConnectionKeepalive/SSL_UnixSocket
I20260925 03:12:13.981967 3065 acceptor_pool.cc:254] collecting diagnostics on the listening RPC socket unix:/tmp/dist-test-taskeYIeGv/test-tmp/rpc-test-3aced1d4f5a143bf9c85a521e3fbe921.sock every 8 connection(s)
I20260925 03:12:13.982740 3066 acceptor_pool.cc:254] collecting diagnostics on the listening RPC socket unix:/tmp/dist-test-taskeYIeGv/test-tmp/rpc-test-3aced1d4f5a143bf9c85a521e3fbe921.sock every 8 connection(s)
I20260925 03:12:13.986454 2943 rpc-test.cc:488] Connecting to unix:/tmp/dist-test-taskeYIeGv/test-tmp/rpc-test-3aced1d4f5a143bf9c85a521e3fbe921.sock
W20260925 03:12:14.466095 3078 connection.cc:196] Error closing socket: Network error: TlsSocket::Close: Broken pipe
[ OK ] Parameters/TestRpc.TestConnectionKeepalive/SSL_UnixSocket (1084 ms)
[ RUN ] Parameters/TestRpc.TestClientConnectionMetrics/SSL_UnixSocket
I20260925 03:12:15.074246 3090 acceptor_pool.cc:254] collecting diagnostics on the listening RPC socket unix:/tmp/dist-test-taskeYIeGv/test-tmp/rpc-test-b2d14f1f724f4391a9725a8de29f791c.sock every 8 connection(s)
I20260925 03:12:15.075273 3091 acceptor_pool.cc:254] collecting diagnostics on the listening RPC socket unix:/tmp/dist-test-taskeYIeGv/test-tmp/rpc-test-b2d14f1f724f4391a9725a8de29f791c.sock every 8 connection(s)
I20260925 03:12:15.079589 2943 rpc-test.cc:569] Connecting to unix:/tmp/dist-test-taskeYIeGv/test-tmp/rpc-test-b2d14f1f724f4391a9725a8de29f791c.sock
W20260925 03:14:41.546998 3087 connection.cc:196] Error closing socket: Network error: TlsSocket::Close: Broken pipe
[ OK ] Parameters/TestRpc.TestClientConnectionMetrics/SSL_UnixSocket (146509 ms)
[ RUN ] Parameters/TestRpc.TestCredentialsPolicy/SSL_UnixSocket
I20260925 03:14:41.602587 3127 acceptor_pool.cc:254] collecting diagnostics on the listening RPC socket unix:/tmp/dist-test-taskeYIeGv/test-tmp/rpc-test-04f14d1fa71f4dfcb1ca9110cbc40681.sock every 8 connection(s)
I20260925 03:14:41.603475 3128 acceptor_pool.cc:254] collecting diagnostics on the listening RPC socket unix:/tmp/dist-test-taskeYIeGv/test-tmp/rpc-test-04f14d1fa71f4dfcb1ca9110cbc40681.sock every 8 connection(s)
I20260925 03:14:41.607050 2943 rpc-test.cc:700] Connecting to unix:/tmp/dist-test-taskeYIeGv/test-tmp/rpc-test-04f14d1fa71f4dfcb1ca9110cbc40681.sock
W20260925 03:14:41.650774 3126 connection.cc:196] Error closing socket: Network error: TlsSocket::Close: Broken pipe
[ OK ] Parameters/TestRpc.TestCredentialsPolicy/SSL_UnixSocket (118 ms)
[ RUN ] Parameters/TestRpc.TestCallLongerThanKeepalive/SSL_UnixSocket
I20260925 03:14:41.694749 3153 acceptor_pool.cc:254] collecting diagnostics on the listening RPC socket unix:/tmp/dist-test-taskeYIeGv/test-tmp/rpc-test-56a852f537664ae19a1a4b7d2b5056d3.sock every 8 connection(s)
I20260925 03:14:41.695531 3154 acceptor_pool.cc:254] collecting diagnostics on the listening RPC socket unix:/tmp/dist-test-taskeYIeGv/test-tmp/rpc-test-56a852f537664ae19a1a4b7d2b5056d3.sock every 8 connection(s)
I20260925 03:14:41.738296 3157 rpc-test-base.h:222] got call: sleep_micros: 3000000 deferred: true
I20260925 03:14:44.743237 3157 rpcz_store.cc:275] Call kudu.rpc.GenericCalculatorService.Sleep from unix:<unnamed> (request call id 0) took 3005 ms. Trace:
I20260925 03:14:44.743657 3157 rpcz_store.cc:276] 0925 03:14:41.738103 (+ 0us) service_pool.cc:170] Inserting onto call queue
0925 03:14:41.738235 (+ 132us) service_pool.cc:227] Handling call
0925 03:14:44.742992 (+3004757us) inbound_call.cc:173] Queueing success response
Metrics: {}
W20260925 03:14:44.748842 3150 connection.cc:196] Error closing socket: Network error: TlsSocket::Close: Broken pipe
[ OK ] Parameters/TestRpc.TestCallLongerThanKeepalive/SSL_UnixSocket (3082 ms)
[ RUN ] Parameters/TestRpc.TestRpcSidecar/SSL_UnixSocket
I20260925 03:14:44.785943 3179 acceptor_pool.cc:254] collecting diagnostics on the listening RPC socket unix:/tmp/dist-test-taskeYIeGv/test-tmp/rpc-test-0cebf8fa73e24d33902f3a1039e30f07.sock every 8 connection(s)
I20260925 03:14:44.786813 3180 acceptor_pool.cc:254] collecting diagnostics on the listening RPC socket unix:/tmp/dist-test-taskeYIeGv/test-tmp/rpc-test-0cebf8fa73e24d33902f3a1039e30f07.sock every 8 connection(s)
W20260925 03:14:45.324623 3176 connection.cc:196] Error closing socket: Network error: TlsSocket::Close: Broken pipe
[ OK ] Parameters/TestRpc.TestRpcSidecar/SSL_UnixSocket (573 ms)
[ RUN ] Parameters/TestRpc.TestRpcSidecarLimits/SSL_UnixSocket
I20260925 03:15:04.709295 3206 acceptor_pool.cc:254] collecting diagnostics on the listening RPC socket unix:/tmp/dist-test-taskeYIeGv/test-tmp/rpc-test-c3d42881efa843dc833fa81ec3043fda.sock every 8 connection(s)
I20260925 03:15:04.710079 3207 acceptor_pool.cc:254] collecting diagnostics on the listening RPC socket unix:/tmp/dist-test-taskeYIeGv/test-tmp/rpc-test-c3d42881efa843dc833fa81ec3043fda.sock every 8 connection(s)
W20260925 03:15:04.738965 2943 serialization.cc:72] Serialized kudu.rpc_test.PushStringsRequestPB (2147483654 bytes) is larger than the maximum configured RPC message size (52428800 bytes). Sending anyway, but peer may reject the data.
W20260925 03:15:04.750564 3203 connection.cc:535] server connection from unix:<unnamed> recv error: Network error: RPC frame had a length of 2147483714, but we only support messages up to 52428800 bytes long.
W20260925 03:15:04.750914 3203 connection.cc:158] shutting down server connection from unix:<unnamed> with pending inbound data: 4/2147483714 bytes received; last active 0 ns ago: status Network error: RPC frame had a length of 2147483714, but we only support messages up to 52428800 bytes long.
W20260925 03:15:04.751824 3221 connection.cc:698] client connection to unix:/tmp/dist-test-taskeYIeGv/test-tmp/rpc-test-c3d42881efa843dc833fa81ec3043fda.sock send error: Network error: failed to write to TLS socket: Broken pipe
W20260925 03:15:04.752540 3221 connection.cc:196] Error closing socket: Network error: TlsSocket::Close: Success
[ OK ] Parameters/TestRpc.TestRpcSidecarLimits/SSL_UnixSocket (20078 ms)
[ RUN ] Parameters/TestRpc.TestCallTimeoutDoesntAffectNegotiation/SSL_UnixSocket
I20260925 03:15:05.442935 3233 acceptor_pool.cc:254] collecting diagnostics on the listening RPC socket unix:/tmp/dist-test-taskeYIeGv/test-tmp/rpc-test-ecde96e93a6043069cf92176b363ab9c.sock every 8 connection(s)
I20260925 03:15:05.443678 3234 acceptor_pool.cc:254] collecting diagnostics on the listening RPC socket unix:/tmp/dist-test-taskeYIeGv/test-tmp/rpc-test-ecde96e93a6043069cf92176b363ab9c.sock every 8 connection(s)
W20260925 03:15:05.464542 3229 negotiation.cc:266] Injecting 500ms delay in negotiation
I20260925 03:15:05.514053 2943 rpc-test-base.h:595] status: Timed out: connection negotiation to unix:/tmp/dist-test-taskeYIeGv/test-tmp/rpc-test-ecde96e93a6043069cf92176b363ab9c.sock for RPC Sleep timed out after 0.050s (ON_OUTBOUND_QUEUE), seconds elapsed: 0.0507001
W20260925 03:15:05.979830 3230 connection.cc:196] Error closing socket: Network error: TlsSocket::Close: Broken pipe
[ OK ] Parameters/TestRpc.TestCallTimeoutDoesntAffectNegotiation/SSL_UnixSocket (575 ms)
[ RUN ] Parameters/TestRpc.TestRpcHandlerLatencyMetric/SSL_UnixSocket
I20260925 03:15:06.017277 3258 acceptor_pool.cc:254] collecting diagnostics on the listening RPC socket unix:/tmp/dist-test-taskeYIeGv/test-tmp/rpc-test-500a183c54ed4726a943628425f478cb.sock every 8 connection(s)
I20260925 03:15:06.018064 3259 acceptor_pool.cc:254] collecting diagnostics on the listening RPC socket unix:/tmp/dist-test-taskeYIeGv/test-tmp/rpc-test-500a183c54ed4726a943628425f478cb.sock every 8 connection(s)
I20260925 03:15:06.091414 2943 rpc-test.cc:1236] Sleep() min lat: 22412
I20260925 03:15:06.091631 2943 rpc-test.cc:1237] Sleep() mean lat: 22412
I20260925 03:15:06.091823 2943 rpc-test.cc:1238] Sleep() max lat: 22412
I20260925 03:15:06.091984 2943 rpc-test.cc:1239] Sleep() #calls: 1
[ OK ] Parameters/TestRpc.TestRpcHandlerLatencyMetric/SSL_UnixSocket (115 ms)
[ RUN ] Parameters/TestRpc.TimedOutOnResponseMetricServiceQueue/SSL_UnixSocket
I20260925 03:15:06.127329 3284 acceptor_pool.cc:254] collecting diagnostics on the listening RPC socket unix:/tmp/dist-test-taskeYIeGv/test-tmp/rpc-test-415987b6b5b543eda6df69eb38987b33.sock every 8 connection(s)
I20260925 03:15:06.128088 3285 acceptor_pool.cc:254] collecting diagnostics on the listening RPC socket unix:/tmp/dist-test-taskeYIeGv/test-tmp/rpc-test-415987b6b5b543eda6df69eb38987b33.sock every 8 connection(s)
W20260925 03:15:06.220347 3286 rpcz_store.cc:267] Call kudu.rpc_test.CalculatorService.Sleep from unix:<unnamed> (request call id 2) took 20 ms (client timeout 20 ms). Trace:
W20260925 03:15:06.220937 3286 rpcz_store.cc:269] 0925 03:15:06.199643 (+ 0us) service_pool.cc:170] Inserting onto call queue
0925 03:15:06.220196 (+ 20553us) service_pool.cc:214] Skipping call since client already timed out
0925 03:15:06.220295 (+ 99us) inbound_call.cc:173] Queueing failure response
Metrics: {}
W20260925 03:15:06.224224 3281 connection.cc:196] Error closing socket: Network error: TlsSocket::Close: Broken pipe
[ OK ] Parameters/TestRpc.TimedOutOnResponseMetricServiceQueue/SSL_UnixSocket (129 ms)
[ RUN ] Parameters/TestRpc.RpcPendingConnectionsMetric/SSL_UnixSocket
I20260925 03:15:06.245764 3308 acceptor_pool.cc:254] collecting diagnostics on the listening RPC socket 0.0.0.0:41753 every 8 connection(s)
I20260925 03:15:06.246722 3309 acceptor_pool.cc:254] collecting diagnostics on the listening RPC socket 0.0.0.0:41753 every 8 connection(s)
W20260925 03:15:06.254851 3304 negotiation.cc:337] Failed RPC negotiation. Trace:
0925 03:15:06.252632 (+ 0us) reactor.cc:625] Submitting negotiation task for server connection from 127.0.0.1:53126 (local address 127.0.0.1:41753)
0925 03:15:06.253313 (+ 681us) server_negotiation.cc:206] Beginning negotiation
0925 03:15:06.253340 (+ 27us) server_negotiation.cc:399] Waiting for connection header
0925 03:15:06.253657 (+ 317us) negotiation.cc:327] Negotiation complete: Network error: Server connection negotiation failed: server connection from 127.0.0.1:53126: BlockingRecv error: recv got EOF from 127.0.0.1:53126 (error 108)
Metrics: {"server-negotiator.queue_time_us":157}
[ OK ] Parameters/TestRpc.RpcPendingConnectionsMetric/SSL_UnixSocket (40 ms)
[ RUN ] Parameters/TestRpc.TestRpcContextClientDeadline/SSL_UnixSocket
I20260925 03:15:06.304745 3324 acceptor_pool.cc:254] collecting diagnostics on the listening RPC socket unix:/tmp/dist-test-taskeYIeGv/test-tmp/rpc-test-0c32c04be9d040729cd069e4b513a3e0.sock every 8 connection(s)
I20260925 03:15:06.305511 3325 acceptor_pool.cc:254] collecting diagnostics on the listening RPC socket unix:/tmp/dist-test-taskeYIeGv/test-tmp/rpc-test-0c32c04be9d040729cd069e4b513a3e0.sock every 8 connection(s)
[ OK ] Parameters/TestRpc.TestRpcContextClientDeadline/SSL_UnixSocket (105 ms)
[ RUN ] Parameters/TestRpc.TestApplicationFeatureFlagUnsupportedServer/SSL_UnixSocket
I20260925 03:15:06.404162 3349 acceptor_pool.cc:254] collecting diagnostics on the listening RPC socket unix:/tmp/dist-test-taskeYIeGv/test-tmp/rpc-test-5e2e7816a4c94cf5b98caddb713d48c1.sock every 8 connection(s)
I20260925 03:15:06.405085 3350 acceptor_pool.cc:254] collecting diagnostics on the listening RPC socket unix:/tmp/dist-test-taskeYIeGv/test-tmp/rpc-test-5e2e7816a4c94cf5b98caddb713d48c1.sock every 8 connection(s)
[ OK ] Parameters/TestRpc.TestApplicationFeatureFlagUnsupportedServer/SSL_UnixSocket (80 ms)
[ RUN ] Parameters/TestRpc.TestCancellationAsync/SSL_UnixSocket
I20260925 03:15:06.487699 3375 acceptor_pool.cc:254] collecting diagnostics on the listening RPC socket unix:/tmp/dist-test-taskeYIeGv/test-tmp/rpc-test-07602a2e24c946938a1aaa5091d26560.sock every 8 connection(s)
I20260925 03:15:06.488679 3376 acceptor_pool.cc:254] collecting diagnostics on the listening RPC socket unix:/tmp/dist-test-taskeYIeGv/test-tmp/rpc-test-07602a2e24c946938a1aaa5091d26560.sock every 8 connection(s)
I20260925 03:15:06.492776 2943 rpc-test.cc:1716] Connecting to unix:/tmp/dist-test-taskeYIeGv/test-tmp/rpc-test-07602a2e24c946938a1aaa5091d26560.sock
I20260925 03:15:06.508908 2943 test_util.cc:268] Using random seed: 528778838
I20260925 03:15:06.761989 3379 rpc-test-base.h:240] got call: sleep_micros: 500 pattern: 4294967295 num_repetitions: 2097152 sidecar_idx: 0
I20260925 03:15:06.968070 3378 rpc-test-base.h:240] got call: sleep_micros: 500 pattern: 4294967295 num_repetitions: 2097152 sidecar_idx: 0
I20260925 03:15:07.222429 3379 rpc-test-base.h:240] got call: sleep_micros: 500 pattern: 4294967295 num_repetitions: 2097152 sidecar_idx: 0
I20260925 03:15:07.445572 3379 rpc-test-base.h:240] got call: sleep_micros: 500 pattern: 4294967295 num_repetitions: 2097152 sidecar_idx: 0
I20260925 03:15:07.670984 3378 rpc-test-base.h:240] got call: sleep_micros: 500 pattern: 4294967295 num_repetitions: 2097152 sidecar_idx: 0
I20260925 03:15:07.924835 3378 rpc-test-base.h:240] got call: sleep_micros: 500 pattern: 4294967295 num_repetitions: 2097152 sidecar_idx: 0
I20260925 03:15:08.155239 3378 rpc-test-base.h:240] got call: sleep_micros: 500 pattern: 4294967295 num_repetitions: 2097152 sidecar_idx: 0
I20260925 03:15:08.392202 3378 rpc-test-base.h:240] got call: sleep_micros: 500 pattern: 4294967295 num_repetitions: 2097152 sidecar_idx: 0
I20260925 03:15:08.618194 3378 rpc-test-base.h:240] got call: sleep_micros: 500 pattern: 4294967295 num_repetitions: 2097152 sidecar_idx: 0
W20260925 03:15:08.643258 3372 connection.cc:196] Error closing socket: Network error: TlsSocket::Close: Broken pipe
W20260925 03:15:08.767153 3372 connection.cc:441] server connection from unix:<unnamed> torn down before Call kudu.rpc.GenericCalculatorService.SleepWithSidecar from unix:<unnamed> (request call id 9) could send its response
[ OK ] Parameters/TestRpc.TestCancellationAsync/SSL_UnixSocket (2319 ms)
[ RUN ] Parameters/TestRpc.TestPerformanceBySocketType/SSL_UnixSocket
I20260925 03:15:08.900550 3401 acceptor_pool.cc:254] collecting diagnostics on the listening RPC socket unix:/tmp/dist-test-taskeYIeGv/test-tmp/rpc-test-6eaaeb5e8d0547dba88a9ee6f0e3adec.sock every 8 connection(s)
I20260925 03:15:08.901456 3402 acceptor_pool.cc:254] collecting diagnostics on the listening RPC socket unix:/tmp/dist-test-taskeYIeGv/test-tmp/rpc-test-6eaaeb5e8d0547dba88a9ee6f0e3adec.sock every 8 connection(s)
I20260925 03:15:08.904883 2943 rpc-test.cc:1846] Connecting to unix:/tmp/dist-test-taskeYIeGv/test-tmp/rpc-test-6eaaeb5e8d0547dba88a9ee6f0e3adec.sock
I20260925 03:15:31.839496 2943 rpc-test.cc:1859] Sending 1024MB via ssl-enabled unix socket: real 22.891s user 21.201s sys 13.993s
I20260925 03:15:54.571269 2943 rpc-test.cc:1859] Sending 1024MB via ssl-enabled unix socket: real 22.731s user 20.884s sys 13.792s
I20260925 03:16:17.308925 2943 rpc-test.cc:1859] Sending 1024MB via ssl-enabled unix socket: real 22.737s user 20.836s sys 13.984s
I20260925 03:16:39.993628 2943 rpc-test.cc:1859] Sending 1024MB via ssl-enabled unix socket: real 22.684s user 20.799s sys 13.911s
I20260925 03:17:02.477276 2943 rpc-test.cc:1859] Sending 1024MB via ssl-enabled unix socket: real 22.483s user 20.601s sys 13.623s
W20260925 03:17:02.484395 3398 connection.cc:196] Error closing socket: Network error: TlsSocket::Close: Broken pipe
[ OK ] Parameters/TestRpc.TestPerformanceBySocketType/SSL_UnixSocket (113721 ms)
[----------] 20 tests from Parameters/TestRpc (290184 ms total)
[----------] 1 test from Parameters/TestRpcSocketTxRxQueue
[ RUN ] Parameters/TestRpcSocketTxRxQueue.AcceptorRxQueueSizeMetric/0
I20260925 03:17:02.517998 3438 acceptor_pool.cc:254] collecting diagnostics on the listening RPC socket 0.0.0.0:40965 every 1 connection(s)
I20260925 03:17:02.518934 3439 acceptor_pool.cc:254] collecting diagnostics on the listening RPC socket 0.0.0.0:40965 every 1 connection(s)
W20260925 03:17:02.524926 3434 negotiation.cc:337] Failed RPC negotiation. Trace:
0925 03:17:02.523459 (+ 0us) reactor.cc:625] Submitting negotiation task for server connection from 127.0.0.1:49276 (local address 127.0.0.1:40965)
0925 03:17:02.523962 (+ 503us) server_negotiation.cc:206] Beginning negotiation
0925 03:17:02.523987 (+ 25us) server_negotiation.cc:399] Waiting for connection header
0925 03:17:02.524223 (+ 236us) negotiation.cc:327] Negotiation complete: Network error: Server connection negotiation failed: server connection from 127.0.0.1:49276: BlockingRecv error: recv got EOF from 127.0.0.1:49276 (error 108)
Metrics: {"server-negotiator.queue_time_us":139}
[ OK ] Parameters/TestRpcSocketTxRxQueue.AcceptorRxQueueSizeMetric/0 (34 ms)
[----------] 1 test from Parameters/TestRpcSocketTxRxQueue (34 ms total)
[----------] Global test environment tear-down
[==========] 21 tests from 2 test suites ran. (290220 ms total)
[ PASSED ] 20 tests.
[ FAILED ] 1 test, listed below:
[ FAILED ] Parameters/TestRpc.TestCallWithChainCertAndChainCA/SSL_UnixSocket, where GetParam() = (true, true)
1 FAILED TEST