Diagnosed failure
Parameters/TestRpc.TestCallWithChainCertAndChainCA/SSL_UnixSocket: /data0/somelongdirectorytoavoidrpathissues/src/kudu/src/kudu/rpc/rpc-test.cc:270: Failure
Failed
Bad status: Runtime error: could not verify certificate chain (error with cert: subject=CN = localhost, ST = sadfjas, C = AS, emailAddress = sdflkdsajf, O = lskdfjlsad, OU = sldfkja, issuer=C = AS, ST = ASDfkjdhf, L = lskdjf, O = saldfja, OU = skdjf, CN = localhost, emailAddress = sadjflkadsj): : certificate has expired
Google Test trace:
/data0/somelongdirectorytoavoidrpathissues/src/kudu/src/kudu/rpc/rpc-test.cc:267: Connecting to unix:/tmp/dist-test-taskUm5w2W/test-tmp/rpc-test-aa68a88d6c354bc690d07b2ca1e38e08.sock
I20260928 02:58:13.955852 23874 test_util.cc:175] -----------------------------------------------
I20260928 02:58:13.956003 23874 test_util.cc:176] Had fatal failures, leaving test files at /tmp/dist-test-taskUm5w2W/test-tmp/rpc-test.6.Parameters_TestRpc.TestCallWithChainCertAndChainCA_SSL_UnixSocket.1790564293835301-23874-0
Full log
Note: This is test shard 7 of 8.
[==========] Running 21 tests from 2 test suites.
[----------] Global test environment set-up.
[----------] 20 tests from Parameters/TestRpc
[ RUN ] Parameters/TestRpc.TestMessengerCreateDestroy/SSL_UnixSocket
WARNING: Logging before InitGoogleLogging() is written to STDERR
I20260928 02:58:13.892427 23874 rpc-test.cc:169] started messenger TestCreateDestroy
[ OK ] Parameters/TestRpc.TestMessengerCreateDestroy/SSL_UnixSocket (39 ms)
[ RUN ] Parameters/TestRpc.TestNegotiationDeadlock/SSL_UnixSocket
I20260928 02:58:13.911772 23894 acceptor_pool.cc:254] collecting diagnostics on the listening RPC socket unix:/tmp/dist-test-taskUm5w2W/test-tmp/rpc-test-575016f888ec458eaa45ec3d30fbbc82.sock every 8 connection(s)
I20260928 02:58:13.912153 23895 acceptor_pool.cc:254] collecting diagnostics on the listening RPC socket unix:/tmp/dist-test-taskUm5w2W/test-tmp/rpc-test-575016f888ec458eaa45ec3d30fbbc82.sock every 8 connection(s)
[ OK ] Parameters/TestRpc.TestNegotiationDeadlock/SSL_UnixSocket (37 ms)
[ RUN ] Parameters/TestRpc.TestCallWithChainCertAndChainCA/SSL_UnixSocket
I20260928 02:58:13.943423 23910 acceptor_pool.cc:254] collecting diagnostics on the listening RPC socket unix:/tmp/dist-test-taskUm5w2W/test-tmp/rpc-test-aa68a88d6c354bc690d07b2ca1e38e08.sock every 8 connection(s)
I20260928 02:58:13.943814 23911 acceptor_pool.cc:254] collecting diagnostics on the listening RPC socket unix:/tmp/dist-test-taskUm5w2W/test-tmp/rpc-test-aa68a88d6c354bc690d07b2ca1e38e08.sock every 8 connection(s)
/data0/somelongdirectorytoavoidrpathissues/src/kudu/src/kudu/rpc/rpc-test.cc:270: Failure
Failed
Bad status: Runtime error: could not verify certificate chain (error with cert: subject=CN = localhost, ST = sadfjas, C = AS, emailAddress = sdflkdsajf, O = lskdfjlsad, OU = sldfkja, issuer=C = AS, ST = ASDfkjdhf, L = lskdjf, O = saldfja, OU = skdjf, CN = localhost, emailAddress = sadjflkadsj): : certificate has expired
Google Test trace:
/data0/somelongdirectorytoavoidrpathissues/src/kudu/src/kudu/rpc/rpc-test.cc:267: Connecting to unix:/tmp/dist-test-taskUm5w2W/test-tmp/rpc-test-aa68a88d6c354bc690d07b2ca1e38e08.sock
I20260928 02:58:13.955852 23874 test_util.cc:175] -----------------------------------------------
I20260928 02:58:13.956003 23874 test_util.cc:176] Had fatal failures, leaving test files at /tmp/dist-test-taskUm5w2W/test-tmp/rpc-test.6.Parameters_TestRpc.TestCallWithChainCertAndChainCA_SSL_UnixSocket.1790564293835301-23874-0
[ FAILED ] Parameters/TestRpc.TestCallWithChainCertAndChainCA/SSL_UnixSocket, where GetParam() = (true, true) (23 ms)
[ RUN ] Parameters/TestRpc.TestCallWithPasswordProtectedKey/SSL_UnixSocket
I20260928 02:58:13.977942 23935 acceptor_pool.cc:254] collecting diagnostics on the listening RPC socket unix:/tmp/dist-test-taskUm5w2W/test-tmp/rpc-test-9a7ec4e066254db6ab48ce89d86a87e3.sock every 8 connection(s)
I20260928 02:58:13.978228 23936 acceptor_pool.cc:254] collecting diagnostics on the listening RPC socket unix:/tmp/dist-test-taskUm5w2W/test-tmp/rpc-test-9a7ec4e066254db6ab48ce89d86a87e3.sock every 8 connection(s)
W20260928 02:58:14.012902 23932 connection.cc:196] Error closing socket: Network error: TlsSocket::Close: Broken pipe
[ OK ] Parameters/TestRpc.TestCallWithPasswordProtectedKey/SSL_UnixSocket (61 ms)
[ RUN ] Parameters/TestRpc.TestCallToBadServer/SSL_UnixSocket
I20260928 02:58:14.035804 23874 rpc-test.cc:394] Status: Network error: Client connection negotiation failed: client connection to 0.0.0.0:0: connect: Connection refused (error 111)
I20260928 02:58:14.036515 23874 rpc-test.cc:394] Status: Network error: Client connection negotiation failed: client connection to 0.0.0.0:0: connect: Connection refused (error 111)
I20260928 02:58:14.037041 23874 rpc-test.cc:394] Status: Network error: Client connection negotiation failed: client connection to 0.0.0.0:0: connect: Connection refused (error 111)
I20260928 02:58:14.037587 23874 rpc-test.cc:394] Status: Network error: Client connection negotiation failed: client connection to 0.0.0.0:0: connect: Connection refused (error 111)
I20260928 02:58:14.038125 23874 rpc-test.cc:394] Status: Network error: Client connection negotiation failed: client connection to 0.0.0.0:0: connect: Connection refused (error 111)
[ OK ] Parameters/TestRpc.TestCallToBadServer/SSL_UnixSocket (23 ms)
[ RUN ] Parameters/TestRpc.TestWrongService/SSL_UnixSocket
I20260928 02:58:14.078593 23970 acceptor_pool.cc:254] collecting diagnostics on the listening RPC socket unix:/tmp/dist-test-taskUm5w2W/test-tmp/rpc-test-81098665bd41410499b547b6114d856f.sock every 8 connection(s)
I20260928 02:58:14.078851 23971 acceptor_pool.cc:254] collecting diagnostics on the listening RPC socket unix:/tmp/dist-test-taskUm5w2W/test-tmp/rpc-test-81098665bd41410499b547b6114d856f.sock every 8 connection(s)
I20260928 02:58:14.107254 23967 messenger.cc:345] service WrongServiceName not registered on TestServer
[ OK ] Parameters/TestRpc.TestWrongService/SSL_UnixSocket (71 ms)
[ RUN ] Parameters/TestRpc.TestConnectionKeepalive/SSL_UnixSocket
I20260928 02:58:14.155421 23993 acceptor_pool.cc:254] collecting diagnostics on the listening RPC socket unix:/tmp/dist-test-taskUm5w2W/test-tmp/rpc-test-470d78e3fe404586b822676bf71697c3.sock every 8 connection(s)
I20260928 02:58:14.155625 23994 acceptor_pool.cc:254] collecting diagnostics on the listening RPC socket unix:/tmp/dist-test-taskUm5w2W/test-tmp/rpc-test-470d78e3fe404586b822676bf71697c3.sock every 8 connection(s)
I20260928 02:58:14.156775 23874 rpc-test.cc:488] Connecting to unix:/tmp/dist-test-taskUm5w2W/test-tmp/rpc-test-470d78e3fe404586b822676bf71697c3.sock
W20260928 02:58:14.614547 24006 connection.cc:196] Error closing socket: Network error: TlsSocket::Close: Broken pipe
[ OK ] Parameters/TestRpc.TestConnectionKeepalive/SSL_UnixSocket (1080 ms)
[ RUN ] Parameters/TestRpc.TestClientConnectionMetrics/SSL_UnixSocket
I20260928 02:58:15.209100 24018 acceptor_pool.cc:254] collecting diagnostics on the listening RPC socket unix:/tmp/dist-test-taskUm5w2W/test-tmp/rpc-test-8fe6f6e1ee7b4e858a1956d937b1c0e4.sock every 8 connection(s)
I20260928 02:58:15.209342 24019 acceptor_pool.cc:254] collecting diagnostics on the listening RPC socket unix:/tmp/dist-test-taskUm5w2W/test-tmp/rpc-test-8fe6f6e1ee7b4e858a1956d937b1c0e4.sock every 8 connection(s)
I20260928 02:58:15.210341 23874 rpc-test.cc:569] Connecting to unix:/tmp/dist-test-taskUm5w2W/test-tmp/rpc-test-8fe6f6e1ee7b4e858a1956d937b1c0e4.sock
W20260928 02:58:39.228781 24015 connection.cc:196] Error closing socket: Network error: TlsSocket::Close: Broken pipe
[ OK ] Parameters/TestRpc.TestClientConnectionMetrics/SSL_UnixSocket (24043 ms)
[ RUN ] Parameters/TestRpc.TestCredentialsPolicy/SSL_UnixSocket
I20260928 02:58:39.250821 24041 acceptor_pool.cc:254] collecting diagnostics on the listening RPC socket unix:/tmp/dist-test-taskUm5w2W/test-tmp/rpc-test-87752b80ef834b9b81fe4138b2b0ec14.sock every 8 connection(s)
I20260928 02:58:39.251034 24042 acceptor_pool.cc:254] collecting diagnostics on the listening RPC socket unix:/tmp/dist-test-taskUm5w2W/test-tmp/rpc-test-87752b80ef834b9b81fe4138b2b0ec14.sock every 8 connection(s)
I20260928 02:58:39.252117 23874 rpc-test.cc:700] Connecting to unix:/tmp/dist-test-taskUm5w2W/test-tmp/rpc-test-87752b80ef834b9b81fe4138b2b0ec14.sock
W20260928 02:58:39.292176 24040 connection.cc:196] Error closing socket: Network error: TlsSocket::Close: Broken pipe
[ OK ] Parameters/TestRpc.TestCredentialsPolicy/SSL_UnixSocket (66 ms)
[ RUN ] Parameters/TestRpc.TestCallLongerThanKeepalive/SSL_UnixSocket
I20260928 02:58:39.311100 24066 acceptor_pool.cc:254] collecting diagnostics on the listening RPC socket unix:/tmp/dist-test-taskUm5w2W/test-tmp/rpc-test-5a4237006a454f29939206a48bf50380.sock every 8 connection(s)
I20260928 02:58:39.311347 24067 acceptor_pool.cc:254] collecting diagnostics on the listening RPC socket unix:/tmp/dist-test-taskUm5w2W/test-tmp/rpc-test-5a4237006a454f29939206a48bf50380.sock every 8 connection(s)
I20260928 02:58:39.331259 24070 rpc-test-base.h:222] got call: sleep_micros: 3000000 deferred: true
I20260928 02:58:42.333314 24070 rpcz_store.cc:275] Call kudu.rpc.GenericCalculatorService.Sleep from unix:<unnamed> (request call id 0) took 3002 ms. Trace:
I20260928 02:58:42.333527 24070 rpcz_store.cc:276] 0928 02:58:39.331136 (+ 0us) service_pool.cc:170] Inserting onto call queue
0928 02:58:39.331198 (+ 62us) service_pool.cc:227] Handling call
0928 02:58:42.333239 (+3002041us) inbound_call.cc:173] Queueing success response
Metrics: {}
[ OK ] Parameters/TestRpc.TestCallLongerThanKeepalive/SSL_UnixSocket (3036 ms)
[ RUN ] Parameters/TestRpc.TestRpcSidecar/SSL_UnixSocket
I20260928 02:58:42.379123 24091 acceptor_pool.cc:254] collecting diagnostics on the listening RPC socket unix:/tmp/dist-test-taskUm5w2W/test-tmp/rpc-test-129348a4ea604c11a41bf04068ed2582.sock every 8 connection(s)
I20260928 02:58:42.379379 24092 acceptor_pool.cc:254] collecting diagnostics on the listening RPC socket unix:/tmp/dist-test-taskUm5w2W/test-tmp/rpc-test-129348a4ea604c11a41bf04068ed2582.sock every 8 connection(s)
W20260928 02:58:42.490123 24088 connection.cc:196] Error closing socket: Network error: TlsSocket::Close: Broken pipe
[ OK ] Parameters/TestRpc.TestRpcSidecar/SSL_UnixSocket (153 ms)
[ RUN ] Parameters/TestRpc.TestRpcSidecarLimits/SSL_UnixSocket
I20260928 02:58:44.891726 24116 acceptor_pool.cc:254] collecting diagnostics on the listening RPC socket unix:/tmp/dist-test-taskUm5w2W/test-tmp/rpc-test-98ac39b2f2b74e4b8fe8c17bd81ff305.sock every 8 connection(s)
I20260928 02:58:44.892032 24117 acceptor_pool.cc:254] collecting diagnostics on the listening RPC socket unix:/tmp/dist-test-taskUm5w2W/test-tmp/rpc-test-98ac39b2f2b74e4b8fe8c17bd81ff305.sock every 8 connection(s)
W20260928 02:58:44.902822 23874 serialization.cc:72] Serialized kudu.rpc_test.PushStringsRequestPB (2147483654 bytes) is larger than the maximum configured RPC message size (52428800 bytes). Sending anyway, but peer may reject the data.
W20260928 02:58:44.908530 24113 connection.cc:535] server connection from unix:<unnamed> recv error: Network error: RPC frame had a length of 2147483714, but we only support messages up to 52428800 bytes long.
W20260928 02:58:44.908681 24113 connection.cc:158] shutting down server connection from unix:<unnamed> with pending inbound data: 4/2147483714 bytes received; last active 0 ns ago: status Network error: RPC frame had a length of 2147483714, but we only support messages up to 52428800 bytes long.
W20260928 02:58:44.909154 24129 connection.cc:196] Error closing socket: Network error: TlsSocket::Close: Broken pipe
I20260928 02:58:44.923216 24141 acceptor_pool.cc:254] collecting diagnostics on the listening RPC socket unix:/tmp/dist-test-taskUm5w2W/test-tmp/rpc-test-98ac39b2f2b74e4b8fe8c17bd81ff305.sock every 8 connection(s)
I20260928 02:58:44.923413 24142 acceptor_pool.cc:254] collecting diagnostics on the listening RPC socket unix:/tmp/dist-test-taskUm5w2W/test-tmp/rpc-test-98ac39b2f2b74e4b8fe8c17bd81ff305.sock every 8 connection(s)
W20260928 02:58:51.241906 24138 connection.cc:577] server connection from unix:<unnamed>: received bad data: 'Corruption: Invalid packet: message had a length of 2147483710, but we only support messages up to 2147483647 bytes
'
W20260928 02:58:51.242630 24154 connection.cc:196] Error closing socket: Network error: TlsSocket::Close: Broken pipe
[ OK ] Parameters/TestRpc.TestRpcSidecarLimits/SSL_UnixSocket (9288 ms)
[ RUN ] Parameters/TestRpc.TestCallTimeoutDoesntAffectNegotiation/SSL_UnixSocket
I20260928 02:58:51.795315 24166 acceptor_pool.cc:254] collecting diagnostics on the listening RPC socket unix:/tmp/dist-test-taskUm5w2W/test-tmp/rpc-test-9056f857dff3457290a29d3595ca6d09.sock every 8 connection(s)
I20260928 02:58:51.795544 24167 acceptor_pool.cc:254] collecting diagnostics on the listening RPC socket unix:/tmp/dist-test-taskUm5w2W/test-tmp/rpc-test-9056f857dff3457290a29d3595ca6d09.sock every 8 connection(s)
W20260928 02:58:51.806671 24162 negotiation.cc:266] Injecting 500ms delay in negotiation
I20260928 02:58:51.857214 23874 rpc-test-base.h:595] status: Timed out: connection negotiation to unix:/tmp/dist-test-taskUm5w2W/test-tmp/rpc-test-9056f857dff3457290a29d3595ca6d09.sock for RPC Sleep timed out after 0.050s (ON_OUTBOUND_QUEUE), seconds elapsed: 0.0511487
[ OK ] Parameters/TestRpc.TestCallTimeoutDoesntAffectNegotiation/SSL_UnixSocket (535 ms)
[ RUN ] Parameters/TestRpc.TestRpcHandlerLatencyMetric/SSL_UnixSocket
I20260928 02:58:52.333310 24191 acceptor_pool.cc:254] collecting diagnostics on the listening RPC socket unix:/tmp/dist-test-taskUm5w2W/test-tmp/rpc-test-d2aa6543c09d43a6a5924c33b92c801d.sock every 8 connection(s)
I20260928 02:58:52.333539 24192 acceptor_pool.cc:254] collecting diagnostics on the listening RPC socket unix:/tmp/dist-test-taskUm5w2W/test-tmp/rpc-test-d2aa6543c09d43a6a5924c33b92c801d.sock every 8 connection(s)
I20260928 02:58:52.375962 23874 rpc-test.cc:1236] Sleep() min lat: 20679
I20260928 02:58:52.376068 23874 rpc-test.cc:1237] Sleep() mean lat: 20679
I20260928 02:58:52.376114 23874 rpc-test.cc:1238] Sleep() max lat: 20679
I20260928 02:58:52.376138 23874 rpc-test.cc:1239] Sleep() #calls: 1
[ OK ] Parameters/TestRpc.TestRpcHandlerLatencyMetric/SSL_UnixSocket (63 ms)
[ RUN ] Parameters/TestRpc.TimedOutOnResponseMetricServiceQueue/SSL_UnixSocket
I20260928 02:58:52.391592 24217 acceptor_pool.cc:254] collecting diagnostics on the listening RPC socket unix:/tmp/dist-test-taskUm5w2W/test-tmp/rpc-test-e06586c885c144288c21e4afcd1889f0.sock every 8 connection(s)
I20260928 02:58:52.391782 24218 acceptor_pool.cc:254] collecting diagnostics on the listening RPC socket unix:/tmp/dist-test-taskUm5w2W/test-tmp/rpc-test-e06586c885c144288c21e4afcd1889f0.sock every 8 connection(s)
W20260928 02:58:52.455435 24219 rpcz_store.cc:267] Call kudu.rpc_test.CalculatorService.Sleep from unix:<unnamed> (request call id 2) took 20 ms (client timeout 20 ms). Trace:
W20260928 02:58:52.455608 24219 rpcz_store.cc:269] 0928 02:58:52.434887 (+ 0us) service_pool.cc:170] Inserting onto call queue
0928 02:58:52.455314 (+ 20427us) service_pool.cc:214] Skipping call since client already timed out
0928 02:58:52.455383 (+ 69us) inbound_call.cc:173] Queueing failure response
Metrics: {}
W20260928 02:58:52.457203 24214 connection.cc:196] Error closing socket: Network error: TlsSocket::Close: Broken pipe
[ OK ] Parameters/TestRpc.TimedOutOnResponseMetricServiceQueue/SSL_UnixSocket (79 ms)
[ RUN ] Parameters/TestRpc.RpcPendingConnectionsMetric/SSL_UnixSocket
I20260928 02:58:52.465385 24240 acceptor_pool.cc:254] collecting diagnostics on the listening RPC socket 0.0.0.0:43725 every 8 connection(s)
I20260928 02:58:52.465607 24241 acceptor_pool.cc:254] collecting diagnostics on the listening RPC socket 0.0.0.0:43725 every 8 connection(s)
W20260928 02:58:52.467795 24236 negotiation.cc:337] Failed RPC negotiation. Trace:
0928 02:58:52.467123 (+ 0us) reactor.cc:625] Submitting negotiation task for server connection from 127.0.0.1:45408 (local address 127.0.0.1:43725)
0928 02:58:52.467275 (+ 152us) server_negotiation.cc:206] Beginning negotiation
0928 02:58:52.467279 (+ 4us) server_negotiation.cc:399] Waiting for connection header
0928 02:58:52.467434 (+ 155us) negotiation.cc:327] Negotiation complete: Network error: Server connection negotiation failed: server connection from 127.0.0.1:45408: BlockingRecv error: recv got EOF from 127.0.0.1:45408 (error 108)
Metrics: {"server-negotiator.queue_time_us":44}
[ OK ] Parameters/TestRpc.RpcPendingConnectionsMetric/SSL_UnixSocket (19 ms)
[ RUN ] Parameters/TestRpc.TestRpcContextClientDeadline/SSL_UnixSocket
I20260928 02:58:52.498833 24256 acceptor_pool.cc:254] collecting diagnostics on the listening RPC socket unix:/tmp/dist-test-taskUm5w2W/test-tmp/rpc-test-3f1a4344fdfd451196a4923191688341.sock every 8 connection(s)
I20260928 02:58:52.499043 24257 acceptor_pool.cc:254] collecting diagnostics on the listening RPC socket unix:/tmp/dist-test-taskUm5w2W/test-tmp/rpc-test-3f1a4344fdfd451196a4923191688341.sock every 8 connection(s)
[ OK ] Parameters/TestRpc.TestRpcContextClientDeadline/SSL_UnixSocket (68 ms)
[ RUN ] Parameters/TestRpc.TestApplicationFeatureFlagUnsupportedServer/SSL_UnixSocket
I20260928 02:58:52.559978 24281 acceptor_pool.cc:254] collecting diagnostics on the listening RPC socket unix:/tmp/dist-test-taskUm5w2W/test-tmp/rpc-test-f21c778f695647c1998f322ef05e674e.sock every 8 connection(s)
I20260928 02:58:52.560204 24282 acceptor_pool.cc:254] collecting diagnostics on the listening RPC socket unix:/tmp/dist-test-taskUm5w2W/test-tmp/rpc-test-f21c778f695647c1998f322ef05e674e.sock every 8 connection(s)
[ OK ] Parameters/TestRpc.TestApplicationFeatureFlagUnsupportedServer/SSL_UnixSocket (45 ms)
[ RUN ] Parameters/TestRpc.TestCancellationAsync/SSL_UnixSocket
I20260928 02:58:52.642995 24306 acceptor_pool.cc:254] collecting diagnostics on the listening RPC socket unix:/tmp/dist-test-taskUm5w2W/test-tmp/rpc-test-359d9fadcf2b4bc9b8663099c78cc38d.sock every 8 connection(s)
I20260928 02:58:52.643210 24307 acceptor_pool.cc:254] collecting diagnostics on the listening RPC socket unix:/tmp/dist-test-taskUm5w2W/test-tmp/rpc-test-359d9fadcf2b4bc9b8663099c78cc38d.sock every 8 connection(s)
I20260928 02:58:52.644332 23874 rpc-test.cc:1716] Connecting to unix:/tmp/dist-test-taskUm5w2W/test-tmp/rpc-test-359d9fadcf2b4bc9b8663099c78cc38d.sock
I20260928 02:58:52.660339 23874 test_util.cc:268] Using random seed: 1056892506
I20260928 02:58:52.707970 24310 rpc-test-base.h:240] got call: sleep_micros: 500 pattern: 4294967295 num_repetitions: 2097152 sidecar_idx: 0
I20260928 02:58:52.741003 24310 rpc-test-base.h:240] got call: sleep_micros: 500 pattern: 4294967295 num_repetitions: 2097152 sidecar_idx: 0
I20260928 02:58:52.773783 24310 rpc-test-base.h:240] got call: sleep_micros: 500 pattern: 4294967295 num_repetitions: 2097152 sidecar_idx: 0
I20260928 02:58:52.807502 24310 rpc-test-base.h:240] got call: sleep_micros: 500 pattern: 4294967295 num_repetitions: 2097152 sidecar_idx: 0
I20260928 02:58:52.841169 24310 rpc-test-base.h:240] got call: sleep_micros: 500 pattern: 4294967295 num_repetitions: 2097152 sidecar_idx: 0
I20260928 02:58:52.874413 24310 rpc-test-base.h:240] got call: sleep_micros: 500 pattern: 4294967295 num_repetitions: 2097152 sidecar_idx: 0
I20260928 02:58:52.908601 24310 rpc-test-base.h:240] got call: sleep_micros: 500 pattern: 4294967295 num_repetitions: 2097152 sidecar_idx: 0
I20260928 02:58:52.941949 24310 rpc-test-base.h:240] got call: sleep_micros: 500 pattern: 4294967295 num_repetitions: 2097152 sidecar_idx: 0
W20260928 02:58:52.944974 24303 connection.cc:196] Error closing socket: Network error: TlsSocket::Close: Broken pipe
W20260928 02:58:52.974896 24303 connection.cc:441] server connection from unix:<unnamed> torn down before Call kudu.rpc.GenericCalculatorService.SleepWithSidecar from unix:<unnamed> (request call id 9) could send its response
[ OK ] Parameters/TestRpc.TestCancellationAsync/SSL_UnixSocket (384 ms)
[ RUN ] Parameters/TestRpc.TestPerformanceBySocketType/SSL_UnixSocket
I20260928 02:58:53.010257 24331 acceptor_pool.cc:254] collecting diagnostics on the listening RPC socket unix:/tmp/dist-test-taskUm5w2W/test-tmp/rpc-test-a5b5d9488223452a9c271c5c8ad074fa.sock every 8 connection(s)
I20260928 02:58:53.010558 24332 acceptor_pool.cc:254] collecting diagnostics on the listening RPC socket unix:/tmp/dist-test-taskUm5w2W/test-tmp/rpc-test-a5b5d9488223452a9c271c5c8ad074fa.sock every 8 connection(s)
I20260928 02:58:53.011581 23874 rpc-test.cc:1846] Connecting to unix:/tmp/dist-test-taskUm5w2W/test-tmp/rpc-test-a5b5d9488223452a9c271c5c8ad074fa.sock
I20260928 02:58:56.668605 23874 rpc-test.cc:1859] Sending 1024MB via ssl-enabled unix socket: real 3.630s user 3.501s sys 2.548s
I20260928 02:59:00.132217 23874 rpc-test.cc:1859] Sending 1024MB via ssl-enabled unix socket: real 3.463s user 3.188s sys 2.549s
I20260928 02:59:03.690168 23874 rpc-test.cc:1859] Sending 1024MB via ssl-enabled unix socket: real 3.558s user 3.393s sys 2.506s
I20260928 02:59:07.184643 23874 rpc-test.cc:1859] Sending 1024MB via ssl-enabled unix socket: real 3.494s user 3.285s sys 2.513s
I20260928 02:59:10.689132 23874 rpc-test.cc:1859] Sending 1024MB via ssl-enabled unix socket: real 3.504s user 3.299s sys 2.489s
W20260928 02:59:10.690371 24328 connection.cc:196] Error closing socket: Network error: TlsSocket::Close: Broken pipe
[ OK ] Parameters/TestRpc.TestPerformanceBySocketType/SSL_UnixSocket (17717 ms)
[----------] 20 tests from Parameters/TestRpc (56839 ms total)
[----------] 1 test from Parameters/TestRpcSocketTxRxQueue
[ RUN ] Parameters/TestRpcSocketTxRxQueue.AcceptorRxQueueSizeMetric/0
I20260928 02:59:10.705572 24356 acceptor_pool.cc:254] collecting diagnostics on the listening RPC socket 0.0.0.0:39179 every 1 connection(s)
I20260928 02:59:10.705806 24357 acceptor_pool.cc:254] collecting diagnostics on the listening RPC socket 0.0.0.0:39179 every 1 connection(s)
W20260928 02:59:10.707743 24352 negotiation.cc:337] Failed RPC negotiation. Trace:
0928 02:59:10.707288 (+ 0us) reactor.cc:625] Submitting negotiation task for server connection from 127.0.0.1:43018 (local address 127.0.0.1:39179)
0928 02:59:10.707455 (+ 167us) server_negotiation.cc:206] Beginning negotiation
0928 02:59:10.707461 (+ 6us) server_negotiation.cc:399] Waiting for connection header
0928 02:59:10.707601 (+ 140us) negotiation.cc:327] Negotiation complete: Network error: Server connection negotiation failed: server connection from 127.0.0.1:43018: BlockingRecv error: recv got EOF from 127.0.0.1:43018 (error 108)
Metrics: {"server-negotiator.queue_time_us":49}
[ OK ] Parameters/TestRpcSocketTxRxQueue.AcceptorRxQueueSizeMetric/0 (15 ms)
[----------] 1 test from Parameters/TestRpcSocketTxRxQueue (15 ms total)
[----------] Global test environment tear-down
[==========] 21 tests from 2 test suites ran. (56855 ms total)
[ PASSED ] 20 tests.
[ FAILED ] 1 test, listed below:
[ FAILED ] Parameters/TestRpc.TestCallWithChainCertAndChainCA/SSL_UnixSocket, where GetParam() = (true, true)
1 FAILED TEST