Diagnosed failure
Parameters/TestRpc.TestCallWithChainCertAndChainCA/SSL_UnixSocket: /data0/somelongdirectorytoavoidrpathissues/src/kudu/src/kudu/rpc/rpc-test.cc:270: Failure
Failed
Bad status: Runtime error: could not verify certificate chain (error with cert: subject=CN = localhost, ST = sadfjas, C = AS, emailAddress = sdflkdsajf, O = lskdfjlsad, OU = sldfkja, issuer=C = AS, ST = ASDfkjdhf, L = lskdjf, O = saldfja, OU = skdjf, CN = localhost, emailAddress = sadjflkadsj): : certificate has expired
Google Test trace:
/data0/somelongdirectorytoavoidrpathissues/src/kudu/src/kudu/rpc/rpc-test.cc:267: Connecting to unix:/tmp/dist-test-taskopR2ya/test-tmp/rpc-test-ac8637585e6c4f20b492bedc5a7518a5.sock
I20260928 23:54:44.764575 13414 test_util.cc:175] -----------------------------------------------
I20260928 23:54:44.764747 13414 test_util.cc:176] Had fatal failures, leaving test files at /tmp/dist-test-taskopR2ya/test-tmp/rpc-test.6.Parameters_TestRpc.TestCallWithChainCertAndChainCA_SSL_UnixSocket.1790639683501372-13414-0
Full log
Note: This is test shard 7 of 8.
[==========] Running 21 tests from 2 test suites.
[----------] Global test environment set-up.
[----------] 20 tests from Parameters/TestRpc
[ RUN ] Parameters/TestRpc.TestMessengerCreateDestroy/SSL_UnixSocket
WARNING: Logging before InitGoogleLogging() is written to STDERR
I20260928 23:54:43.597678 13414 rpc-test.cc:169] started messenger TestCreateDestroy
[ OK ] Parameters/TestRpc.TestMessengerCreateDestroy/SSL_UnixSocket (1076 ms)
[ RUN ] Parameters/TestRpc.TestNegotiationDeadlock/SSL_UnixSocket
I20260928 23:54:44.661197 13436 acceptor_pool.cc:254] collecting diagnostics on the listening RPC socket unix:/tmp/dist-test-taskopR2ya/test-tmp/rpc-test-10272fbb61364e109d502b8bc8731a58.sock every 8 connection(s)
I20260928 23:54:44.662566 13437 acceptor_pool.cc:254] collecting diagnostics on the listening RPC socket unix:/tmp/dist-test-taskopR2ya/test-tmp/rpc-test-10272fbb61364e109d502b8bc8731a58.sock every 8 connection(s)
[ OK ] Parameters/TestRpc.TestNegotiationDeadlock/SSL_UnixSocket (78 ms)
[ RUN ] Parameters/TestRpc.TestCallWithChainCertAndChainCA/SSL_UnixSocket
I20260928 23:54:44.737470 13452 acceptor_pool.cc:254] collecting diagnostics on the listening RPC socket unix:/tmp/dist-test-taskopR2ya/test-tmp/rpc-test-ac8637585e6c4f20b492bedc5a7518a5.sock every 8 connection(s)
I20260928 23:54:44.739506 13453 acceptor_pool.cc:254] collecting diagnostics on the listening RPC socket unix:/tmp/dist-test-taskopR2ya/test-tmp/rpc-test-ac8637585e6c4f20b492bedc5a7518a5.sock every 8 connection(s)
/data0/somelongdirectorytoavoidrpathissues/src/kudu/src/kudu/rpc/rpc-test.cc:270: Failure
Failed
Bad status: Runtime error: could not verify certificate chain (error with cert: subject=CN = localhost, ST = sadfjas, C = AS, emailAddress = sdflkdsajf, O = lskdfjlsad, OU = sldfkja, issuer=C = AS, ST = ASDfkjdhf, L = lskdjf, O = saldfja, OU = skdjf, CN = localhost, emailAddress = sadjflkadsj): : certificate has expired
Google Test trace:
/data0/somelongdirectorytoavoidrpathissues/src/kudu/src/kudu/rpc/rpc-test.cc:267: Connecting to unix:/tmp/dist-test-taskopR2ya/test-tmp/rpc-test-ac8637585e6c4f20b492bedc5a7518a5.sock
I20260928 23:54:44.764575 13414 test_util.cc:175] -----------------------------------------------
I20260928 23:54:44.764747 13414 test_util.cc:176] Had fatal failures, leaving test files at /tmp/dist-test-taskopR2ya/test-tmp/rpc-test.6.Parameters_TestRpc.TestCallWithChainCertAndChainCA_SSL_UnixSocket.1790639683501372-13414-0
[ FAILED ] Parameters/TestRpc.TestCallWithChainCertAndChainCA/SSL_UnixSocket, where GetParam() = (true, true) (55 ms)
[ RUN ] Parameters/TestRpc.TestCallWithPasswordProtectedKey/SSL_UnixSocket
I20260928 23:54:44.796375 13477 acceptor_pool.cc:254] collecting diagnostics on the listening RPC socket unix:/tmp/dist-test-taskopR2ya/test-tmp/rpc-test-3f2f301781ca4d29a2b573dfcbea3b87.sock every 8 connection(s)
I20260928 23:54:44.797045 13478 acceptor_pool.cc:254] collecting diagnostics on the listening RPC socket unix:/tmp/dist-test-taskopR2ya/test-tmp/rpc-test-3f2f301781ca4d29a2b573dfcbea3b87.sock every 8 connection(s)
W20260928 23:54:44.836190 13474 connection.cc:196] Error closing socket: Network error: TlsSocket::Close: Broken pipe
[ OK ] Parameters/TestRpc.TestCallWithPasswordProtectedKey/SSL_UnixSocket (76 ms)
[ RUN ] Parameters/TestRpc.TestCallToBadServer/SSL_UnixSocket
I20260928 23:54:44.877451 13414 rpc-test.cc:394] Status: Network error: Client connection negotiation failed: client connection to 0.0.0.0:0: connect: Connection refused (error 111)
I20260928 23:54:44.878664 13414 rpc-test.cc:394] Status: Network error: Client connection negotiation failed: client connection to 0.0.0.0:0: connect: Connection refused (error 111)
I20260928 23:54:44.879876 13414 rpc-test.cc:394] Status: Network error: Client connection negotiation failed: client connection to 0.0.0.0:0: connect: Connection refused (error 111)
I20260928 23:54:44.881038 13414 rpc-test.cc:394] Status: Network error: Client connection negotiation failed: client connection to 0.0.0.0:0: connect: Connection refused (error 111)
I20260928 23:54:44.882176 13414 rpc-test.cc:394] Status: Network error: Client connection negotiation failed: client connection to 0.0.0.0:0: connect: Connection refused (error 111)
[ OK ] Parameters/TestRpc.TestCallToBadServer/SSL_UnixSocket (42 ms)
[ RUN ] Parameters/TestRpc.TestWrongService/SSL_UnixSocket
I20260928 23:54:44.902705 13512 acceptor_pool.cc:254] collecting diagnostics on the listening RPC socket unix:/tmp/dist-test-taskopR2ya/test-tmp/rpc-test-5a1c42565c104ec4aea9910227d9a872.sock every 8 connection(s)
I20260928 23:54:44.903509 13513 acceptor_pool.cc:254] collecting diagnostics on the listening RPC socket unix:/tmp/dist-test-taskopR2ya/test-tmp/rpc-test-5a1c42565c104ec4aea9910227d9a872.sock every 8 connection(s)
I20260928 23:54:44.938266 13509 messenger.cc:345] service WrongServiceName not registered on TestServer
[ OK ] Parameters/TestRpc.TestWrongService/SSL_UnixSocket (60 ms)
[ RUN ] Parameters/TestRpc.TestConnectionKeepalive/SSL_UnixSocket
I20260928 23:54:44.971266 13535 acceptor_pool.cc:254] collecting diagnostics on the listening RPC socket unix:/tmp/dist-test-taskopR2ya/test-tmp/rpc-test-d7b27235930744c1bec5cf1ab1933562.sock every 8 connection(s)
I20260928 23:54:44.971959 13536 acceptor_pool.cc:254] collecting diagnostics on the listening RPC socket unix:/tmp/dist-test-taskopR2ya/test-tmp/rpc-test-d7b27235930744c1bec5cf1ab1933562.sock every 8 connection(s)
I20260928 23:54:44.975049 13414 rpc-test.cc:488] Connecting to unix:/tmp/dist-test-taskopR2ya/test-tmp/rpc-test-d7b27235930744c1bec5cf1ab1933562.sock
W20260928 23:54:45.449357 13548 connection.cc:196] Error closing socket: Network error: TlsSocket::Close: Broken pipe
[ OK ] Parameters/TestRpc.TestConnectionKeepalive/SSL_UnixSocket (1070 ms)
[ RUN ] Parameters/TestRpc.TestClientConnectionMetrics/SSL_UnixSocket
I20260928 23:54:46.040424 13560 acceptor_pool.cc:254] collecting diagnostics on the listening RPC socket unix:/tmp/dist-test-taskopR2ya/test-tmp/rpc-test-0644fb6718e140d8b47a3fd3ff87da02.sock every 8 connection(s)
I20260928 23:54:46.041105 13561 acceptor_pool.cc:254] collecting diagnostics on the listening RPC socket unix:/tmp/dist-test-taskopR2ya/test-tmp/rpc-test-0644fb6718e140d8b47a3fd3ff87da02.sock every 8 connection(s)
I20260928 23:54:46.044107 13414 rpc-test.cc:569] Connecting to unix:/tmp/dist-test-taskopR2ya/test-tmp/rpc-test-0644fb6718e140d8b47a3fd3ff87da02.sock
W20260928 23:56:54.221086 13557 connection.cc:196] Error closing socket: Network error: TlsSocket::Close: Broken pipe
[ OK ] Parameters/TestRpc.TestClientConnectionMetrics/SSL_UnixSocket (128212 ms)
[ RUN ] Parameters/TestRpc.TestCredentialsPolicy/SSL_UnixSocket
I20260928 23:56:54.256670 13596 acceptor_pool.cc:254] collecting diagnostics on the listening RPC socket unix:/tmp/dist-test-taskopR2ya/test-tmp/rpc-test-b7851545d21244f2a43c6d625ce335f3.sock every 8 connection(s)
I20260928 23:56:54.257493 13597 acceptor_pool.cc:254] collecting diagnostics on the listening RPC socket unix:/tmp/dist-test-taskopR2ya/test-tmp/rpc-test-b7851545d21244f2a43c6d625ce335f3.sock every 8 connection(s)
I20260928 23:56:54.260659 13414 rpc-test.cc:700] Connecting to unix:/tmp/dist-test-taskopR2ya/test-tmp/rpc-test-b7851545d21244f2a43c6d625ce335f3.sock
W20260928 23:56:54.299340 13595 connection.cc:196] Error closing socket: Network error: TlsSocket::Close: Broken pipe
[ OK ] Parameters/TestRpc.TestCredentialsPolicy/SSL_UnixSocket (89 ms)
[ RUN ] Parameters/TestRpc.TestCallLongerThanKeepalive/SSL_UnixSocket
I20260928 23:56:54.339006 13621 acceptor_pool.cc:254] collecting diagnostics on the listening RPC socket unix:/tmp/dist-test-taskopR2ya/test-tmp/rpc-test-1396c9c768384122920d4a01c34fb5b1.sock every 8 connection(s)
I20260928 23:56:54.339730 13622 acceptor_pool.cc:254] collecting diagnostics on the listening RPC socket unix:/tmp/dist-test-taskopR2ya/test-tmp/rpc-test-1396c9c768384122920d4a01c34fb5b1.sock every 8 connection(s)
I20260928 23:56:54.376754 13625 rpc-test-base.h:222] got call: sleep_micros: 3000000 deferred: true
I20260928 23:56:57.381138 13625 rpcz_store.cc:275] Call kudu.rpc.GenericCalculatorService.Sleep from unix:<unnamed> (request call id 0) took 3004 ms. Trace:
I20260928 23:56:57.381424 13625 rpcz_store.cc:276] 0928 23:56:54.376594 (+ 0us) service_pool.cc:170] Inserting onto call queue
0928 23:56:54.376696 (+ 102us) service_pool.cc:227] Handling call
0928 23:56:57.381057 (+3004361us) inbound_call.cc:173] Queueing success response
Metrics: {}
W20260928 23:56:57.385061 13618 connection.cc:196] Error closing socket: Network error: TlsSocket::Close: Broken pipe
[ OK ] Parameters/TestRpc.TestCallLongerThanKeepalive/SSL_UnixSocket (3071 ms)
[ RUN ] Parameters/TestRpc.TestRpcSidecar/SSL_UnixSocket
I20260928 23:56:57.413646 13646 acceptor_pool.cc:254] collecting diagnostics on the listening RPC socket unix:/tmp/dist-test-taskopR2ya/test-tmp/rpc-test-8f79cd31aff144ba84bf8c470d622de7.sock every 8 connection(s)
I20260928 23:56:57.414336 13647 acceptor_pool.cc:254] collecting diagnostics on the listening RPC socket unix:/tmp/dist-test-taskopR2ya/test-tmp/rpc-test-8f79cd31aff144ba84bf8c470d622de7.sock every 8 connection(s)
W20260928 23:56:57.895015 13643 connection.cc:196] Error closing socket: Network error: TlsSocket::Close: Broken pipe
[ OK ] Parameters/TestRpc.TestRpcSidecar/SSL_UnixSocket (509 ms)
[ RUN ] Parameters/TestRpc.TestRpcSidecarLimits/SSL_UnixSocket
I20260928 23:57:14.516525 13673 acceptor_pool.cc:254] collecting diagnostics on the listening RPC socket unix:/tmp/dist-test-taskopR2ya/test-tmp/rpc-test-4997cc4e6b864e99b3ee1b253d92d6eb.sock every 8 connection(s)
I20260928 23:57:14.517222 13674 acceptor_pool.cc:254] collecting diagnostics on the listening RPC socket unix:/tmp/dist-test-taskopR2ya/test-tmp/rpc-test-4997cc4e6b864e99b3ee1b253d92d6eb.sock every 8 connection(s)
W20260928 23:57:14.543032 13414 serialization.cc:72] Serialized kudu.rpc_test.PushStringsRequestPB (2147483654 bytes) is larger than the maximum configured RPC message size (52428800 bytes). Sending anyway, but peer may reject the data.
W20260928 23:57:14.552537 13670 connection.cc:535] server connection from unix:<unnamed> recv error: Network error: RPC frame had a length of 2147483714, but we only support messages up to 52428800 bytes long.
W20260928 23:57:14.552855 13670 connection.cc:158] shutting down server connection from unix:<unnamed> with pending inbound data: 4/2147483714 bytes received; last active 0 ns ago: status Network error: RPC frame had a length of 2147483714, but we only support messages up to 52428800 bytes long.
W20260928 23:57:14.553719 13686 connection.cc:698] client connection to unix:/tmp/dist-test-taskopR2ya/test-tmp/rpc-test-4997cc4e6b864e99b3ee1b253d92d6eb.sock send error: Network error: failed to write to TLS socket: Broken pipe
W20260928 23:57:14.554239 13686 connection.cc:196] Error closing socket: Network error: TlsSocket::Close: Success
[ OK ] Parameters/TestRpc.TestRpcSidecarLimits/SSL_UnixSocket (17236 ms)
[ RUN ] Parameters/TestRpc.TestCallTimeoutDoesntAffectNegotiation/SSL_UnixSocket
I20260928 23:57:15.182487 13698 acceptor_pool.cc:254] collecting diagnostics on the listening RPC socket unix:/tmp/dist-test-taskopR2ya/test-tmp/rpc-test-a25db14e991b4284a52709a86053e871.sock every 8 connection(s)
I20260928 23:57:15.183199 13699 acceptor_pool.cc:254] collecting diagnostics on the listening RPC socket unix:/tmp/dist-test-taskopR2ya/test-tmp/rpc-test-a25db14e991b4284a52709a86053e871.sock every 8 connection(s)
W20260928 23:57:15.202626 13694 negotiation.cc:266] Injecting 500ms delay in negotiation
I20260928 23:57:15.253222 13414 rpc-test-base.h:595] status: Timed out: connection negotiation to unix:/tmp/dist-test-taskopR2ya/test-tmp/rpc-test-a25db14e991b4284a52709a86053e871.sock for RPC Sleep timed out after 0.050s (ON_OUTBOUND_QUEUE), seconds elapsed: 0.0514422
W20260928 23:57:15.714327 13695 connection.cc:196] Error closing socket: Network error: TlsSocket::Close: Broken pipe
[ OK ] Parameters/TestRpc.TestCallTimeoutDoesntAffectNegotiation/SSL_UnixSocket (581 ms)
[ RUN ] Parameters/TestRpc.TestRpcHandlerLatencyMetric/SSL_UnixSocket
I20260928 23:57:15.754390 13723 acceptor_pool.cc:254] collecting diagnostics on the listening RPC socket unix:/tmp/dist-test-taskopR2ya/test-tmp/rpc-test-a551b5d3e4eb4bf8a085ba1148cccaf1.sock every 8 connection(s)
I20260928 23:57:15.755064 13724 acceptor_pool.cc:254] collecting diagnostics on the listening RPC socket unix:/tmp/dist-test-taskopR2ya/test-tmp/rpc-test-a551b5d3e4eb4bf8a085ba1148cccaf1.sock every 8 connection(s)
I20260928 23:57:15.823211 13414 rpc-test.cc:1236] Sleep() min lat: 21542
I20260928 23:57:15.823406 13414 rpc-test.cc:1237] Sleep() mean lat: 21542
I20260928 23:57:15.823535 13414 rpc-test.cc:1238] Sleep() max lat: 21542
I20260928 23:57:15.823647 13414 rpc-test.cc:1239] Sleep() #calls: 1
[ OK ] Parameters/TestRpc.TestRpcHandlerLatencyMetric/SSL_UnixSocket (112 ms)
[ RUN ] Parameters/TestRpc.TimedOutOnResponseMetricServiceQueue/SSL_UnixSocket
I20260928 23:57:15.860387 13749 acceptor_pool.cc:254] collecting diagnostics on the listening RPC socket unix:/tmp/dist-test-taskopR2ya/test-tmp/rpc-test-c38cf18d15114170925df454819917b3.sock every 8 connection(s)
I20260928 23:57:15.861076 13750 acceptor_pool.cc:254] collecting diagnostics on the listening RPC socket unix:/tmp/dist-test-taskopR2ya/test-tmp/rpc-test-c38cf18d15114170925df454819917b3.sock every 8 connection(s)
W20260928 23:57:15.933254 13751 rpcz_store.cc:267] Call kudu.rpc_test.CalculatorService.Sleep from unix:<unnamed> (request call id 2) took 20 ms (client timeout 20 ms). Trace:
W20260928 23:57:15.933655 13751 rpcz_store.cc:269] 0928 23:57:15.912672 (+ 0us) service_pool.cc:170] Inserting onto call queue
0928 23:57:15.933072 (+ 20400us) service_pool.cc:214] Skipping call since client already timed out
0928 23:57:15.933191 (+ 119us) inbound_call.cc:173] Queueing failure response
Metrics: {}
[ OK ] Parameters/TestRpc.TimedOutOnResponseMetricServiceQueue/SSL_UnixSocket (109 ms)
[ RUN ] Parameters/TestRpc.RpcPendingConnectionsMetric/SSL_UnixSocket
I20260928 23:57:15.950013 13772 acceptor_pool.cc:254] collecting diagnostics on the listening RPC socket 0.0.0.0:33565 every 8 connection(s)
I20260928 23:57:15.950666 13773 acceptor_pool.cc:254] collecting diagnostics on the listening RPC socket 0.0.0.0:33565 every 8 connection(s)
W20260928 23:57:15.955598 13768 negotiation.cc:337] Failed RPC negotiation. Trace:
0928 23:57:15.954367 (+ 0us) reactor.cc:625] Submitting negotiation task for server connection from 127.0.0.1:50814 (local address 127.0.0.1:33565)
0928 23:57:15.954755 (+ 388us) server_negotiation.cc:206] Beginning negotiation
0928 23:57:15.954772 (+ 17us) server_negotiation.cc:399] Waiting for connection header
0928 23:57:15.955051 (+ 279us) negotiation.cc:327] Negotiation complete: Network error: Server connection negotiation failed: server connection from 127.0.0.1:50814: BlockingRecv error: recv got EOF from 127.0.0.1:50814 (error 108)
Metrics: {"server-negotiator.queue_time_us":98}
[ OK ] Parameters/TestRpc.RpcPendingConnectionsMetric/SSL_UnixSocket (28 ms)
[ RUN ] Parameters/TestRpc.TestRpcContextClientDeadline/SSL_UnixSocket
I20260928 23:57:15.997143 13788 acceptor_pool.cc:254] collecting diagnostics on the listening RPC socket unix:/tmp/dist-test-taskopR2ya/test-tmp/rpc-test-a78ec83ccb21426fb33e3020ebac5b38.sock every 8 connection(s)
I20260928 23:57:15.997809 13789 acceptor_pool.cc:254] collecting diagnostics on the listening RPC socket unix:/tmp/dist-test-taskopR2ya/test-tmp/rpc-test-a78ec83ccb21426fb33e3020ebac5b38.sock every 8 connection(s)
W20260928 23:57:16.068656 13785 connection.cc:196] Error closing socket: Network error: TlsSocket::Close: Broken pipe
[ OK ] Parameters/TestRpc.TestRpcContextClientDeadline/SSL_UnixSocket (104 ms)
[ RUN ] Parameters/TestRpc.TestApplicationFeatureFlagUnsupportedServer/SSL_UnixSocket
I20260928 23:57:16.100746 13813 acceptor_pool.cc:254] collecting diagnostics on the listening RPC socket unix:/tmp/dist-test-taskopR2ya/test-tmp/rpc-test-0d381fd0b2204ca8895b21bd5da02ffc.sock every 8 connection(s)
I20260928 23:57:16.101491 13814 acceptor_pool.cc:254] collecting diagnostics on the listening RPC socket unix:/tmp/dist-test-taskopR2ya/test-tmp/rpc-test-0d381fd0b2204ca8895b21bd5da02ffc.sock every 8 connection(s)
W20260928 23:57:16.136291 13810 connection.cc:196] Error closing socket: Network error: TlsSocket::Close: Broken pipe
[ OK ] Parameters/TestRpc.TestApplicationFeatureFlagUnsupportedServer/SSL_UnixSocket (67 ms)
[ RUN ] Parameters/TestRpc.TestCancellationAsync/SSL_UnixSocket
I20260928 23:57:16.170390 13838 acceptor_pool.cc:254] collecting diagnostics on the listening RPC socket unix:/tmp/dist-test-taskopR2ya/test-tmp/rpc-test-d1137c9e848f46d3b083094dca4a6ec5.sock every 8 connection(s)
I20260928 23:57:16.171070 13839 acceptor_pool.cc:254] collecting diagnostics on the listening RPC socket unix:/tmp/dist-test-taskopR2ya/test-tmp/rpc-test-d1137c9e848f46d3b083094dca4a6ec5.sock every 8 connection(s)
I20260928 23:57:16.174021 13414 rpc-test.cc:1716] Connecting to unix:/tmp/dist-test-taskopR2ya/test-tmp/rpc-test-d1137c9e848f46d3b083094dca4a6ec5.sock
I20260928 23:57:16.205847 13414 test_util.cc:268] Using random seed: -748973311
I20260928 23:57:16.423699 13842 rpc-test-base.h:240] got call: sleep_micros: 500 pattern: 4294967295 num_repetitions: 2097152 sidecar_idx: 0
I20260928 23:57:16.630647 13842 rpc-test-base.h:240] got call: sleep_micros: 500 pattern: 4294967295 num_repetitions: 2097152 sidecar_idx: 0
I20260928 23:57:16.815266 13841 rpc-test-base.h:240] got call: sleep_micros: 500 pattern: 4294967295 num_repetitions: 2097152 sidecar_idx: 0
I20260928 23:57:17.039149 13842 rpc-test-base.h:240] got call: sleep_micros: 500 pattern: 4294967295 num_repetitions: 2097152 sidecar_idx: 0
I20260928 23:57:17.247079 13842 rpc-test-base.h:240] got call: sleep_micros: 500 pattern: 4294967295 num_repetitions: 2097152 sidecar_idx: 0
I20260928 23:57:17.459538 13842 rpc-test-base.h:240] got call: sleep_micros: 500 pattern: 4294967295 num_repetitions: 2097152 sidecar_idx: 0
I20260928 23:57:17.659881 13842 rpc-test-base.h:240] got call: sleep_micros: 500 pattern: 4294967295 num_repetitions: 2097152 sidecar_idx: 0
I20260928 23:57:17.845810 13841 rpc-test-base.h:240] got call: sleep_micros: 500 pattern: 4294967295 num_repetitions: 2097152 sidecar_idx: 0
I20260928 23:57:18.062700 13841 rpc-test-base.h:240] got call: sleep_micros: 500 pattern: 4294967295 num_repetitions: 2097152 sidecar_idx: 0
W20260928 23:57:18.077337 13835 connection.cc:196] Error closing socket: Network error: TlsSocket::Close: Broken pipe
W20260928 23:57:18.194798 13835 connection.cc:441] server connection from unix:<unnamed> torn down before Call kudu.rpc.GenericCalculatorService.SleepWithSidecar from unix:<unnamed> (request call id 9) could send its response
[ OK ] Parameters/TestRpc.TestCancellationAsync/SSL_UnixSocket (2062 ms)
[ RUN ] Parameters/TestRpc.TestPerformanceBySocketType/SSL_UnixSocket
I20260928 23:57:18.284052 13863 acceptor_pool.cc:254] collecting diagnostics on the listening RPC socket unix:/tmp/dist-test-taskopR2ya/test-tmp/rpc-test-7a87aa42b9da47bd9be4914cf7d96bb1.sock every 8 connection(s)
I20260928 23:57:18.284721 13864 acceptor_pool.cc:254] collecting diagnostics on the listening RPC socket unix:/tmp/dist-test-taskopR2ya/test-tmp/rpc-test-7a87aa42b9da47bd9be4914cf7d96bb1.sock every 8 connection(s)
I20260928 23:57:18.287649 13414 rpc-test.cc:1846] Connecting to unix:/tmp/dist-test-taskopR2ya/test-tmp/rpc-test-7a87aa42b9da47bd9be4914cf7d96bb1.sock
I20260928 23:57:38.974223 13414 rpc-test.cc:1859] Sending 1024MB via ssl-enabled unix socket: real 20.665s user 18.484s sys 12.426s
I20260928 23:57:59.420564 13414 rpc-test.cc:1859] Sending 1024MB via ssl-enabled unix socket: real 20.446s user 18.325s sys 12.144s
I20260928 23:58:19.793404 13414 rpc-test.cc:1859] Sending 1024MB via ssl-enabled unix socket: real 20.372s user 18.054s sys 12.210s
I20260928 23:58:40.141983 13414 rpc-test.cc:1859] Sending 1024MB via ssl-enabled unix socket: real 20.348s user 18.259s sys 12.029s
I20260928 23:59:00.534430 13414 rpc-test.cc:1859] Sending 1024MB via ssl-enabled unix socket: real 20.392s user 18.503s sys 11.851s
W20260928 23:59:00.539563 13860 connection.cc:196] Error closing socket: Network error: TlsSocket::Close: Broken pipe
[ OK ] Parameters/TestRpc.TestPerformanceBySocketType/SSL_UnixSocket (102346 ms)
[----------] 20 tests from Parameters/TestRpc (256997 ms total)
[----------] 1 test from Parameters/TestRpcSocketTxRxQueue
[ RUN ] Parameters/TestRpcSocketTxRxQueue.AcceptorRxQueueSizeMetric/0
I20260928 23:59:00.561108 13898 acceptor_pool.cc:254] collecting diagnostics on the listening RPC socket 0.0.0.0:37725 every 1 connection(s)
I20260928 23:59:00.561899 13899 acceptor_pool.cc:254] collecting diagnostics on the listening RPC socket 0.0.0.0:37725 every 1 connection(s)
W20260928 23:59:00.566875 13894 negotiation.cc:337] Failed RPC negotiation. Trace:
0928 23:59:00.565517 (+ 0us) reactor.cc:625] Submitting negotiation task for server connection from 127.0.0.1:36380 (local address 127.0.0.1:37725)
0928 23:59:00.565976 (+ 459us) server_negotiation.cc:206] Beginning negotiation
0928 23:59:00.566000 (+ 24us) server_negotiation.cc:399] Waiting for connection header
0928 23:59:00.566223 (+ 223us) negotiation.cc:327] Negotiation complete: Network error: Server connection negotiation failed: server connection from 127.0.0.1:36380: BlockingRecv error: recv got EOF from 127.0.0.1:36380 (error 108)
Metrics: {"server-negotiator.queue_time_us":107}
[ OK ] Parameters/TestRpcSocketTxRxQueue.AcceptorRxQueueSizeMetric/0 (22 ms)
[----------] 1 test from Parameters/TestRpcSocketTxRxQueue (22 ms total)
[----------] Global test environment tear-down
[==========] 21 tests from 2 test suites ran. (257021 ms total)
[ PASSED ] 20 tests.
[ FAILED ] 1 test, listed below:
[ FAILED ] Parameters/TestRpc.TestCallWithChainCertAndChainCA/SSL_UnixSocket, where GetParam() = (true, true)
1 FAILED TEST