Diagnosed failure
Parameters/TestRpc.TestCallWithChainCertAndChainCA/SSL_TCP: /data0/somelongdirectorytoavoidrpathissues/src/kudu/src/kudu/rpc/rpc-test.cc:270: Failure
Failed
Bad status: Runtime error: could not verify certificate chain (error with cert: subject=CN = localhost, ST = sadfjas, C = AS, emailAddress = sdflkdsajf, O = lskdfjlsad, OU = sldfkja, issuer=C = AS, ST = ASDfkjdhf, L = lskdjf, O = saldfja, OU = skdjf, CN = localhost, emailAddress = sadjflkadsj): : certificate has expired
Google Test trace:
/data0/somelongdirectorytoavoidrpathissues/src/kudu/src/kudu/rpc/rpc-test.cc:267: Connecting to 0.0.0.0:41701
I20260929 14:20:59.219610 337 test_util.cc:175] -----------------------------------------------
I20260929 14:20:59.219798 337 test_util.cc:176] Had fatal failures, leaving test files at /tmp/dist-test-taskPbAJrG/test-tmp/rpc-test.5.Parameters_TestRpc.TestCallWithChainCertAndChainCA_SSL_TCP.1790691657832218-337-0
Full log
Note: This is test shard 6 of 8.
[==========] Running 21 tests from 2 test suites.
[----------] Global test environment set-up.
[----------] 20 tests from Parameters/TestRpc
[ RUN ] Parameters/TestRpc.TestMessengerCreateDestroy/SSL_TCP
WARNING: Logging before InitGoogleLogging() is written to STDERR
I20260929 14:20:57.944667 337 rpc-test.cc:169] started messenger TestCreateDestroy
[ OK ] Parameters/TestRpc.TestMessengerCreateDestroy/SSL_TCP (1193 ms)
[ RUN ] Parameters/TestRpc.TestNegotiationDeadlock/SSL_TCP
I20260929 14:20:59.107120 359 acceptor_pool.cc:254] collecting diagnostics on the listening RPC socket 0.0.0.0:41977 every 8 connection(s)
I20260929 14:20:59.108722 360 acceptor_pool.cc:254] collecting diagnostics on the listening RPC socket 0.0.0.0:41977 every 8 connection(s)
[ OK ] Parameters/TestRpc.TestNegotiationDeadlock/SSL_TCP (80 ms)
[ RUN ] Parameters/TestRpc.TestCallWithChainCertAndChainCA/SSL_TCP
I20260929 14:20:59.190240 375 acceptor_pool.cc:254] collecting diagnostics on the listening RPC socket 0.0.0.0:41701 every 8 connection(s)
I20260929 14:20:59.192416 376 acceptor_pool.cc:254] collecting diagnostics on the listening RPC socket 0.0.0.0:41701 every 8 connection(s)
/data0/somelongdirectorytoavoidrpathissues/src/kudu/src/kudu/rpc/rpc-test.cc:270: Failure
Failed
Bad status: Runtime error: could not verify certificate chain (error with cert: subject=CN = localhost, ST = sadfjas, C = AS, emailAddress = sdflkdsajf, O = lskdfjlsad, OU = sldfkja, issuer=C = AS, ST = ASDfkjdhf, L = lskdjf, O = saldfja, OU = skdjf, CN = localhost, emailAddress = sadjflkadsj): : certificate has expired
Google Test trace:
/data0/somelongdirectorytoavoidrpathissues/src/kudu/src/kudu/rpc/rpc-test.cc:267: Connecting to 0.0.0.0:41701
I20260929 14:20:59.219610 337 test_util.cc:175] -----------------------------------------------
I20260929 14:20:59.219798 337 test_util.cc:176] Had fatal failures, leaving test files at /tmp/dist-test-taskPbAJrG/test-tmp/rpc-test.5.Parameters_TestRpc.TestCallWithChainCertAndChainCA_SSL_TCP.1790691657832218-337-0
[ FAILED ] Parameters/TestRpc.TestCallWithChainCertAndChainCA/SSL_TCP, where GetParam() = (true, false) (57 ms)
[ RUN ] Parameters/TestRpc.TestCallWithPasswordProtectedKey/SSL_TCP
I20260929 14:20:59.253456 400 acceptor_pool.cc:254] collecting diagnostics on the listening RPC socket 0.0.0.0:39865 every 8 connection(s)
I20260929 14:20:59.254226 401 acceptor_pool.cc:254] collecting diagnostics on the listening RPC socket 0.0.0.0:39865 every 8 connection(s)
[ OK ] Parameters/TestRpc.TestCallWithPasswordProtectedKey/SSL_TCP (87 ms)
[ RUN ] Parameters/TestRpc.TestCallToBadServer/SSL_TCP
I20260929 14:20:59.348618 337 rpc-test.cc:394] Status: Network error: Client connection negotiation failed: client connection to 0.0.0.0:0: connect: Connection refused (error 111)
I20260929 14:20:59.350244 337 rpc-test.cc:394] Status: Network error: Client connection negotiation failed: client connection to 0.0.0.0:0: connect: Connection refused (error 111)
I20260929 14:20:59.351661 337 rpc-test.cc:394] Status: Network error: Client connection negotiation failed: client connection to 0.0.0.0:0: connect: Connection refused (error 111)
I20260929 14:20:59.353091 337 rpc-test.cc:394] Status: Network error: Client connection negotiation failed: client connection to 0.0.0.0:0: connect: Connection refused (error 111)
I20260929 14:20:59.354446 337 rpc-test.cc:394] Status: Network error: Client connection negotiation failed: client connection to 0.0.0.0:0: connect: Connection refused (error 111)
[ OK ] Parameters/TestRpc.TestCallToBadServer/SSL_TCP (49 ms)
[ RUN ] Parameters/TestRpc.TestWrongService/SSL_TCP
I20260929 14:20:59.378285 435 acceptor_pool.cc:254] collecting diagnostics on the listening RPC socket 0.0.0.0:39689 every 8 connection(s)
I20260929 14:20:59.379103 436 acceptor_pool.cc:254] collecting diagnostics on the listening RPC socket 0.0.0.0:39689 every 8 connection(s)
I20260929 14:20:59.419543 434 messenger.cc:345] service WrongServiceName not registered on TestServer
[ OK ] Parameters/TestRpc.TestWrongService/SSL_TCP (70 ms)
[ RUN ] Parameters/TestRpc.TestConnectionKeepalive/SSL_TCP
I20260929 14:20:59.450394 458 acceptor_pool.cc:254] collecting diagnostics on the listening RPC socket 0.0.0.0:40975 every 8 connection(s)
I20260929 14:20:59.451115 459 acceptor_pool.cc:254] collecting diagnostics on the listening RPC socket 0.0.0.0:40975 every 8 connection(s)
I20260929 14:20:59.454445 337 rpc-test.cc:488] Connecting to 0.0.0.0:40975
[ OK ] Parameters/TestRpc.TestConnectionKeepalive/SSL_TCP (1066 ms)
[ RUN ] Parameters/TestRpc.TestClientConnectionMetrics/SSL_TCP
I20260929 14:21:00.531769 483 acceptor_pool.cc:254] collecting diagnostics on the listening RPC socket 0.0.0.0:34405 every 8 connection(s)
I20260929 14:21:00.532591 484 acceptor_pool.cc:254] collecting diagnostics on the listening RPC socket 0.0.0.0:34405 every 8 connection(s)
I20260929 14:21:00.536257 337 rpc-test.cc:569] Connecting to 0.0.0.0:34405
[ OK ] Parameters/TestRpc.TestClientConnectionMetrics/SSL_TCP (120018 ms)
[ RUN ] Parameters/TestRpc.TestCredentialsPolicy/SSL_TCP
I20260929 14:23:00.529628 518 acceptor_pool.cc:254] collecting diagnostics on the listening RPC socket 0.0.0.0:35897 every 8 connection(s)
I20260929 14:23:00.530568 519 acceptor_pool.cc:254] collecting diagnostics on the listening RPC socket 0.0.0.0:35897 every 8 connection(s)
I20260929 14:23:00.534056 337 rpc-test.cc:700] Connecting to 0.0.0.0:35897
[ OK ] Parameters/TestRpc.TestCredentialsPolicy/SSL_TCP (73 ms)
[ RUN ] Parameters/TestRpc.TestCallLongerThanKeepalive/SSL_TCP
I20260929 14:23:00.608147 543 acceptor_pool.cc:254] collecting diagnostics on the listening RPC socket 0.0.0.0:41039 every 8 connection(s)
I20260929 14:23:00.608882 544 acceptor_pool.cc:254] collecting diagnostics on the listening RPC socket 0.0.0.0:41039 every 8 connection(s)
I20260929 14:23:00.655769 547 rpc-test-base.h:222] got call: sleep_micros: 3000000 deferred: true
I20260929 14:23:03.660225 547 rpcz_store.cc:275] Call kudu.rpc.GenericCalculatorService.Sleep from 127.0.0.1:55028 (request call id 0) took 3004 ms. Trace:
I20260929 14:23:03.660632 547 rpcz_store.cc:276] 0929 14:23:00.655501 (+ 0us) service_pool.cc:170] Inserting onto call queue
0929 14:23:00.655618 (+ 117us) service_pool.cc:227] Handling call
0929 14:23:03.660168 (+3004550us) inbound_call.cc:173] Queueing success response
Metrics: {}
[ OK ] Parameters/TestRpc.TestCallLongerThanKeepalive/SSL_TCP (3082 ms)
[ RUN ] Parameters/TestRpc.TestRpcSidecar/SSL_TCP
I20260929 14:23:03.695529 568 acceptor_pool.cc:254] collecting diagnostics on the listening RPC socket 0.0.0.0:43681 every 8 connection(s)
I20260929 14:23:03.696352 569 acceptor_pool.cc:254] collecting diagnostics on the listening RPC socket 0.0.0.0:43681 every 8 connection(s)
[ OK ] Parameters/TestRpc.TestRpcSidecar/SSL_TCP (540 ms)
[ RUN ] Parameters/TestRpc.TestRpcSidecarLimits/SSL_TCP
I20260929 14:23:23.591802 595 acceptor_pool.cc:254] collecting diagnostics on the listening RPC socket 0.0.0.0:42087 every 8 connection(s)
I20260929 14:23:23.592693 596 acceptor_pool.cc:254] collecting diagnostics on the listening RPC socket 0.0.0.0:42087 every 8 connection(s)
W20260929 14:23:23.615811 337 serialization.cc:72] Serialized kudu.rpc_test.PushStringsRequestPB (2147483654 bytes) is larger than the maximum configured RPC message size (52428800 bytes). Sending anyway, but peer may reject the data.
W20260929 14:23:23.626716 593 connection.cc:535] server connection from 127.0.0.1:52736 recv error: Network error: RPC frame had a length of 2147483714, but we only support messages up to 52428800 bytes long.
W20260929 14:23:23.627049 593 connection.cc:158] shutting down server connection from 127.0.0.1:52736 with pending inbound data: 4/2147483714 bytes received; last active 0 ns ago: status Network error: RPC frame had a length of 2147483714, but we only support messages up to 52428800 bytes long.
W20260929 14:23:23.628039 608 connection.cc:698] client connection to 0.0.0.0:42087 send error: Network error: failed to write to TLS socket: Connection reset by peer
W20260929 14:23:23.628782 608 connection.cc:196] Error closing socket: Network error: TlsSocket::Close: Success
[ OK ] Parameters/TestRpc.TestRpcSidecarLimits/SSL_TCP (20138 ms)
[ RUN ] Parameters/TestRpc.TestCallTimeoutDoesntAffectNegotiation/SSL_TCP
I20260929 14:23:24.377741 620 acceptor_pool.cc:254] collecting diagnostics on the listening RPC socket 0.0.0.0:34391 every 8 connection(s)
I20260929 14:23:24.378583 621 acceptor_pool.cc:254] collecting diagnostics on the listening RPC socket 0.0.0.0:34391 every 8 connection(s)
W20260929 14:23:24.405020 616 negotiation.cc:266] Injecting 500ms delay in negotiation
I20260929 14:23:24.455487 337 rpc-test-base.h:595] status: Timed out: connection negotiation to 0.0.0.0:34391 for RPC Sleep timed out after 0.050s (ON_OUTBOUND_QUEUE), seconds elapsed: 0.0515997
[ OK ] Parameters/TestRpc.TestCallTimeoutDoesntAffectNegotiation/SSL_TCP (573 ms)
[ RUN ] Parameters/TestRpc.TestRpcHandlerLatencyMetric/SSL_TCP
I20260929 14:23:24.962791 645 acceptor_pool.cc:254] collecting diagnostics on the listening RPC socket 0.0.0.0:40341 every 8 connection(s)
I20260929 14:23:24.963469 646 acceptor_pool.cc:254] collecting diagnostics on the listening RPC socket 0.0.0.0:40341 every 8 connection(s)
I20260929 14:23:25.028719 337 rpc-test.cc:1236] Sleep() min lat: 21745
I20260929 14:23:25.028923 337 rpc-test.cc:1237] Sleep() mean lat: 21745
I20260929 14:23:25.029095 337 rpc-test.cc:1238] Sleep() max lat: 21745
I20260929 14:23:25.029327 337 rpc-test.cc:1239] Sleep() #calls: 1
[ OK ] Parameters/TestRpc.TestRpcHandlerLatencyMetric/SSL_TCP (113 ms)
[ RUN ] Parameters/TestRpc.TimedOutOnResponseMetricServiceQueue/SSL_TCP
I20260929 14:23:25.064879 671 acceptor_pool.cc:254] collecting diagnostics on the listening RPC socket 0.0.0.0:35543 every 8 connection(s)
I20260929 14:23:25.065613 672 acceptor_pool.cc:254] collecting diagnostics on the listening RPC socket 0.0.0.0:35543 every 8 connection(s)
W20260929 14:23:25.156145 673 rpcz_store.cc:267] Call kudu.rpc_test.CalculatorService.Sleep from 127.0.0.1:59036 (request call id 2) took 20 ms (client timeout 20 ms). Trace:
W20260929 14:23:25.156536 673 rpcz_store.cc:269] 0929 14:23:25.135626 (+ 0us) service_pool.cc:170] Inserting onto call queue
0929 14:23:25.155952 (+ 20326us) service_pool.cc:214] Skipping call since client already timed out
0929 14:23:25.156065 (+ 113us) inbound_call.cc:173] Queueing failure response
Metrics: {}
[ OK ] Parameters/TestRpc.TimedOutOnResponseMetricServiceQueue/SSL_TCP (134 ms)
[ RUN ] Parameters/TestRpc.RpcPendingConnectionsMetric/SSL_TCP
I20260929 14:23:25.182111 694 acceptor_pool.cc:254] collecting diagnostics on the listening RPC socket 0.0.0.0:33767 every 8 connection(s)
I20260929 14:23:25.182807 695 acceptor_pool.cc:254] collecting diagnostics on the listening RPC socket 0.0.0.0:33767 every 8 connection(s)
W20260929 14:23:25.188735 690 negotiation.cc:337] Failed RPC negotiation. Trace:
0929 14:23:25.187220 (+ 0us) reactor.cc:625] Submitting negotiation task for server connection from 127.0.0.1:42866 (local address 127.0.0.1:33767)
0929 14:23:25.187663 (+ 443us) server_negotiation.cc:206] Beginning negotiation
0929 14:23:25.187682 (+ 19us) server_negotiation.cc:399] Waiting for connection header
0929 14:23:25.187922 (+ 240us) negotiation.cc:327] Negotiation complete: Network error: Server connection negotiation failed: server connection from 127.0.0.1:42866: BlockingRecv error: recv got EOF from 127.0.0.1:42866 (error 108)
Metrics: {"server-negotiator.queue_time_us":121}
[ OK ] Parameters/TestRpc.RpcPendingConnectionsMetric/SSL_TCP (30 ms)
[ RUN ] Parameters/TestRpc.TestRpcContextClientDeadline/SSL_TCP
I20260929 14:23:25.227926 710 acceptor_pool.cc:254] collecting diagnostics on the listening RPC socket 0.0.0.0:38071 every 8 connection(s)
I20260929 14:23:25.228698 711 acceptor_pool.cc:254] collecting diagnostics on the listening RPC socket 0.0.0.0:38071 every 8 connection(s)
[ OK ] Parameters/TestRpc.TestRpcContextClientDeadline/SSL_TCP (97 ms)
[ RUN ] Parameters/TestRpc.TestApplicationFeatureFlagUnsupportedServer/SSL_TCP
I20260929 14:23:25.316311 735 acceptor_pool.cc:254] collecting diagnostics on the listening RPC socket 0.0.0.0:40781 every 8 connection(s)
I20260929 14:23:25.317018 736 acceptor_pool.cc:254] collecting diagnostics on the listening RPC socket 0.0.0.0:40781 every 8 connection(s)
[ OK ] Parameters/TestRpc.TestApplicationFeatureFlagUnsupportedServer/SSL_TCP (62 ms)
[ RUN ] Parameters/TestRpc.TestCancellationAsync/SSL_TCP
I20260929 14:23:25.382699 760 acceptor_pool.cc:254] collecting diagnostics on the listening RPC socket 0.0.0.0:38257 every 8 connection(s)
I20260929 14:23:25.383431 761 acceptor_pool.cc:254] collecting diagnostics on the listening RPC socket 0.0.0.0:38257 every 8 connection(s)
I20260929 14:23:25.386655 337 rpc-test.cc:1716] Connecting to 0.0.0.0:38257
I20260929 14:23:25.417012 337 test_util.cc:268] Using random seed: -319369697
I20260929 14:23:25.662873 764 rpc-test-base.h:240] got call: sleep_micros: 500 pattern: 4294967295 num_repetitions: 2097152 sidecar_idx: 0
I20260929 14:23:25.820852 763 rpc-test-base.h:240] got call: sleep_micros: 500 pattern: 4294967295 num_repetitions: 2097152 sidecar_idx: 0
I20260929 14:23:26.036173 764 rpc-test-base.h:240] got call: sleep_micros: 500 pattern: 4294967295 num_repetitions: 2097152 sidecar_idx: 0
I20260929 14:23:26.238010 763 rpc-test-base.h:240] got call: sleep_micros: 500 pattern: 4294967295 num_repetitions: 2097152 sidecar_idx: 0
I20260929 14:23:26.439112 764 rpc-test-base.h:240] got call: sleep_micros: 500 pattern: 4294967295 num_repetitions: 2097152 sidecar_idx: 0
W20260929 14:23:26.480737 773 outbound_call.cc:322] RPC callback for RPC call kudu.rpc.GenericCalculatorService.SleepWithSidecar -> {remote=0.0.0.0:38257 (localhost), user_credentials={real_user=slave}} blocked reactor thread for 44408.3us
I20260929 14:23:26.619578 763 rpc-test-base.h:240] got call: sleep_micros: 500 pattern: 4294967295 num_repetitions: 2097152 sidecar_idx: 0
I20260929 14:23:26.803791 764 rpc-test-base.h:240] got call: sleep_micros: 500 pattern: 4294967295 num_repetitions: 2097152 sidecar_idx: 0
I20260929 14:23:26.996109 763 rpc-test-base.h:240] got call: sleep_micros: 500 pattern: 4294967295 num_repetitions: 2097152 sidecar_idx: 0
W20260929 14:23:27.160149 759 connection.cc:698] server connection from 127.0.0.1:50670 send error: Network error: failed to write to TLS socket: Broken pipe
W20260929 14:23:27.160461 759 connection.cc:441] server connection from 127.0.0.1:50670 torn down before Call kudu.rpc.GenericCalculatorService.SleepWithSidecar from 127.0.0.1:50670 (request call id 9) could send its response
W20260929 14:23:27.165707 759 connection.cc:196] Error closing socket: Network error: TlsSocket::Close: Success
W20260929 14:23:27.199009 759 connection.cc:441] server connection from 127.0.0.1:50670 torn down before Call kudu.rpc.GenericCalculatorService.SleepWithSidecar from 127.0.0.1:50670 (request call id 8) could send its response
[ OK ] Parameters/TestRpc.TestCancellationAsync/SSL_TCP (1846 ms)
[ RUN ] Parameters/TestRpc.TestPerformanceBySocketType/SSL_TCP
I20260929 14:23:27.333827 785 acceptor_pool.cc:254] collecting diagnostics on the listening RPC socket 0.0.0.0:44269 every 8 connection(s)
I20260929 14:23:27.334640 786 acceptor_pool.cc:254] collecting diagnostics on the listening RPC socket 0.0.0.0:44269 every 8 connection(s)
I20260929 14:23:27.337869 337 rpc-test.cc:1846] Connecting to 0.0.0.0:44269
I20260929 14:23:47.133196 337 rpc-test.cc:1859] Sending 1024MB via ssl-enabled tcp socket: real 19.759s user 16.808s sys 11.202s
I20260929 14:24:07.126272 337 rpc-test.cc:1859] Sending 1024MB via ssl-enabled tcp socket: real 19.993s user 16.936s sys 11.464s
I20260929 14:24:26.935128 337 rpc-test.cc:1859] Sending 1024MB via ssl-enabled tcp socket: real 19.808s user 16.851s sys 11.204s
I20260929 14:24:46.931716 337 rpc-test.cc:1859] Sending 1024MB via ssl-enabled tcp socket: real 19.996s user 16.995s sys 11.371s
I20260929 14:25:07.353121 337 rpc-test.cc:1859] Sending 1024MB via ssl-enabled tcp socket: real 20.421s user 17.373s sys 11.679s
[ OK ] Parameters/TestRpc.TestPerformanceBySocketType/SSL_TCP (100164 ms)
[----------] 20 tests from Parameters/TestRpc (249485 ms total)
[----------] 1 test from Parameters/TestRpcSocketTxRxQueue
[ RUN ] Parameters/TestRpcSocketTxRxQueue.OverCapacity/0
W20260929 14:25:07.831075 821 negotiation.cc:337] Failed RPC negotiation. Trace:
0929 14:25:07.399917 (+ 0us) reactor.cc:625] Submitting negotiation task for client connection to 0.0.0.0:45083 (local address 127.0.0.1:52090)
0929 14:25:07.400387 (+ 470us) negotiation.cc:107] Waiting for socket to connect
0929 14:25:07.400417 (+ 30us) client_negotiation.cc:174] Beginning negotiation
0929 14:25:07.400670 (+ 253us) client_negotiation.cc:252] Sending NEGOTIATE NegotiatePB request
0929 14:25:07.829908 (+429238us) negotiation.cc:327] Negotiation complete: Network error: Client connection negotiation failed: client connection to 0.0.0.0:45083: BlockingRecv error: recv error from unknown peer: Transport endpoint is not connected (error 107)
Metrics: {"client-negotiator.queue_time_us":130}
W20260929 14:25:07.831147 830 negotiation.cc:337] Failed RPC negotiation. Trace:
0929 14:25:07.408570 (+ 0us) reactor.cc:625] Submitting negotiation task for client connection to 0.0.0.0:45083 (local address 127.0.0.1:52102)
0929 14:25:07.409160 (+ 590us) negotiation.cc:107] Waiting for socket to connect
0929 14:25:07.409190 (+ 30us) client_negotiation.cc:174] Beginning negotiation
0929 14:25:07.409414 (+ 224us) client_negotiation.cc:252] Sending NEGOTIATE NegotiatePB request
0929 14:25:07.829949 (+420535us) negotiation.cc:327] Negotiation complete: Network error: Client connection negotiation failed: client connection to 0.0.0.0:45083: BlockingRecv error: recv error from unknown peer: Transport endpoint is not connected (error 107)
Metrics: {"client-negotiator.queue_time_us":141}
W20260929 14:25:07.831333 812 negotiation.cc:337] Failed RPC negotiation. Trace:
0929 14:25:07.391520 (+ 0us) reactor.cc:625] Submitting negotiation task for client connection to 0.0.0.0:45083 (local address 127.0.0.1:52084)
0929 14:25:07.392070 (+ 550us) negotiation.cc:107] Waiting for socket to connect
0929 14:25:07.392102 (+ 32us) client_negotiation.cc:174] Beginning negotiation
0929 14:25:07.392406 (+ 304us) client_negotiation.cc:252] Sending NEGOTIATE NegotiatePB request
0929 14:25:07.829891 (+437485us) negotiation.cc:327] Negotiation complete: Network error: Client connection negotiation failed: client connection to 0.0.0.0:45083: BlockingRecv error: recv error from unknown peer: Transport endpoint is not connected (error 107)
Metrics: {"client-negotiator.queue_time_us":118}
W20260929 14:25:07.831442 848 negotiation.cc:337] Failed RPC negotiation. Trace:
0929 14:25:07.437465 (+ 0us) reactor.cc:625] Submitting negotiation task for client connection to 0.0.0.0:45083 (local address 127.0.0.1:52132)
0929 14:25:07.438156 (+ 691us) negotiation.cc:107] Waiting for socket to connect
0929 14:25:07.438190 (+ 34us) client_negotiation.cc:174] Beginning negotiation
0929 14:25:07.438408 (+ 218us) client_negotiation.cc:252] Sending NEGOTIATE NegotiatePB request
0929 14:25:07.830428 (+392020us) negotiation.cc:327] Negotiation complete: Network error: Client connection negotiation failed: client connection to 0.0.0.0:45083: BlockingRecv error: recv error from unknown peer: Transport endpoint is not connected (error 107)
Metrics: {"client-negotiator.queue_time_us":260}
W20260929 14:25:07.832636 839 negotiation.cc:337] Failed RPC negotiation. Trace:
0929 14:25:07.421629 (+ 0us) reactor.cc:625] Submitting negotiation task for client connection to 0.0.0.0:45083 (local address 127.0.0.1:52118)
0929 14:25:07.422173 (+ 544us) negotiation.cc:107] Waiting for socket to connect
0929 14:25:07.422204 (+ 31us) client_negotiation.cc:174] Beginning negotiation
0929 14:25:07.422395 (+ 191us) client_negotiation.cc:252] Sending NEGOTIATE NegotiatePB request
0929 14:25:07.829896 (+407501us) negotiation.cc:327] Negotiation complete: Network error: Client connection negotiation failed: client connection to 0.0.0.0:45083: BlockingRecv error: recv error from unknown peer: Transport endpoint is not connected (error 107)
Metrics: {"client-negotiator.queue_time_us":131}
W20260929 14:25:07.833346 857 negotiation.cc:337] Failed RPC negotiation. Trace:
0929 14:25:07.451001 (+ 0us) reactor.cc:625] Submitting negotiation task for client connection to 0.0.0.0:45083 (local address 127.0.0.1:52142)
0929 14:25:07.451594 (+ 593us) negotiation.cc:107] Waiting for socket to connect
0929 14:25:07.451625 (+ 31us) client_negotiation.cc:174] Beginning negotiation
0929 14:25:07.451831 (+ 206us) client_negotiation.cc:252] Sending NEGOTIATE NegotiatePB request
0929 14:25:07.832266 (+380435us) negotiation.cc:327] Negotiation complete: Network error: Client connection negotiation failed: client connection to 0.0.0.0:45083: BlockingRecv error: recv error from unknown peer: Transport endpoint is not connected (error 107)
Metrics: {"client-negotiator.queue_time_us":156}
[ OK ] Parameters/TestRpcSocketTxRxQueue.OverCapacity/0 (1256 ms)
[----------] 1 test from Parameters/TestRpcSocketTxRxQueue (1256 ms total)
[----------] Global test environment tear-down
[==========] 21 tests from 2 test suites ran. (250743 ms total)
[ PASSED ] 20 tests.
[ FAILED ] 1 test, listed below:
[ FAILED ] Parameters/TestRpc.TestCallWithChainCertAndChainCA/SSL_TCP, where GetParam() = (true, false)
1 FAILED TEST