Diagnosed failure

Parameters/TestRpc.TestCallWithChainCertAndChainCA/SSL_TCP: /data0/somelongdirectorytoavoidrpathissues/src/kudu/src/kudu/rpc/rpc-test.cc:270: Failure
Failed
Bad status: Runtime error: could not verify certificate chain (error with cert: subject=CN = localhost, ST = sadfjas, C = AS, emailAddress = sdflkdsajf, O = lskdfjlsad, OU = sldfkja, issuer=C = AS, ST = ASDfkjdhf, L = lskdjf, O = saldfja, OU = skdjf, CN = localhost, emailAddress = sadjflkadsj): : certificate has expired
Google Test trace:
/data0/somelongdirectorytoavoidrpathissues/src/kudu/src/kudu/rpc/rpc-test.cc:267: Connecting to 0.0.0.0:34495
I20260928 11:44:52.169796  7202 test_util.cc:175] -----------------------------------------------
I20260928 11:44:52.170043  7202 test_util.cc:176] Had fatal failures, leaving test files at /tmp/dist-test-taskrwIgrY/test-tmp/rpc-test.5.Parameters_TestRpc.TestCallWithChainCertAndChainCA_SSL_TCP.1790595890792597-7202-0

Full log

Note: This is test shard 6 of 8.
[==========] Running 21 tests from 2 test suites.
[----------] Global test environment set-up.
[----------] 20 tests from Parameters/TestRpc
[ RUN      ] Parameters/TestRpc.TestMessengerCreateDestroy/SSL_TCP
WARNING: Logging before InitGoogleLogging() is written to STDERR
I20260928 11:44:50.910236  7202 rpc-test.cc:169] started messenger TestCreateDestroy
[       OK ] Parameters/TestRpc.TestMessengerCreateDestroy/SSL_TCP (1185 ms)
[ RUN      ] Parameters/TestRpc.TestNegotiationDeadlock/SSL_TCP
I20260928 11:44:52.063212  7224 acceptor_pool.cc:254] collecting diagnostics on the listening RPC socket 0.0.0.0:41675 every 8 connection(s)
I20260928 11:44:52.064783  7225 acceptor_pool.cc:254] collecting diagnostics on the listening RPC socket 0.0.0.0:41675 every 8 connection(s)
[       OK ] Parameters/TestRpc.TestNegotiationDeadlock/SSL_TCP (87 ms)
[ RUN      ] Parameters/TestRpc.TestCallWithChainCertAndChainCA/SSL_TCP
I20260928 11:44:52.140759  7240 acceptor_pool.cc:254] collecting diagnostics on the listening RPC socket 0.0.0.0:34495 every 8 connection(s)
I20260928 11:44:52.142953  7241 acceptor_pool.cc:254] collecting diagnostics on the listening RPC socket 0.0.0.0:34495 every 8 connection(s)
/data0/somelongdirectorytoavoidrpathissues/src/kudu/src/kudu/rpc/rpc-test.cc:270: Failure
Failed
Bad status: Runtime error: could not verify certificate chain (error with cert: subject=CN = localhost, ST = sadfjas, C = AS, emailAddress = sdflkdsajf, O = lskdfjlsad, OU = sldfkja, issuer=C = AS, ST = ASDfkjdhf, L = lskdjf, O = saldfja, OU = skdjf, CN = localhost, emailAddress = sadjflkadsj): : certificate has expired
Google Test trace:
/data0/somelongdirectorytoavoidrpathissues/src/kudu/src/kudu/rpc/rpc-test.cc:267: Connecting to 0.0.0.0:34495
I20260928 11:44:52.169796  7202 test_util.cc:175] -----------------------------------------------
I20260928 11:44:52.170043  7202 test_util.cc:176] Had fatal failures, leaving test files at /tmp/dist-test-taskrwIgrY/test-tmp/rpc-test.5.Parameters_TestRpc.TestCallWithChainCertAndChainCA_SSL_TCP.1790595890792597-7202-0
[  FAILED  ] Parameters/TestRpc.TestCallWithChainCertAndChainCA/SSL_TCP, where GetParam() = (true, false) (52 ms)
[ RUN      ] Parameters/TestRpc.TestCallWithPasswordProtectedKey/SSL_TCP
I20260928 11:44:52.204891  7265 acceptor_pool.cc:254] collecting diagnostics on the listening RPC socket 0.0.0.0:39911 every 8 connection(s)
I20260928 11:44:52.205617  7266 acceptor_pool.cc:254] collecting diagnostics on the listening RPC socket 0.0.0.0:39911 every 8 connection(s)
[       OK ] Parameters/TestRpc.TestCallWithPasswordProtectedKey/SSL_TCP (81 ms)
[ RUN      ] Parameters/TestRpc.TestCallToBadServer/SSL_TCP
I20260928 11:44:52.274534  7202 rpc-test.cc:394] Status: Network error: Client connection negotiation failed: client connection to 0.0.0.0:0: connect: Connection refused (error 111)
I20260928 11:44:52.275906  7202 rpc-test.cc:394] Status: Network error: Client connection negotiation failed: client connection to 0.0.0.0:0: connect: Connection refused (error 111)
I20260928 11:44:52.277196  7202 rpc-test.cc:394] Status: Network error: Client connection negotiation failed: client connection to 0.0.0.0:0: connect: Connection refused (error 111)
I20260928 11:44:52.278527  7202 rpc-test.cc:394] Status: Network error: Client connection negotiation failed: client connection to 0.0.0.0:0: connect: Connection refused (error 111)
I20260928 11:44:52.279834  7202 rpc-test.cc:394] Status: Network error: Client connection negotiation failed: client connection to 0.0.0.0:0: connect: Connection refused (error 111)
[       OK ] Parameters/TestRpc.TestCallToBadServer/SSL_TCP (30 ms)
[ RUN      ] Parameters/TestRpc.TestWrongService/SSL_TCP
I20260928 11:44:52.315451  7300 acceptor_pool.cc:254] collecting diagnostics on the listening RPC socket 0.0.0.0:39215 every 8 connection(s)
I20260928 11:44:52.316263  7301 acceptor_pool.cc:254] collecting diagnostics on the listening RPC socket 0.0.0.0:39215 every 8 connection(s)
I20260928 11:44:52.355847  7297 messenger.cc:345] service WrongServiceName not registered on TestServer
[       OK ] Parameters/TestRpc.TestWrongService/SSL_TCP (80 ms)
[ RUN      ] Parameters/TestRpc.TestConnectionKeepalive/SSL_TCP
I20260928 11:44:52.388461  7323 acceptor_pool.cc:254] collecting diagnostics on the listening RPC socket 0.0.0.0:43981 every 8 connection(s)
I20260928 11:44:52.389215  7324 acceptor_pool.cc:254] collecting diagnostics on the listening RPC socket 0.0.0.0:43981 every 8 connection(s)
I20260928 11:44:52.392331  7202 rpc-test.cc:488] Connecting to 0.0.0.0:43981
[       OK ] Parameters/TestRpc.TestConnectionKeepalive/SSL_TCP (1072 ms)
[ RUN      ] Parameters/TestRpc.TestClientConnectionMetrics/SSL_TCP
I20260928 11:44:53.465691  7348 acceptor_pool.cc:254] collecting diagnostics on the listening RPC socket 0.0.0.0:35181 every 8 connection(s)
I20260928 11:44:53.466471  7349 acceptor_pool.cc:254] collecting diagnostics on the listening RPC socket 0.0.0.0:35181 every 8 connection(s)
I20260928 11:44:53.469484  7202 rpc-test.cc:569] Connecting to 0.0.0.0:35181
[       OK ] Parameters/TestRpc.TestClientConnectionMetrics/SSL_TCP (116619 ms)
[ RUN      ] Parameters/TestRpc.TestCredentialsPolicy/SSL_TCP
I20260928 11:46:50.081416  7382 acceptor_pool.cc:254] collecting diagnostics on the listening RPC socket 0.0.0.0:40173 every 8 connection(s)
I20260928 11:46:50.082198  7383 acceptor_pool.cc:254] collecting diagnostics on the listening RPC socket 0.0.0.0:40173 every 8 connection(s)
I20260928 11:46:50.085397  7202 rpc-test.cc:700] Connecting to 0.0.0.0:40173
[       OK ] Parameters/TestRpc.TestCredentialsPolicy/SSL_TCP (86 ms)
[ RUN      ] Parameters/TestRpc.TestCallLongerThanKeepalive/SSL_TCP
I20260928 11:46:50.163166  7407 acceptor_pool.cc:254] collecting diagnostics on the listening RPC socket 0.0.0.0:42219 every 8 connection(s)
I20260928 11:46:50.163916  7408 acceptor_pool.cc:254] collecting diagnostics on the listening RPC socket 0.0.0.0:42219 every 8 connection(s)
I20260928 11:46:50.196125  7411 rpc-test-base.h:222] got call: sleep_micros: 3000000 deferred: true
I20260928 11:46:53.200645  7411 rpcz_store.cc:275] Call kudu.rpc.GenericCalculatorService.Sleep from 127.0.0.1:52076 (request call id 0) took 3004 ms. Trace:
I20260928 11:46:53.201067  7411 rpcz_store.cc:276] 0928 11:46:50.195879 (+     0us) service_pool.cc:170] Inserting onto call queue
0928 11:46:50.195982 (+   103us) service_pool.cc:227] Handling call
0928 11:46:53.200479 (+3004497us) inbound_call.cc:173] Queueing success response
Metrics: {}
[       OK ] Parameters/TestRpc.TestCallLongerThanKeepalive/SSL_TCP (3070 ms)
[ RUN      ] Parameters/TestRpc.TestRpcSidecar/SSL_TCP
I20260928 11:46:53.236426  7433 acceptor_pool.cc:254] collecting diagnostics on the listening RPC socket 0.0.0.0:37091 every 8 connection(s)
I20260928 11:46:53.237241  7434 acceptor_pool.cc:254] collecting diagnostics on the listening RPC socket 0.0.0.0:37091 every 8 connection(s)
[       OK ] Parameters/TestRpc.TestRpcSidecar/SSL_TCP (537 ms)
[ RUN      ] Parameters/TestRpc.TestRpcSidecarLimits/SSL_TCP
I20260928 11:47:10.536981  7459 acceptor_pool.cc:254] collecting diagnostics on the listening RPC socket 0.0.0.0:43879 every 8 connection(s)
I20260928 11:47:10.537771  7460 acceptor_pool.cc:254] collecting diagnostics on the listening RPC socket 0.0.0.0:43879 every 8 connection(s)
W20260928 11:47:10.558833  7202 serialization.cc:72] Serialized kudu.rpc_test.PushStringsRequestPB (2147483654 bytes) is larger than the maximum configured RPC message size (52428800 bytes). Sending anyway, but peer may reject the data.
W20260928 11:47:10.571830  7457 connection.cc:535] server connection from 127.0.0.1:56986 recv error: Network error: RPC frame had a length of 2147483714, but we only support messages up to 52428800 bytes long.
W20260928 11:47:10.572242  7457 connection.cc:158] shutting down server connection from 127.0.0.1:56986 with pending inbound data: 4/2147483714 bytes received; last active 0 ns ago: status Network error: RPC frame had a length of 2147483714, but we only support messages up to 52428800 bytes long.
W20260928 11:47:10.573379  7472 connection.cc:698] client connection to 0.0.0.0:43879 send error: Network error: failed to write to TLS socket: Connection reset by peer
W20260928 11:47:10.574093  7472 connection.cc:196] Error closing socket: Network error: TlsSocket::Close: Success
[       OK ] Parameters/TestRpc.TestRpcSidecarLimits/SSL_TCP (17654 ms)
[ RUN      ] Parameters/TestRpc.TestCallTimeoutDoesntAffectNegotiation/SSL_TCP
I20260928 11:47:11.428654  7485 acceptor_pool.cc:254] collecting diagnostics on the listening RPC socket 0.0.0.0:46597 every 8 connection(s)
I20260928 11:47:11.429425  7486 acceptor_pool.cc:254] collecting diagnostics on the listening RPC socket 0.0.0.0:46597 every 8 connection(s)
W20260928 11:47:11.449952  7481 negotiation.cc:266] Injecting 500ms delay in negotiation
I20260928 11:47:11.499648  7202 rpc-test-base.h:595] status: Timed out: connection negotiation to 0.0.0.0:46597 for RPC Sleep timed out after 0.050s (ON_OUTBOUND_QUEUE), seconds elapsed: 0.0507305
[       OK ] Parameters/TestRpc.TestCallTimeoutDoesntAffectNegotiation/SSL_TCP (561 ms)
[ RUN      ] Parameters/TestRpc.TestRpcHandlerLatencyMetric/SSL_TCP
I20260928 11:47:12.012908  7510 acceptor_pool.cc:254] collecting diagnostics on the listening RPC socket 0.0.0.0:33147 every 8 connection(s)
I20260928 11:47:12.013639  7511 acceptor_pool.cc:254] collecting diagnostics on the listening RPC socket 0.0.0.0:33147 every 8 connection(s)
I20260928 11:47:12.072599  7202 rpc-test.cc:1236] Sleep() min lat: 21560
I20260928 11:47:12.072803  7202 rpc-test.cc:1237] Sleep() mean lat: 21560
I20260928 11:47:12.072953  7202 rpc-test.cc:1238] Sleep() max lat: 21560
I20260928 11:47:12.073063  7202 rpc-test.cc:1239] Sleep() #calls: 1
[       OK ] Parameters/TestRpc.TestRpcHandlerLatencyMetric/SSL_TCP (114 ms)
[ RUN      ] Parameters/TestRpc.TimedOutOnResponseMetricServiceQueue/SSL_TCP
I20260928 11:47:12.108556  7536 acceptor_pool.cc:254] collecting diagnostics on the listening RPC socket 0.0.0.0:34249 every 8 connection(s)
I20260928 11:47:12.109274  7537 acceptor_pool.cc:254] collecting diagnostics on the listening RPC socket 0.0.0.0:34249 every 8 connection(s)
W20260928 11:47:12.179417  7538 rpcz_store.cc:267] Call kudu.rpc_test.CalculatorService.Sleep from 127.0.0.1:50832 (request call id 2) took 20 ms (client timeout 20 ms). Trace:
W20260928 11:47:12.179785  7538 rpcz_store.cc:269] 0928 11:47:12.158884 (+     0us) service_pool.cc:170] Inserting onto call queue
0928 11:47:12.179226 (+ 20342us) service_pool.cc:214] Skipping call since client already timed out
0928 11:47:12.179350 (+   124us) inbound_call.cc:173] Queueing failure response
Metrics: {}
[       OK ] Parameters/TestRpc.TimedOutOnResponseMetricServiceQueue/SSL_TCP (103 ms)
[ RUN      ] Parameters/TestRpc.RpcPendingConnectionsMetric/SSL_TCP
I20260928 11:47:12.196513  7559 acceptor_pool.cc:254] collecting diagnostics on the listening RPC socket 0.0.0.0:34379 every 8 connection(s)
I20260928 11:47:12.197263  7560 acceptor_pool.cc:254] collecting diagnostics on the listening RPC socket 0.0.0.0:34379 every 8 connection(s)
W20260928 11:47:12.202402  7555 negotiation.cc:337] Failed RPC negotiation. Trace:
0928 11:47:12.201102 (+     0us) reactor.cc:625] Submitting negotiation task for server connection from 127.0.0.1:56522 (local address 127.0.0.1:34379)
0928 11:47:12.201509 (+   407us) server_negotiation.cc:206] Beginning negotiation
0928 11:47:12.201526 (+    17us) server_negotiation.cc:399] Waiting for connection header
0928 11:47:12.201786 (+   260us) negotiation.cc:327] Negotiation complete: Network error: Server connection negotiation failed: server connection from 127.0.0.1:56522: BlockingRecv error: recv got EOF from 127.0.0.1:56522 (error 108)
Metrics: {"server-negotiator.queue_time_us":104}
[       OK ] Parameters/TestRpc.RpcPendingConnectionsMetric/SSL_TCP (28 ms)
[ RUN      ] Parameters/TestRpc.TestRpcContextClientDeadline/SSL_TCP
I20260928 11:47:12.258867  7575 acceptor_pool.cc:254] collecting diagnostics on the listening RPC socket 0.0.0.0:39855 every 8 connection(s)
I20260928 11:47:12.259583  7576 acceptor_pool.cc:254] collecting diagnostics on the listening RPC socket 0.0.0.0:39855 every 8 connection(s)
[       OK ] Parameters/TestRpc.TestRpcContextClientDeadline/SSL_TCP (110 ms)
[ RUN      ] Parameters/TestRpc.TestApplicationFeatureFlagUnsupportedServer/SSL_TCP
I20260928 11:47:12.362068  7600 acceptor_pool.cc:254] collecting diagnostics on the listening RPC socket 0.0.0.0:35359 every 8 connection(s)
I20260928 11:47:12.362807  7601 acceptor_pool.cc:254] collecting diagnostics on the listening RPC socket 0.0.0.0:35359 every 8 connection(s)
[       OK ] Parameters/TestRpc.TestApplicationFeatureFlagUnsupportedServer/SSL_TCP (86 ms)
[ RUN      ] Parameters/TestRpc.TestCancellationAsync/SSL_TCP
I20260928 11:47:12.441303  7625 acceptor_pool.cc:254] collecting diagnostics on the listening RPC socket 0.0.0.0:34551 every 8 connection(s)
I20260928 11:47:12.442085  7626 acceptor_pool.cc:254] collecting diagnostics on the listening RPC socket 0.0.0.0:34551 every 8 connection(s)
I20260928 11:47:12.445144  7202 rpc-test.cc:1716] Connecting to 0.0.0.0:34551
I20260928 11:47:12.458813  7202 test_util.cc:268] Using random seed: -1603047384
I20260928 11:47:12.688007  7629 rpc-test-base.h:240] got call: sleep_micros: 500 pattern: 4294967295 num_repetitions: 2097152 sidecar_idx: 0
I20260928 11:47:12.849301  7628 rpc-test-base.h:240] got call: sleep_micros: 500 pattern: 4294967295 num_repetitions: 2097152 sidecar_idx: 0
I20260928 11:47:13.036871  7629 rpc-test-base.h:240] got call: sleep_micros: 500 pattern: 4294967295 num_repetitions: 2097152 sidecar_idx: 0
I20260928 11:47:13.225575  7628 rpc-test-base.h:240] got call: sleep_micros: 500 pattern: 4294967295 num_repetitions: 2097152 sidecar_idx: 0
I20260928 11:47:13.409452  7629 rpc-test-base.h:240] got call: sleep_micros: 500 pattern: 4294967295 num_repetitions: 2097152 sidecar_idx: 0
I20260928 11:47:13.595842  7629 rpc-test-base.h:240] got call: sleep_micros: 500 pattern: 4294967295 num_repetitions: 2097152 sidecar_idx: 0
I20260928 11:47:13.779016  7628 rpc-test-base.h:240] got call: sleep_micros: 500 pattern: 4294967295 num_repetitions: 2097152 sidecar_idx: 0
I20260928 11:47:13.964362  7628 rpc-test-base.h:240] got call: sleep_micros: 500 pattern: 4294967295 num_repetitions: 2097152 sidecar_idx: 0
W20260928 11:47:14.118884  7624 connection.cc:196] Error closing socket: Network error: TlsSocket::Close: Broken pipe
W20260928 11:47:14.123371  7624 connection.cc:441] server connection from 127.0.0.1:34004 torn down before Call kudu.rpc.GenericCalculatorService.SleepWithSidecar from 127.0.0.1:34004 (request call id 8) could send its response
[       OK ] Parameters/TestRpc.TestCancellationAsync/SSL_TCP (1719 ms)
[ RUN      ] Parameters/TestRpc.TestPerformanceBySocketType/SSL_TCP
I20260928 11:47:14.222762  7650 acceptor_pool.cc:254] collecting diagnostics on the listening RPC socket 0.0.0.0:40561 every 8 connection(s)
I20260928 11:47:14.223510  7651 acceptor_pool.cc:254] collecting diagnostics on the listening RPC socket 0.0.0.0:40561 every 8 connection(s)
I20260928 11:47:14.226756  7202 rpc-test.cc:1846] Connecting to 0.0.0.0:40561
I20260928 11:47:33.427709  7202 rpc-test.cc:1859] Sending 1024MB via ssl-enabled tcp socket: real 19.182s	user 16.434s	sys 10.999s
I20260928 11:47:52.226321  7202 rpc-test.cc:1859] Sending 1024MB via ssl-enabled tcp socket: real 18.798s	user 15.916s	sys 10.630s
I20260928 11:48:11.120280  7202 rpc-test.cc:1859] Sending 1024MB via ssl-enabled tcp socket: real 18.893s	user 16.081s	sys 10.629s
I20260928 11:48:30.000478  7202 rpc-test.cc:1859] Sending 1024MB via ssl-enabled tcp socket: real 18.880s	user 16.031s	sys 10.658s
I20260928 11:48:48.935350  7202 rpc-test.cc:1859] Sending 1024MB via ssl-enabled tcp socket: real 18.934s	user 16.061s	sys 10.727s
[       OK ] Parameters/TestRpc.TestPerformanceBySocketType/SSL_TCP (94820 ms)
[----------] 20 tests from Parameters/TestRpc (238109 ms total)

[----------] 1 test from Parameters/TestRpcSocketTxRxQueue
[ RUN      ] Parameters/TestRpcSocketTxRxQueue.OverCapacity/0
W20260928 11:48:49.391016  7712 negotiation.cc:337] Failed RPC negotiation. Trace:
0928 11:48:49.009772 (+     0us) reactor.cc:625] Submitting negotiation task for client connection to 0.0.0.0:40525 (local address 127.0.0.1:58916)
0928 11:48:49.010367 (+   595us) negotiation.cc:107] Waiting for socket to connect
0928 11:48:49.010396 (+    29us) client_negotiation.cc:174] Beginning negotiation
0928 11:48:49.010584 (+   188us) client_negotiation.cc:252] Sending NEGOTIATE NegotiatePB request
0928 11:48:49.389829 (+379245us) negotiation.cc:327] Negotiation complete: Network error: Client connection negotiation failed: client connection to 0.0.0.0:40525: BlockingRecv error: recv error from unknown peer: Transport endpoint is not connected (error 107)
Metrics: {"client-negotiator.queue_time_us":189}
W20260928 11:48:49.391042  7685 negotiation.cc:337] Failed RPC negotiation. Trace:
0928 11:48:48.978047 (+     0us) reactor.cc:625] Submitting negotiation task for client connection to 0.0.0.0:40525 (local address 127.0.0.1:58886)
0928 11:48:48.978550 (+   503us) negotiation.cc:107] Waiting for socket to connect
0928 11:48:48.978577 (+    27us) client_negotiation.cc:174] Beginning negotiation
0928 11:48:48.978773 (+   196us) client_negotiation.cc:252] Sending NEGOTIATE NegotiatePB request
0928 11:48:49.390012 (+411239us) negotiation.cc:327] Negotiation complete: Network error: Client connection negotiation failed: client connection to 0.0.0.0:40525: BlockingRecv error: recv error from unknown peer: Transport endpoint is not connected (error 107)
Metrics: {"client-negotiator.queue_time_us":119}
W20260928 11:48:49.391201  7703 negotiation.cc:337] Failed RPC negotiation. Trace:
0928 11:48:48.997492 (+     0us) reactor.cc:625] Submitting negotiation task for client connection to 0.0.0.0:40525 (local address 127.0.0.1:58902)
0928 11:48:48.998014 (+   522us) negotiation.cc:107] Waiting for socket to connect
0928 11:48:48.998045 (+    31us) client_negotiation.cc:174] Beginning negotiation
0928 11:48:48.998221 (+   176us) client_negotiation.cc:252] Sending NEGOTIATE NegotiatePB request
0928 11:48:49.390231 (+392010us) negotiation.cc:327] Negotiation complete: Network error: Client connection negotiation failed: client connection to 0.0.0.0:40525: BlockingRecv error: recv error from unknown peer: Transport endpoint is not connected (error 107)
Metrics: {"client-negotiator.queue_time_us":133}
W20260928 11:48:49.391038  7694 negotiation.cc:337] Failed RPC negotiation. Trace:
0928 11:48:48.985044 (+     0us) reactor.cc:625] Submitting negotiation task for client connection to 0.0.0.0:40525 (local address 127.0.0.1:58888)
0928 11:48:48.985578 (+   534us) negotiation.cc:107] Waiting for socket to connect
0928 11:48:48.985623 (+    45us) client_negotiation.cc:174] Beginning negotiation
0928 11:48:48.985814 (+   191us) client_negotiation.cc:252] Sending NEGOTIATE NegotiatePB request
0928 11:48:49.389938 (+404124us) negotiation.cc:327] Negotiation complete: Network error: Client connection negotiation failed: client connection to 0.0.0.0:40525: BlockingRecv error: recv error from unknown peer: Transport endpoint is not connected (error 107)
Metrics: {"client-negotiator.queue_time_us":133}
W20260928 11:48:49.392375  7676 negotiation.cc:337] Failed RPC negotiation. Trace:
0928 11:48:48.971531 (+     0us) reactor.cc:625] Submitting negotiation task for client connection to 0.0.0.0:40525 (local address 127.0.0.1:58880)
0928 11:48:48.972122 (+   591us) negotiation.cc:107] Waiting for socket to connect
0928 11:48:48.972152 (+    30us) client_negotiation.cc:174] Beginning negotiation
0928 11:48:48.972517 (+   365us) client_negotiation.cc:252] Sending NEGOTIATE NegotiatePB request
0928 11:48:49.389829 (+417312us) negotiation.cc:327] Negotiation complete: Network error: Client connection negotiation failed: client connection to 0.0.0.0:40525: BlockingRecv error: recv error from unknown peer: Transport endpoint is not connected (error 107)
Metrics: {"client-negotiator.queue_time_us":122}
W20260928 11:48:49.392606  7721 negotiation.cc:337] Failed RPC negotiation. Trace:
0928 11:48:49.022219 (+     0us) reactor.cc:625] Submitting negotiation task for client connection to 0.0.0.0:40525 (local address 127.0.0.1:58926)
0928 11:48:49.022785 (+   566us) negotiation.cc:107] Waiting for socket to connect
0928 11:48:49.022814 (+    29us) client_negotiation.cc:174] Beginning negotiation
0928 11:48:49.022996 (+   182us) client_negotiation.cc:252] Sending NEGOTIATE NegotiatePB request
0928 11:48:49.391617 (+368621us) negotiation.cc:327] Negotiation complete: Network error: Client connection negotiation failed: client connection to 0.0.0.0:40525: BlockingRecv error: recv error from unknown peer: Transport endpoint is not connected (error 107)
Metrics: {"client-negotiator.queue_time_us":151}
[       OK ] Parameters/TestRpcSocketTxRxQueue.OverCapacity/0 (1234 ms)
[----------] 1 test from Parameters/TestRpcSocketTxRxQueue (1234 ms total)

[----------] Global test environment tear-down
[==========] 21 tests from 2 test suites ran. (239345 ms total)
[  PASSED  ] 20 tests.
[  FAILED  ] 1 test, listed below:
[  FAILED  ] Parameters/TestRpc.TestCallWithChainCertAndChainCA/SSL_TCP, where GetParam() = (true, false)

 1 FAILED TEST