Diagnosed failure

Parameters/TestRpc.TestCallWithChainCertAndChainCA/SSL_TCP: /data0/somelongdirectorytoavoidrpathissues/src/kudu/src/kudu/rpc/rpc-test.cc:270: Failure
Failed
Bad status: Runtime error: could not verify certificate chain (error with cert: subject=CN = localhost, ST = sadfjas, C = AS, emailAddress = sdflkdsajf, O = lskdfjlsad, OU = sldfkja, issuer=C = AS, ST = ASDfkjdhf, L = lskdjf, O = saldfja, OU = skdjf, CN = localhost, emailAddress = sadjflkadsj): : certificate has expired
Google Test trace:
/data0/somelongdirectorytoavoidrpathissues/src/kudu/src/kudu/rpc/rpc-test.cc:267: Connecting to 0.0.0.0:39465
I20260929 10:49:53.469110 24759 test_util.cc:175] -----------------------------------------------
I20260929 10:49:53.469174 24759 test_util.cc:176] Had fatal failures, leaving test files at /tmp/dist-test-taskG4seNh/test-tmp/rpc-test.5.Parameters_TestRpc.TestCallWithChainCertAndChainCA_SSL_TCP.1790678993407420-24759-0

Full log

Note: This is test shard 6 of 8.
[==========] Running 21 tests from 2 test suites.
[----------] Global test environment set-up.
[----------] 20 tests from Parameters/TestRpc
[ RUN      ] Parameters/TestRpc.TestMessengerCreateDestroy/SSL_TCP
WARNING: Logging before InitGoogleLogging() is written to STDERR
I20260929 10:49:53.424350 24759 rpc-test.cc:169] started messenger TestCreateDestroy
[       OK ] Parameters/TestRpc.TestMessengerCreateDestroy/SSL_TCP (15 ms)
[ RUN      ] Parameters/TestRpc.TestNegotiationDeadlock/SSL_TCP
I20260929 10:49:53.437629 24779 acceptor_pool.cc:254] collecting diagnostics on the listening RPC socket 0.0.0.0:34391 every 8 connection(s)
I20260929 10:49:53.437629 24780 acceptor_pool.cc:254] collecting diagnostics on the listening RPC socket 0.0.0.0:34391 every 8 connection(s)
[       OK ] Parameters/TestRpc.TestNegotiationDeadlock/SSL_TCP (20 ms)
[ RUN      ] Parameters/TestRpc.TestCallWithChainCertAndChainCA/SSL_TCP
I20260929 10:49:53.465055 24796 acceptor_pool.cc:254] collecting diagnostics on the listening RPC socket 0.0.0.0:39465 every 8 connection(s)
I20260929 10:49:53.465055 24795 acceptor_pool.cc:254] collecting diagnostics on the listening RPC socket 0.0.0.0:39465 every 8 connection(s)
/data0/somelongdirectorytoavoidrpathissues/src/kudu/src/kudu/rpc/rpc-test.cc:270: Failure
Failed
Bad status: Runtime error: could not verify certificate chain (error with cert: subject=CN = localhost, ST = sadfjas, C = AS, emailAddress = sdflkdsajf, O = lskdfjlsad, OU = sldfkja, issuer=C = AS, ST = ASDfkjdhf, L = lskdjf, O = saldfja, OU = skdjf, CN = localhost, emailAddress = sadjflkadsj): : certificate has expired
Google Test trace:
/data0/somelongdirectorytoavoidrpathissues/src/kudu/src/kudu/rpc/rpc-test.cc:267: Connecting to 0.0.0.0:39465
I20260929 10:49:53.469110 24759 test_util.cc:175] -----------------------------------------------
I20260929 10:49:53.469174 24759 test_util.cc:176] Had fatal failures, leaving test files at /tmp/dist-test-taskG4seNh/test-tmp/rpc-test.5.Parameters_TestRpc.TestCallWithChainCertAndChainCA_SSL_TCP.1790678993407420-24759-0
[  FAILED  ] Parameters/TestRpc.TestCallWithChainCertAndChainCA/SSL_TCP, where GetParam() = (true, false) (23 ms)
[ RUN      ] Parameters/TestRpc.TestCallWithPasswordProtectedKey/SSL_TCP
I20260929 10:49:53.475787 24820 acceptor_pool.cc:254] collecting diagnostics on the listening RPC socket 0.0.0.0:45185 every 8 connection(s)
I20260929 10:49:53.475787 24821 acceptor_pool.cc:254] collecting diagnostics on the listening RPC socket 0.0.0.0:45185 every 8 connection(s)
[       OK ] Parameters/TestRpc.TestCallWithPasswordProtectedKey/SSL_TCP (19 ms)
[ RUN      ] Parameters/TestRpc.TestCallToBadServer/SSL_TCP
I20260929 10:49:53.494673 24759 rpc-test.cc:394] Status: Network error: Client connection negotiation failed: client connection to 0.0.0.0:0: connect: Connection refused (error 111)
I20260929 10:49:53.495098 24759 rpc-test.cc:394] Status: Network error: Client connection negotiation failed: client connection to 0.0.0.0:0: connect: Connection refused (error 111)
I20260929 10:49:53.495338 24759 rpc-test.cc:394] Status: Network error: Client connection negotiation failed: client connection to 0.0.0.0:0: connect: Connection refused (error 111)
I20260929 10:49:53.495486 24759 rpc-test.cc:394] Status: Network error: Client connection negotiation failed: client connection to 0.0.0.0:0: connect: Connection refused (error 111)
I20260929 10:49:53.495635 24759 rpc-test.cc:394] Status: Network error: Client connection negotiation failed: client connection to 0.0.0.0:0: connect: Connection refused (error 111)
[       OK ] Parameters/TestRpc.TestCallToBadServer/SSL_TCP (7 ms)
[ RUN      ] Parameters/TestRpc.TestWrongService/SSL_TCP
I20260929 10:49:53.516793 24856 acceptor_pool.cc:254] collecting diagnostics on the listening RPC socket 0.0.0.0:45955 every 8 connection(s)
I20260929 10:49:53.516793 24855 acceptor_pool.cc:254] collecting diagnostics on the listening RPC socket 0.0.0.0:45955 every 8 connection(s)
I20260929 10:49:53.545790 24853 messenger.cc:345] service WrongServiceName not registered on TestServer
[       OK ] Parameters/TestRpc.TestWrongService/SSL_TCP (51 ms)
[ RUN      ] Parameters/TestRpc.TestConnectionKeepalive/SSL_TCP
I20260929 10:49:53.558035 24879 acceptor_pool.cc:254] collecting diagnostics on the listening RPC socket 0.0.0.0:44559 every 8 connection(s)
I20260929 10:49:53.558029 24878 acceptor_pool.cc:254] collecting diagnostics on the listening RPC socket 0.0.0.0:44559 every 8 connection(s)
I20260929 10:49:53.558167 24759 rpc-test.cc:488] Connecting to 0.0.0.0:44559
[       OK ] Parameters/TestRpc.TestConnectionKeepalive/SSL_TCP (1039 ms)
[ RUN      ] Parameters/TestRpc.TestClientConnectionMetrics/SSL_TCP
I20260929 10:49:54.592021 24904 acceptor_pool.cc:254] collecting diagnostics on the listening RPC socket 0.0.0.0:45545 every 8 connection(s)
I20260929 10:49:54.592150 24759 rpc-test.cc:569] Connecting to 0.0.0.0:45545
I20260929 10:49:54.591981 24903 acceptor_pool.cc:254] collecting diagnostics on the listening RPC socket 0.0.0.0:45545 every 8 connection(s)
[       OK ] Parameters/TestRpc.TestClientConnectionMetrics/SSL_TCP (8511 ms)
[ RUN      ] Parameters/TestRpc.TestCredentialsPolicy/SSL_TCP
I20260929 10:50:03.111157 24926 acceptor_pool.cc:254] collecting diagnostics on the listening RPC socket 0.0.0.0:33401 every 8 connection(s)
I20260929 10:50:03.111181 24927 acceptor_pool.cc:254] collecting diagnostics on the listening RPC socket 0.0.0.0:33401 every 8 connection(s)
I20260929 10:50:03.111291 24759 rpc-test.cc:700] Connecting to 0.0.0.0:33401
[       OK ] Parameters/TestRpc.TestCredentialsPolicy/SSL_TCP (37 ms)
[ RUN      ] Parameters/TestRpc.TestCallLongerThanKeepalive/SSL_TCP
I20260929 10:50:03.163868 24951 acceptor_pool.cc:254] collecting diagnostics on the listening RPC socket 0.0.0.0:34467 every 8 connection(s)
I20260929 10:50:03.163910 24952 acceptor_pool.cc:254] collecting diagnostics on the listening RPC socket 0.0.0.0:34467 every 8 connection(s)
I20260929 10:50:03.198377 24955 rpc-test-base.h:222] got call: sleep_micros: 3000000 deferred: true
I20260929 10:50:06.199231 24955 rpcz_store.cc:275] Call kudu.rpc.GenericCalculatorService.Sleep from 127.0.0.1:50342 (request call id 0) took 3000 ms. Trace:
I20260929 10:50:06.199338 24955 rpcz_store.cc:276] 0929 10:50:03.198322 (+     0us) service_pool.cc:170] Inserting onto call queue
0929 10:50:03.198355 (+    33us) service_pool.cc:227] Handling call
0929 10:50:06.199213 (+3000858us) inbound_call.cc:173] Queueing success response
Metrics: {}
[       OK ] Parameters/TestRpc.TestCallLongerThanKeepalive/SSL_TCP (3064 ms)
[ RUN      ] Parameters/TestRpc.TestRpcSidecar/SSL_TCP
I20260929 10:50:06.229905 24976 acceptor_pool.cc:254] collecting diagnostics on the listening RPC socket 0.0.0.0:34777 every 8 connection(s)
I20260929 10:50:06.229940 24977 acceptor_pool.cc:254] collecting diagnostics on the listening RPC socket 0.0.0.0:34777 every 8 connection(s)
[       OK ] Parameters/TestRpc.TestRpcSidecar/SSL_TCP (74 ms)
[ RUN      ] Parameters/TestRpc.TestRpcSidecarLimits/SSL_TCP
I20260929 10:50:08.665911 25001 acceptor_pool.cc:254] collecting diagnostics on the listening RPC socket 0.0.0.0:46461 every 8 connection(s)
I20260929 10:50:08.665943 25002 acceptor_pool.cc:254] collecting diagnostics on the listening RPC socket 0.0.0.0:46461 every 8 connection(s)
W20260929 10:50:08.673038 24759 serialization.cc:72] Serialized kudu.rpc_test.PushStringsRequestPB (2147483654 bytes) is larger than the maximum configured RPC message size (52428800 bytes). Sending anyway, but peer may reject the data.
W20260929 10:50:08.676287 24998 connection.cc:535] server connection from 127.0.0.1:45680 recv error: Network error: RPC frame had a length of 2147483714, but we only support messages up to 52428800 bytes long.
W20260929 10:50:08.676353 24998 connection.cc:158] shutting down server connection from 127.0.0.1:45680 with pending inbound data: 4/2147483714 bytes received; last active 0 ns ago: status Network error: RPC frame had a length of 2147483714, but we only support messages up to 52428800 bytes long.
W20260929 10:50:08.676579 25014 connection.cc:196] Error closing socket: Network error: TlsSocket::Close: Connection reset by peer
I20260929 10:50:08.685143 25026 acceptor_pool.cc:254] collecting diagnostics on the listening RPC socket 0.0.0.0:40053 every 8 connection(s)
I20260929 10:50:08.685158 25027 acceptor_pool.cc:254] collecting diagnostics on the listening RPC socket 0.0.0.0:40053 every 8 connection(s)
W20260929 10:50:13.359712 25024 connection.cc:577] server connection from 127.0.0.1:52356: received bad data: 'Corruption: Invalid packet: message had a length of 2147483710, but we only support messages up to 2147483647 bytes
'
[       OK ] Parameters/TestRpc.TestRpcSidecarLimits/SSL_TCP (7086 ms)
[ RUN      ] Parameters/TestRpc.TestCallTimeoutDoesntAffectNegotiation/SSL_TCP
I20260929 10:50:13.377409 25051 acceptor_pool.cc:254] collecting diagnostics on the listening RPC socket 0.0.0.0:40447 every 8 connection(s)
I20260929 10:50:13.377460 25052 acceptor_pool.cc:254] collecting diagnostics on the listening RPC socket 0.0.0.0:40447 every 8 connection(s)
W20260929 10:50:13.391384 25046 negotiation.cc:266] Injecting 500ms delay in negotiation
I20260929 10:50:13.441747 24759 rpc-test-base.h:595] status: Timed out: connection negotiation to 0.0.0.0:40447 for RPC Sleep timed out after 0.050s (ON_OUTBOUND_QUEUE), seconds elapsed: 0.0507389
[       OK ] Parameters/TestRpc.TestCallTimeoutDoesntAffectNegotiation/SSL_TCP (534 ms)
[ RUN      ] Parameters/TestRpc.TestRpcHandlerLatencyMetric/SSL_TCP
I20260929 10:50:13.905793 25076 acceptor_pool.cc:254] collecting diagnostics on the listening RPC socket 0.0.0.0:35163 every 8 connection(s)
I20260929 10:50:13.905849 25077 acceptor_pool.cc:254] collecting diagnostics on the listening RPC socket 0.0.0.0:35163 every 8 connection(s)
I20260929 10:50:13.936477 24759 rpc-test.cc:1236] Sleep() min lat: 20314
I20260929 10:50:13.936549 24759 rpc-test.cc:1237] Sleep() mean lat: 20314
I20260929 10:50:13.936584 24759 rpc-test.cc:1238] Sleep() max lat: 20314
I20260929 10:50:13.936597 24759 rpc-test.cc:1239] Sleep() #calls: 1
[       OK ] Parameters/TestRpc.TestRpcHandlerLatencyMetric/SSL_TCP (41 ms)
[ RUN      ] Parameters/TestRpc.TimedOutOnResponseMetricServiceQueue/SSL_TCP
I20260929 10:50:13.945371 25102 acceptor_pool.cc:254] collecting diagnostics on the listening RPC socket 0.0.0.0:40227 every 8 connection(s)
I20260929 10:50:13.945413 25103 acceptor_pool.cc:254] collecting diagnostics on the listening RPC socket 0.0.0.0:40227 every 8 connection(s)
W20260929 10:50:14.002507 25104 rpcz_store.cc:267] Call kudu.rpc_test.CalculatorService.Sleep from 127.0.0.1:44530 (request call id 2) took 20 ms (client timeout 20 ms). Trace:
W20260929 10:50:14.002620 25104 rpcz_store.cc:269] 0929 10:50:13.982226 (+     0us) service_pool.cc:170] Inserting onto call queue
0929 10:50:14.002468 (+ 20242us) service_pool.cc:214] Skipping call since client already timed out
0929 10:50:14.002481 (+    13us) inbound_call.cc:173] Queueing failure response
Metrics: {}
[       OK ] Parameters/TestRpc.TimedOutOnResponseMetricServiceQueue/SSL_TCP (66 ms)
[ RUN      ] Parameters/TestRpc.RpcPendingConnectionsMetric/SSL_TCP
I20260929 10:50:14.006119 25125 acceptor_pool.cc:254] collecting diagnostics on the listening RPC socket 0.0.0.0:43719 every 8 connection(s)
I20260929 10:50:14.006192 25126 acceptor_pool.cc:254] collecting diagnostics on the listening RPC socket 0.0.0.0:43719 every 8 connection(s)
W20260929 10:50:14.006901 25121 negotiation.cc:337] Failed RPC negotiation. Trace:
0929 10:50:14.006711 (+     0us) reactor.cc:625] Submitting negotiation task for server connection from 127.0.0.1:42952 (local address 127.0.0.1:43719)
0929 10:50:14.006777 (+    66us) server_negotiation.cc:206] Beginning negotiation
0929 10:50:14.006779 (+     2us) server_negotiation.cc:399] Waiting for connection header
0929 10:50:14.006844 (+    65us) negotiation.cc:327] Negotiation complete: Network error: Server connection negotiation failed: server connection from 127.0.0.1:42952: BlockingRecv error: recv got EOF from 127.0.0.1:42952 (error 108)
Metrics: {"server-negotiator.queue_time_us":35}
[       OK ] Parameters/TestRpc.RpcPendingConnectionsMetric/SSL_TCP (13 ms)
[ RUN      ] Parameters/TestRpc.TestRpcContextClientDeadline/SSL_TCP
I20260929 10:50:14.038045 25141 acceptor_pool.cc:254] collecting diagnostics on the listening RPC socket 0.0.0.0:41097 every 8 connection(s)
I20260929 10:50:14.038084 25142 acceptor_pool.cc:254] collecting diagnostics on the listening RPC socket 0.0.0.0:41097 every 8 connection(s)
[       OK ] Parameters/TestRpc.TestRpcContextClientDeadline/SSL_TCP (66 ms)
[ RUN      ] Parameters/TestRpc.TestApplicationFeatureFlagUnsupportedServer/SSL_TCP
I20260929 10:50:14.099984 25166 acceptor_pool.cc:254] collecting diagnostics on the listening RPC socket 0.0.0.0:41753 every 8 connection(s)
I20260929 10:50:14.100006 25167 acceptor_pool.cc:254] collecting diagnostics on the listening RPC socket 0.0.0.0:41753 every 8 connection(s)
[       OK ] Parameters/TestRpc.TestApplicationFeatureFlagUnsupportedServer/SSL_TCP (33 ms)
[ RUN      ] Parameters/TestRpc.TestCancellationAsync/SSL_TCP
I20260929 10:50:14.155222 25191 acceptor_pool.cc:254] collecting diagnostics on the listening RPC socket 0.0.0.0:33343 every 8 connection(s)
I20260929 10:50:14.155365 24759 rpc-test.cc:1716] Connecting to 0.0.0.0:33343
I20260929 10:50:14.155249 25192 acceptor_pool.cc:254] collecting diagnostics on the listening RPC socket 0.0.0.0:33343 every 8 connection(s)
I20260929 10:50:14.169430 24759 test_util.cc:268] Using random seed: -225715375
I20260929 10:50:14.185966 25195 rpc-test-base.h:240] got call: sleep_micros: 500 pattern: 4294967295 num_repetitions: 2097152 sidecar_idx: 0
I20260929 10:50:14.198670 25195 rpc-test-base.h:240] got call: sleep_micros: 500 pattern: 4294967295 num_repetitions: 2097152 sidecar_idx: 0
I20260929 10:50:14.211447 25195 rpc-test-base.h:240] got call: sleep_micros: 500 pattern: 4294967295 num_repetitions: 2097152 sidecar_idx: 0
I20260929 10:50:14.225229 25195 rpc-test-base.h:240] got call: sleep_micros: 500 pattern: 4294967295 num_repetitions: 2097152 sidecar_idx: 0
I20260929 10:50:14.238828 25195 rpc-test-base.h:240] got call: sleep_micros: 500 pattern: 4294967295 num_repetitions: 2097152 sidecar_idx: 0
I20260929 10:50:14.252621 25195 rpc-test-base.h:240] got call: sleep_micros: 500 pattern: 4294967295 num_repetitions: 2097152 sidecar_idx: 0
I20260929 10:50:14.266933 25195 rpc-test-base.h:240] got call: sleep_micros: 500 pattern: 4294967295 num_repetitions: 2097152 sidecar_idx: 0
I20260929 10:50:14.280875 25195 rpc-test-base.h:240] got call: sleep_micros: 500 pattern: 4294967295 num_repetitions: 2097152 sidecar_idx: 0
W20260929 10:50:14.284211 25190 connection.cc:441] server connection from 127.0.0.1:48108 torn down before Call kudu.rpc.GenericCalculatorService.SleepWithSidecar from 127.0.0.1:48108 (request call id 9) could send its response
[       OK ] Parameters/TestRpc.TestCancellationAsync/SSL_TCP (167 ms)
[ RUN      ] Parameters/TestRpc.TestPerformanceBySocketType/SSL_TCP
I20260929 10:50:14.305137 25216 acceptor_pool.cc:254] collecting diagnostics on the listening RPC socket 0.0.0.0:39267 every 8 connection(s)
I20260929 10:50:14.305147 25217 acceptor_pool.cc:254] collecting diagnostics on the listening RPC socket 0.0.0.0:39267 every 8 connection(s)
I20260929 10:50:14.305274 24759 rpc-test.cc:1846] Connecting to 0.0.0.0:39267
I20260929 10:50:15.973264 24759 rpc-test.cc:1859] Sending 1024MB via ssl-enabled tcp socket: real 1.656s	user 1.638s	sys 1.255s
I20260929 10:50:17.646953 24759 rpc-test.cc:1859] Sending 1024MB via ssl-enabled tcp socket: real 1.674s	user 1.568s	sys 1.374s
I20260929 10:50:19.346606 24759 rpc-test.cc:1859] Sending 1024MB via ssl-enabled tcp socket: real 1.700s	user 1.597s	sys 1.394s
I20260929 10:50:21.052906 24759 rpc-test.cc:1859] Sending 1024MB via ssl-enabled tcp socket: real 1.706s	user 1.602s	sys 1.371s
I20260929 10:50:22.702394 24759 rpc-test.cc:1859] Sending 1024MB via ssl-enabled tcp socket: real 1.649s	user 1.595s	sys 1.320s
[       OK ] Parameters/TestRpc.TestPerformanceBySocketType/SSL_TCP (8418 ms)
[----------] 20 tests from Parameters/TestRpc (29294 ms total)

[----------] 1 test from Parameters/TestRpcSocketTxRxQueue
[ RUN      ] Parameters/TestRpcSocketTxRxQueue.OverCapacity/0
W20260929 10:50:22.968905 25242 negotiation.cc:337] Failed RPC negotiation. Trace:
0929 10:50:22.706726 (+     0us) reactor.cc:625] Submitting negotiation task for client connection to 0.0.0.0:35983 (local address 127.0.0.1:54402)
0929 10:50:22.706770 (+    44us) negotiation.cc:107] Waiting for socket to connect
0929 10:50:22.706779 (+     9us) client_negotiation.cc:174] Beginning negotiation
0929 10:50:22.706826 (+    47us) client_negotiation.cc:252] Sending NEGOTIATE NegotiatePB request
0929 10:50:22.968738 (+261912us) negotiation.cc:327] Negotiation complete: Network error: Client connection negotiation failed: client connection to 0.0.0.0:35983: BlockingRecv error: recv error from unknown peer: Transport endpoint is not connected (error 107)
Metrics: {"client-negotiator.queue_time_us":18}
W20260929 10:50:22.968905 25260 negotiation.cc:337] Failed RPC negotiation. Trace:
0929 10:50:22.708607 (+     0us) reactor.cc:625] Submitting negotiation task for client connection to 0.0.0.0:35983 (local address 127.0.0.1:54420)
0929 10:50:22.708648 (+    41us) negotiation.cc:107] Waiting for socket to connect
0929 10:50:22.708656 (+     8us) client_negotiation.cc:174] Beginning negotiation
0929 10:50:22.708697 (+    41us) client_negotiation.cc:252] Sending NEGOTIATE NegotiatePB request
0929 10:50:22.968813 (+260116us) negotiation.cc:327] Negotiation complete: Network error: Client connection negotiation failed: client connection to 0.0.0.0:35983: BlockingRecv error: recv error from unknown peer: Transport endpoint is not connected (error 107)
Metrics: {"client-negotiator.queue_time_us":20}
W20260929 10:50:22.968912 25269 negotiation.cc:337] Failed RPC negotiation. Trace:
0929 10:50:22.709412 (+     0us) reactor.cc:625] Submitting negotiation task for client connection to 0.0.0.0:35983 (local address 127.0.0.1:54434)
0929 10:50:22.709473 (+    61us) negotiation.cc:107] Waiting for socket to connect
0929 10:50:22.709483 (+    10us) client_negotiation.cc:174] Beginning negotiation
0929 10:50:22.709526 (+    43us) client_negotiation.cc:252] Sending NEGOTIATE NegotiatePB request
0929 10:50:22.968753 (+259227us) negotiation.cc:327] Negotiation complete: Network error: Client connection negotiation failed: client connection to 0.0.0.0:35983: BlockingRecv error: recv error from unknown peer: Transport endpoint is not connected (error 107)
Metrics: {"client-negotiator.queue_time_us":31}
W20260929 10:50:22.969316 25251 negotiation.cc:337] Failed RPC negotiation. Trace:
0929 10:50:22.707616 (+     0us) reactor.cc:625] Submitting negotiation task for client connection to 0.0.0.0:35983 (local address 127.0.0.1:54418)
0929 10:50:22.707684 (+    68us) negotiation.cc:107] Waiting for socket to connect
0929 10:50:22.707694 (+    10us) client_negotiation.cc:174] Beginning negotiation
0929 10:50:22.707738 (+    44us) client_negotiation.cc:252] Sending NEGOTIATE NegotiatePB request
0929 10:50:22.968754 (+261016us) negotiation.cc:327] Negotiation complete: Network error: Client connection negotiation failed: client connection to 0.0.0.0:35983: BlockingRecv error: recv error from unknown peer: Transport endpoint is not connected (error 107)
Metrics: {"client-negotiator.queue_time_us":40}
W20260929 10:50:22.968912 25278 negotiation.cc:337] Failed RPC negotiation. Trace:
0929 10:50:22.710279 (+     0us) reactor.cc:625] Submitting negotiation task for client connection to 0.0.0.0:35983 (local address 127.0.0.1:54444)
0929 10:50:22.710341 (+    62us) negotiation.cc:107] Waiting for socket to connect
0929 10:50:22.710352 (+    11us) client_negotiation.cc:174] Beginning negotiation
0929 10:50:22.710402 (+    50us) client_negotiation.cc:252] Sending NEGOTIATE NegotiatePB request
0929 10:50:22.968826 (+258424us) negotiation.cc:327] Negotiation complete: Network error: Client connection negotiation failed: client connection to 0.0.0.0:35983: BlockingRecv error: recv error from unknown peer: Transport endpoint is not connected (error 107)
Metrics: {"client-negotiator.queue_time_us":38}
W20260929 10:50:22.969440 25233 negotiation.cc:337] Failed RPC negotiation. Trace:
0929 10:50:22.705857 (+     0us) reactor.cc:625] Submitting negotiation task for client connection to 0.0.0.0:35983 (local address 127.0.0.1:54390)
0929 10:50:22.705902 (+    45us) negotiation.cc:107] Waiting for socket to connect
0929 10:50:22.705913 (+    11us) client_negotiation.cc:174] Beginning negotiation
0929 10:50:22.705984 (+    71us) client_negotiation.cc:252] Sending NEGOTIATE NegotiatePB request
0929 10:50:22.968738 (+262754us) negotiation.cc:327] Negotiation complete: Network error: Client connection negotiation failed: client connection to 0.0.0.0:35983: BlockingRecv error: recv error from unknown peer: Transport endpoint is not connected (error 107)
Metrics: {"client-negotiator.queue_time_us":19}
[       OK ] Parameters/TestRpcSocketTxRxQueue.OverCapacity/0 (1032 ms)
[----------] 1 test from Parameters/TestRpcSocketTxRxQueue (1032 ms total)

[----------] Global test environment tear-down
[==========] 21 tests from 2 test suites ran. (30326 ms total)
[  PASSED  ] 20 tests.
[  FAILED  ] 1 test, listed below:
[  FAILED  ] Parameters/TestRpc.TestCallWithChainCertAndChainCA/SSL_TCP, where GetParam() = (true, false)

 1 FAILED TEST