Parameters/TestRpc.TestCallWithChainCertAndRootCA/SSL_UnixSocket: /data0/somelongdirectorytoavoidrpathissues/src/kudu/src/kudu/rpc/rpc-test.cc:303: Failure
Failed
Bad status: Runtime error: could not verify certificate chain (error with cert: subject=CN = localhost, ST = sadfjas, C = AS, emailAddress = sdflkdsajf, O = lskdfjlsad, OU = sldfkja, issuer=C = AS, ST = ASDfkjdhf, L = lskdjf, O = saldfja, OU = skdjf, CN = localhost, emailAddress = sadjflkadsj): : certificate has expired
Google Test trace:
/data0/somelongdirectorytoavoidrpathissues/src/kudu/src/kudu/rpc/rpc-test.cc:300: Connecting to unix:/tmp/dist-test-taskk6aN1Q/test-tmp/rpc-test-3b0f75d6e05b40eaae8f91a3995512e1.sock
I20260926 12:12:03.338502 3617 test_util.cc:175] -----------------------------------------------
I20260926 12:12:03.338680 3617 test_util.cc:176] Had fatal failures, leaving test files at /tmp/dist-test-taskk6aN1Q/test-tmp/rpc-test.2.Parameters_TestRpc.TestCallWithChainCertAndRootCA_SSL_UnixSocket.1790424719866444-3617-0
Note: This is test shard 3 of 8.
[==========] Running 21 tests from 2 test suites.
[----------] Global test environment set-up.
[----------] 1 test from TestRpc
[ RUN ] TestRpc.TestNegotiationTimeout
WARNING: Logging before InitGoogleLogging() is written to STDERR
I20260926 12:12:00.048779 3617 rpc-test-base.h:595] status: Timed out: connection negotiation to 0.0.0.0:46605 for RPC Sleep timed out after 0.100s (ON_OUTBOUND_QUEUE), seconds elapsed: 0.101662
W20260926 12:12:03.029927 3627 negotiation.cc:337] Failed RPC negotiation. Trace:
0926 12:11:59.947949 (+ 0us) reactor.cc:625] Submitting negotiation task for client connection to 0.0.0.0:46605 (local address 127.0.0.1:59460)
0926 12:11:59.948623 (+ 674us) negotiation.cc:107] Waiting for socket to connect
0926 12:11:59.948671 (+ 48us) client_negotiation.cc:174] Beginning negotiation
0926 12:11:59.960204 (+ 11533us) client_negotiation.cc:252] Sending NEGOTIATE NegotiatePB request
0926 12:12:03.028868 (+3068664us) negotiation.cc:327] Negotiation complete: Timed out: Client connection negotiation failed: client connection to 0.0.0.0:46605: received 0 of 4 requested bytes
Metrics: {"client-negotiator.queue_time_us":197}
[ OK ] TestRpc.TestNegotiationTimeout (3117 ms)
[----------] 1 test from TestRpc (3117 ms total)
[----------] 20 tests from Parameters/TestRpc
[ RUN ] Parameters/TestRpc.TestAcceptorPoolStartStop/SSL_UnixSocket
I20260926 12:12:03.068476 3643 acceptor_pool.cc:254] collecting diagnostics on the listening RPC socket unix:/tmp/dist-test-taskk6aN1Q/test-tmp/rpc-test-021a4bdc40ab4ba99640844ff7ed69ae.sock every 8 connection(s)
I20260926 12:12:03.069983 3644 acceptor_pool.cc:254] collecting diagnostics on the listening RPC socket unix:/tmp/dist-test-taskk6aN1Q/test-tmp/rpc-test-021a4bdc40ab4ba99640844ff7ed69ae.sock every 8 connection(s)
I20260926 12:12:03.101341 3654 acceptor_pool.cc:254] collecting diagnostics on the listening RPC socket unix:/tmp/dist-test-taskk6aN1Q/test-tmp/rpc-test-021a4bdc40ab4ba99640844ff7ed69ae.sock every 8 connection(s)
I20260926 12:12:03.102582 3655 acceptor_pool.cc:254] collecting diagnostics on the listening RPC socket unix:/tmp/dist-test-taskk6aN1Q/test-tmp/rpc-test-021a4bdc40ab4ba99640844ff7ed69ae.sock every 8 connection(s)
I20260926 12:12:03.125698 3665 acceptor_pool.cc:254] collecting diagnostics on the listening RPC socket unix:/tmp/dist-test-taskk6aN1Q/test-tmp/rpc-test-021a4bdc40ab4ba99640844ff7ed69ae.sock every 8 connection(s)
I20260926 12:12:03.126327 3666 acceptor_pool.cc:254] collecting diagnostics on the listening RPC socket unix:/tmp/dist-test-taskk6aN1Q/test-tmp/rpc-test-021a4bdc40ab4ba99640844ff7ed69ae.sock every 8 connection(s)
I20260926 12:12:03.170295 3676 acceptor_pool.cc:254] collecting diagnostics on the listening RPC socket unix:/tmp/dist-test-taskk6aN1Q/test-tmp/rpc-test-021a4bdc40ab4ba99640844ff7ed69ae.sock every 8 connection(s)
I20260926 12:12:03.171000 3677 acceptor_pool.cc:254] collecting diagnostics on the listening RPC socket unix:/tmp/dist-test-taskk6aN1Q/test-tmp/rpc-test-021a4bdc40ab4ba99640844ff7ed69ae.sock every 8 connection(s)
I20260926 12:12:03.189702 3687 acceptor_pool.cc:254] collecting diagnostics on the listening RPC socket unix:/tmp/dist-test-taskk6aN1Q/test-tmp/rpc-test-021a4bdc40ab4ba99640844ff7ed69ae.sock every 8 connection(s)
I20260926 12:12:03.190352 3688 acceptor_pool.cc:254] collecting diagnostics on the listening RPC socket unix:/tmp/dist-test-taskk6aN1Q/test-tmp/rpc-test-021a4bdc40ab4ba99640844ff7ed69ae.sock every 8 connection(s)
[ OK ] Parameters/TestRpc.TestAcceptorPoolStartStop/SSL_UnixSocket (159 ms)
[ RUN ] Parameters/TestRpc.TestCall/SSL_UnixSocket
I20260926 12:12:03.208658 3700 acceptor_pool.cc:254] collecting diagnostics on the listening RPC socket unix:/tmp/dist-test-taskk6aN1Q/test-tmp/rpc-test-696d51de2e324d3c97efd2229fe42b7f.sock every 8 connection(s)
I20260926 12:12:03.210506 3701 acceptor_pool.cc:254] collecting diagnostics on the listening RPC socket unix:/tmp/dist-test-taskk6aN1Q/test-tmp/rpc-test-696d51de2e324d3c97efd2229fe42b7f.sock every 8 connection(s)
I20260926 12:12:03.214988 3617 rpc-test.cc:234] Connecting to unix:/tmp/dist-test-taskk6aN1Q/test-tmp/rpc-test-696d51de2e324d3c97efd2229fe42b7f.sock
W20260926 12:12:03.271600 3697 connection.cc:196] Error closing socket: Network error: TlsSocket::Close: Broken pipe
[ OK ] Parameters/TestRpc.TestCall/SSL_UnixSocket (82 ms)
[ RUN ] Parameters/TestRpc.TestCallWithChainCertAndRootCA/SSL_UnixSocket
I20260926 12:12:03.318960 3725 acceptor_pool.cc:254] collecting diagnostics on the listening RPC socket unix:/tmp/dist-test-taskk6aN1Q/test-tmp/rpc-test-3b0f75d6e05b40eaae8f91a3995512e1.sock every 8 connection(s)
I20260926 12:12:03.319558 3726 acceptor_pool.cc:254] collecting diagnostics on the listening RPC socket unix:/tmp/dist-test-taskk6aN1Q/test-tmp/rpc-test-3b0f75d6e05b40eaae8f91a3995512e1.sock every 8 connection(s)
/data0/somelongdirectorytoavoidrpathissues/src/kudu/src/kudu/rpc/rpc-test.cc:303: Failure
Failed
Bad status: Runtime error: could not verify certificate chain (error with cert: subject=CN = localhost, ST = sadfjas, C = AS, emailAddress = sdflkdsajf, O = lskdfjlsad, OU = sldfkja, issuer=C = AS, ST = ASDfkjdhf, L = lskdjf, O = saldfja, OU = skdjf, CN = localhost, emailAddress = sadjflkadsj): : certificate has expired
Google Test trace:
/data0/somelongdirectorytoavoidrpathissues/src/kudu/src/kudu/rpc/rpc-test.cc:300: Connecting to unix:/tmp/dist-test-taskk6aN1Q/test-tmp/rpc-test-3b0f75d6e05b40eaae8f91a3995512e1.sock
I20260926 12:12:03.338502 3617 test_util.cc:175] -----------------------------------------------
I20260926 12:12:03.338680 3617 test_util.cc:176] Had fatal failures, leaving test files at /tmp/dist-test-taskk6aN1Q/test-tmp/rpc-test.2.Parameters_TestRpc.TestCallWithChainCertAndRootCA_SSL_UnixSocket.1790424719866444-3617-0
[ FAILED ] Parameters/TestRpc.TestCallWithChainCertAndRootCA/SSL_UnixSocket, where GetParam() = (true, true) (62 ms)
[ RUN ] Parameters/TestRpc.TestCallWithBadPasswordProtectedKey/SSL_UnixSocket
[ OK ] Parameters/TestRpc.TestCallWithBadPasswordProtectedKey/SSL_UnixSocket (28 ms)
[ RUN ] Parameters/TestRpc.TestInvalidMethodCall/SSL_UnixSocket
I20260926 12:12:03.384732 3762 acceptor_pool.cc:254] collecting diagnostics on the listening RPC socket unix:/tmp/dist-test-taskk6aN1Q/test-tmp/rpc-test-d4efd6152e044f3da9e74394db5b2890.sock every 8 connection(s)
I20260926 12:12:03.385565 3763 acceptor_pool.cc:254] collecting diagnostics on the listening RPC socket unix:/tmp/dist-test-taskk6aN1Q/test-tmp/rpc-test-d4efd6152e044f3da9e74394db5b2890.sock every 8 connection(s)
I20260926 12:12:03.389024 3617 rpc-test.cc:406] Connecting to unix:/tmp/dist-test-taskk6aN1Q/test-tmp/rpc-test-d4efd6152e044f3da9e74394db5b2890.sock
[ OK ] Parameters/TestRpc.TestInvalidMethodCall/SSL_UnixSocket (61 ms)
[ RUN ] Parameters/TestRpc.TestHighFDs/SSL_UnixSocket
I20260926 12:12:03.621969 3787 acceptor_pool.cc:254] collecting diagnostics on the listening RPC socket unix:/tmp/dist-test-taskk6aN1Q/test-tmp/rpc-test-45c5d3e5244245fdb8d7ca2fc51626b1.sock every 8 connection(s)
I20260926 12:12:03.622690 3788 acceptor_pool.cc:254] collecting diagnostics on the listening RPC socket unix:/tmp/dist-test-taskk6aN1Q/test-tmp/rpc-test-45c5d3e5244245fdb8d7ca2fc51626b1.sock every 8 connection(s)
W20260926 12:12:03.666260 3784 connection.cc:196] Error closing socket: Network error: TlsSocket::Close: Broken pipe
[ OK ] Parameters/TestRpc.TestHighFDs/SSL_UnixSocket (248 ms)
[ RUN ] Parameters/TestRpc.TestConnectionAlwaysKeepalive/SSL_UnixSocket
I20260926 12:12:03.694758 3810 acceptor_pool.cc:254] collecting diagnostics on the listening RPC socket unix:/tmp/dist-test-taskk6aN1Q/test-tmp/rpc-test-ff3e7d5a6c794046b9153e621f65e4ce.sock every 8 connection(s)
I20260926 12:12:03.695410 3811 acceptor_pool.cc:254] collecting diagnostics on the listening RPC socket unix:/tmp/dist-test-taskk6aN1Q/test-tmp/rpc-test-ff3e7d5a6c794046b9153e621f65e4ce.sock every 8 connection(s)
I20260926 12:12:03.698356 3617 rpc-test.cc:532] Connecting to unix:/tmp/dist-test-taskk6aN1Q/test-tmp/rpc-test-ff3e7d5a6c794046b9153e621f65e4ce.sock
W20260926 12:12:06.725287 3809 connection.cc:196] Error closing socket: Network error: TlsSocket::Close: Broken pipe
[ OK ] Parameters/TestRpc.TestConnectionAlwaysKeepalive/SSL_UnixSocket (3051 ms)
[ RUN ] Parameters/TestRpc.TestReopenOutboundConnections/SSL_UnixSocket
I20260926 12:12:06.746268 3833 acceptor_pool.cc:254] collecting diagnostics on the listening RPC socket unix:/tmp/dist-test-taskk6aN1Q/test-tmp/rpc-test-7c5176d691e144b6b697bac2f705673d.sock every 8 connection(s)
I20260926 12:12:06.746873 3834 acceptor_pool.cc:254] collecting diagnostics on the listening RPC socket unix:/tmp/dist-test-taskk6aN1Q/test-tmp/rpc-test-7c5176d691e144b6b697bac2f705673d.sock every 8 connection(s)
I20260926 12:12:06.749734 3617 rpc-test.cc:658] Connecting to unix:/tmp/dist-test-taskk6aN1Q/test-tmp/rpc-test-7c5176d691e144b6b697bac2f705673d.sock
W20260926 12:12:06.776579 3832 connection.cc:196] Error closing socket: Network error: TlsSocket::Close: Broken pipe
W20260926 12:12:06.785305 3832 connection.cc:196] Error closing socket: Network error: TlsSocket::Close: Broken pipe
W20260926 12:12:06.793835 3832 connection.cc:196] Error closing socket: Network error: TlsSocket::Close: Broken pipe
W20260926 12:12:06.802695 3832 connection.cc:196] Error closing socket: Network error: TlsSocket::Close: Broken pipe
W20260926 12:12:06.811697 3832 connection.cc:196] Error closing socket: Network error: TlsSocket::Close: Broken pipe
W20260926 12:12:06.820582 3832 connection.cc:196] Error closing socket: Network error: TlsSocket::Close: Broken pipe
W20260926 12:12:06.829370 3832 connection.cc:196] Error closing socket: Network error: TlsSocket::Close: Broken pipe
W20260926 12:12:06.837769 3832 connection.cc:196] Error closing socket: Network error: TlsSocket::Close: Broken pipe
W20260926 12:12:06.847055 3832 connection.cc:196] Error closing socket: Network error: TlsSocket::Close: Broken pipe
W20260926 12:12:06.855770 3832 connection.cc:196] Error closing socket: Network error: TlsSocket::Close: Broken pipe
W20260926 12:12:06.864866 3832 connection.cc:196] Error closing socket: Network error: TlsSocket::Close: Broken pipe
W20260926 12:12:06.873739 3832 connection.cc:196] Error closing socket: Network error: TlsSocket::Close: Broken pipe
W20260926 12:12:06.882697 3832 connection.cc:196] Error closing socket: Network error: TlsSocket::Close: Broken pipe
W20260926 12:12:06.892061 3832 connection.cc:196] Error closing socket: Network error: TlsSocket::Close: Broken pipe
W20260926 12:12:06.892098 3833 acceptor_pool.cc:285] unable to collect diagnostics on RPC socket unix:/tmp/dist-test-taskk6aN1Q/test-tmp/rpc-test-7c5176d691e144b6b697bac2f705673d.sock: Not implemented: netlink diagnostics is currently supported only on IPv4 TCP sockets
W20260926 12:12:06.901168 3832 connection.cc:196] Error closing socket: Network error: TlsSocket::Close: Broken pipe
W20260926 12:12:06.910092 3832 connection.cc:196] Error closing socket: Network error: TlsSocket::Close: Broken pipe
W20260926 12:12:06.919049 3832 connection.cc:196] Error closing socket: Network error: TlsSocket::Close: Broken pipe
W20260926 12:12:06.928095 3832 connection.cc:196] Error closing socket: Network error: TlsSocket::Close: Broken pipe
W20260926 12:12:06.937371 3832 connection.cc:196] Error closing socket: Network error: TlsSocket::Close: Broken pipe
W20260926 12:12:06.946480 3832 connection.cc:196] Error closing socket: Network error: TlsSocket::Close: Broken pipe
W20260926 12:12:06.955394 3832 connection.cc:196] Error closing socket: Network error: TlsSocket::Close: Broken pipe
W20260926 12:12:06.964372 3832 connection.cc:196] Error closing socket: Network error: TlsSocket::Close: Broken pipe
W20260926 12:12:06.973285 3832 connection.cc:196] Error closing socket: Network error: TlsSocket::Close: Broken pipe
W20260926 12:12:06.981954 3832 connection.cc:196] Error closing socket: Network error: TlsSocket::Close: Broken pipe
W20260926 12:12:06.990494 3832 connection.cc:196] Error closing socket: Network error: TlsSocket::Close: Broken pipe
W20260926 12:12:06.998920 3832 connection.cc:196] Error closing socket: Network error: TlsSocket::Close: Broken pipe
W20260926 12:12:07.007877 3832 connection.cc:196] Error closing socket: Network error: TlsSocket::Close: Broken pipe
W20260926 12:12:07.016466 3832 connection.cc:196] Error closing socket: Network error: TlsSocket::Close: Broken pipe
W20260926 12:12:07.024528 3832 connection.cc:196] Error closing socket: Network error: TlsSocket::Close: Broken pipe
W20260926 12:12:07.032183 3832 connection.cc:196] Error closing socket: Network error: TlsSocket::Close: Broken pipe
W20260926 12:12:07.040372 3832 connection.cc:196] Error closing socket: Network error: TlsSocket::Close: Broken pipe
W20260926 12:12:07.049875 3832 connection.cc:196] Error closing socket: Network error: TlsSocket::Close: Broken pipe
[ OK ] Parameters/TestRpc.TestReopenOutboundConnections/SSL_UnixSocket (325 ms)
[ RUN ] Parameters/TestRpc.TestConnectionNetworkPlane/SSL_UnixSocket
I20260926 12:12:07.072683 3856 acceptor_pool.cc:254] collecting diagnostics on the listening RPC socket unix:/tmp/dist-test-taskk6aN1Q/test-tmp/rpc-test-144e6bc4ac454e07a9d515d1d578ff29.sock every 8 connection(s)
I20260926 12:12:07.073347 3857 acceptor_pool.cc:254] collecting diagnostics on the listening RPC socket unix:/tmp/dist-test-taskk6aN1Q/test-tmp/rpc-test-144e6bc4ac454e07a9d515d1d578ff29.sock every 8 connection(s)
I20260926 12:12:07.076169 3617 rpc-test.cc:772] Connecting to unix:/tmp/dist-test-taskk6aN1Q/test-tmp/rpc-test-144e6bc4ac454e07a9d515d1d578ff29.sock
W20260926 12:12:07.125075 3855 connection.cc:196] Error closing socket: Network error: TlsSocket::Close: Broken pipe
W20260926 12:12:07.125665 3855 connection.cc:196] Error closing socket: Network error: TlsSocket::Close: Broken pipe
[ OK ] Parameters/TestRpc.TestConnectionNetworkPlane/SSL_UnixSocket (75 ms)
[ RUN ] Parameters/TestRpc.TestTCPKeepalive/SSL_UnixSocket
I20260926 12:12:07.155200 3881 acceptor_pool.cc:254] collecting diagnostics on the listening RPC socket unix:/tmp/dist-test-taskk6aN1Q/test-tmp/rpc-test-cdc164209b744b77a81eacf654cd0991.sock every 8 connection(s)
I20260926 12:12:07.155865 3882 acceptor_pool.cc:254] collecting diagnostics on the listening RPC socket unix:/tmp/dist-test-taskk6aN1Q/test-tmp/rpc-test-cdc164209b744b77a81eacf654cd0991.sock every 8 connection(s)
I20260926 12:12:07.211964 3885 rpc-test-base.h:222] got call: sleep_micros: 8000000 deferred: true
I20260926 12:12:15.215801 3885 rpcz_store.cc:275] Call kudu.rpc.GenericCalculatorService.Sleep from unix:<unnamed> (request call id 0) took 8003 ms. Trace:
I20260926 12:12:15.216193 3885 rpcz_store.cc:276] 0926 12:12:07.211818 (+ 0us) service_pool.cc:170] Inserting onto call queue
0926 12:12:07.211912 (+ 94us) service_pool.cc:227] Handling call
0926 12:12:15.215639 (+8003727us) inbound_call.cc:173] Queueing success response
Metrics: {}
W20260926 12:12:15.221827 3878 connection.cc:196] Error closing socket: Network error: TlsSocket::Close: Broken pipe
[ OK ] Parameters/TestRpc.TestTCPKeepalive/SSL_UnixSocket (8097 ms)
[ RUN ] Parameters/TestRpc.TestMaxSmallSidecars/SSL_UnixSocket
I20260926 12:12:15.259402 3907 acceptor_pool.cc:254] collecting diagnostics on the listening RPC socket unix:/tmp/dist-test-taskk6aN1Q/test-tmp/rpc-test-400984878d0c47e8bd1d2513327116dc.sock every 8 connection(s)
I20260926 12:12:15.260182 3908 acceptor_pool.cc:254] collecting diagnostics on the listening RPC socket unix:/tmp/dist-test-taskk6aN1Q/test-tmp/rpc-test-400984878d0c47e8bd1d2513327116dc.sock every 8 connection(s)
W20260926 12:12:15.419656 3904 connection.cc:196] Error closing socket: Network error: TlsSocket::Close: Broken pipe
[ OK ] Parameters/TestRpc.TestMaxSmallSidecars/SSL_UnixSocket (195 ms)
[ RUN ] Parameters/TestRpc.TestCallTimeout/SSL_UnixSocket
I20260926 12:12:15.465054 3932 acceptor_pool.cc:254] collecting diagnostics on the listening RPC socket unix:/tmp/dist-test-taskk6aN1Q/test-tmp/rpc-test-168af8934ed0464492c55668b3d538ef.sock every 8 connection(s)
I20260926 12:12:15.465723 3933 acceptor_pool.cc:254] collecting diagnostics on the listening RPC socket unix:/tmp/dist-test-taskk6aN1Q/test-tmp/rpc-test-168af8934ed0464492c55668b3d538ef.sock every 8 connection(s)
I20260926 12:12:15.490674 3617 rpc-test-base.h:595] status: Timed out: connection negotiation to unix:/tmp/dist-test-taskk6aN1Q/test-tmp/rpc-test-168af8934ed0464492c55668b3d538ef.sock for RPC Sleep timed out after 0.000s (ON_OUTBOUND_QUEUE), seconds elapsed: 0.00222128
I20260926 12:12:15.497931 3936 rpc-test-base.h:222] got call: sleep_micros: 700000
I20260926 12:12:15.691676 3617 rpc-test-base.h:595] status: Timed out: Sleep RPC to unix:/tmp/dist-test-taskk6aN1Q/test-tmp/rpc-test-168af8934ed0464492c55668b3d538ef.sock timed out after 0.200s (SENT), seconds elapsed: 0.200704
I20260926 12:12:15.692934 3935 rpc-test-base.h:222] got call: sleep_micros: 2000000
W20260926 12:12:16.198542 3936 rpcz_store.cc:267] Call kudu.rpc.GenericCalculatorService.Sleep from unix:<unnamed> (request call id 1) took 700 ms (client timeout 200 ms). Trace:
W20260926 12:12:16.198858 3936 rpcz_store.cc:269] 0926 12:12:15.497779 (+ 0us) service_pool.cc:170] Inserting onto call queue
0926 12:12:15.497888 (+ 109us) service_pool.cc:227] Handling call
0926 12:12:16.198483 (+700595us) inbound_call.cc:173] Queueing success response
Metrics: {}
I20260926 12:12:17.193627 3617 rpc-test-base.h:595] status: Timed out: Sleep RPC to unix:/tmp/dist-test-taskk6aN1Q/test-tmp/rpc-test-168af8934ed0464492c55668b3d538ef.sock timed out after 1.500s (SENT), seconds elapsed: 1.50166
W20260926 12:12:17.693400 3935 rpcz_store.cc:267] Call kudu.rpc.GenericCalculatorService.Sleep from unix:<unnamed> (request call id 2) took 2000 ms (client timeout 1500 ms). Trace:
W20260926 12:12:17.693732 3935 rpcz_store.cc:269] 0926 12:12:15.692775 (+ 0us) service_pool.cc:170] Inserting onto call queue
0926 12:12:15.692877 (+ 102us) service_pool.cc:227] Handling call
0926 12:12:17.693349 (+2000472us) inbound_call.cc:173] Queueing success response
Metrics: {}
W20260926 12:12:17.694237 3929 connection.cc:441] server connection from unix:<unnamed> torn down before Call kudu.rpc.GenericCalculatorService.Sleep from unix:<unnamed> (request call id 2) could send its response
[ OK ] Parameters/TestRpc.TestCallTimeout/SSL_UnixSocket (2275 ms)
[ RUN ] Parameters/TestRpc.TestServerShutsDown/SSL_UnixSocket
I20260926 12:12:17.700683 3617 rpc-test.cc:1125] Connecting to 0.0.0.0:39367
W20260926 12:12:17.709573 3949 negotiation.cc:337] Failed RPC negotiation. Trace:
0926 12:12:17.708135 (+ 0us) reactor.cc:625] Submitting negotiation task for client connection to 0.0.0.0:39367 (local address 127.0.0.1:48884)
0926 12:12:17.708601 (+ 466us) negotiation.cc:107] Waiting for socket to connect
0926 12:12:17.708637 (+ 36us) client_negotiation.cc:174] Beginning negotiation
0926 12:12:17.708842 (+ 205us) client_negotiation.cc:252] Sending NEGOTIATE NegotiatePB request
0926 12:12:17.709081 (+ 239us) negotiation.cc:327] Negotiation complete: Network error: Client connection negotiation failed: client connection to 0.0.0.0:39367: BlockingWrite error: write error: Broken pipe (error 32)
Metrics: {"client-negotiator.queue_time_us":147}
[ OK ] Parameters/TestRpc.TestServerShutsDown/SSL_UnixSocket (12 ms)
[ RUN ] Parameters/TestRpc.TimedOutOnResponseMetric/SSL_UnixSocket
I20260926 12:12:17.740688 3966 acceptor_pool.cc:254] collecting diagnostics on the listening RPC socket unix:/tmp/dist-test-taskk6aN1Q/test-tmp/rpc-test-8f511443fd484497adb0c396088f2bcd.sock every 8 connection(s)
I20260926 12:12:17.741398 3967 acceptor_pool.cc:254] collecting diagnostics on the listening RPC socket unix:/tmp/dist-test-taskk6aN1Q/test-tmp/rpc-test-8f511443fd484497adb0c396088f2bcd.sock every 8 connection(s)
W20260926 12:12:18.001607 3970 rpcz_store.cc:267] Call kudu.rpc_test.CalculatorService.Sleep from unix:<unnamed> (request call id 3) took 50 ms (client timeout 25 ms). Trace:
W20260926 12:12:18.001909 3970 rpcz_store.cc:269] 0926 12:12:17.951001 (+ 0us) service_pool.cc:170] Inserting onto call queue
0926 12:12:17.951120 (+ 119us) service_pool.cc:227] Handling call
0926 12:12:18.001537 (+ 50417us) inbound_call.cc:173] Queueing success response
Related trace 'test_child':
Metrics: {"test_sleep_us":50000,"child_traces":[["test_child",{"related_trace_metric":1}]]}
W20260926 12:12:18.060635 3970 rpcz_store.cc:267] Call kudu.rpc_test.CalculatorService.Sleep from unix:<unnamed> (request call id 4) took 50 ms (client timeout 50 ms). Trace:
W20260926 12:12:18.061025 3970 rpcz_store.cc:269] 0926 12:12:18.010085 (+ 0us) service_pool.cc:170] Inserting onto call queue
0926 12:12:18.010207 (+ 122us) service_pool.cc:227] Handling call
0926 12:12:18.060562 (+ 50355us) inbound_call.cc:173] Queueing success response
Related trace 'test_child':
Metrics: {"test_sleep_us":50000,"child_traces":[["test_child",{"related_trace_metric":1}]]}
W20260926 12:12:18.062971 3963 connection.cc:196] Error closing socket: Network error: TlsSocket::Close: Broken pipe
W20260926 12:12:18.063282 3963 connection.cc:441] server connection from unix:<unnamed> torn down before Call kudu.rpc_test.CalculatorService.Sleep from unix:<unnamed> (request call id 4) could send its response
[ OK ] Parameters/TestRpc.TimedOutOnResponseMetric/SSL_UnixSocket (355 ms)
[ RUN ] Parameters/TestRpc.AcceptorDispatchingTimesMetric/SSL_UnixSocket
I20260926 12:12:18.078253 3991 acceptor_pool.cc:254] collecting diagnostics on the listening RPC socket 0.0.0.0:40107 every 8 connection(s)
I20260926 12:12:18.078868 3992 acceptor_pool.cc:254] collecting diagnostics on the listening RPC socket 0.0.0.0:40107 every 8 connection(s)
W20260926 12:12:18.083416 3987 negotiation.cc:337] Failed RPC negotiation. Trace:
0926 12:12:18.082257 (+ 0us) reactor.cc:625] Submitting negotiation task for server connection from 127.0.0.1:41998 (local address 127.0.0.1:40107)
0926 12:12:18.082760 (+ 503us) server_negotiation.cc:206] Beginning negotiation
0926 12:12:18.082776 (+ 16us) server_negotiation.cc:399] Waiting for connection header
0926 12:12:18.082994 (+ 218us) negotiation.cc:327] Negotiation complete: Network error: Server connection negotiation failed: server connection from 127.0.0.1:41998: BlockingRecv error: recv got EOF from 127.0.0.1:41998 (error 108)
Metrics: {"server-negotiator.queue_time_us":200}
[ OK ] Parameters/TestRpc.AcceptorDispatchingTimesMetric/SSL_UnixSocket (20 ms)
[ RUN ] Parameters/TestRpc.TestRpcCallbackDestroysMessenger/SSL_UnixSocket
[ OK ] Parameters/TestRpc.TestRpcCallbackDestroysMessenger/SSL_UnixSocket (17 ms)
[ RUN ] Parameters/TestRpc.TestApplicationFeatureFlag/SSL_UnixSocket
I20260926 12:12:18.165828 4016 acceptor_pool.cc:254] collecting diagnostics on the listening RPC socket unix:/tmp/dist-test-taskk6aN1Q/test-tmp/rpc-test-44ebc582f335498bbc1ae93daecbf51c.sock every 8 connection(s)
I20260926 12:12:18.166437 4017 acceptor_pool.cc:254] collecting diagnostics on the listening RPC socket unix:/tmp/dist-test-taskk6aN1Q/test-tmp/rpc-test-44ebc582f335498bbc1ae93daecbf51c.sock every 8 connection(s)
W20260926 12:12:18.224386 4013 messenger.cc:357] Unable to handle RPC call: Not implemented: call requires unsupported application feature flags: 99
[ OK ] Parameters/TestRpc.TestApplicationFeatureFlag/SSL_UnixSocket (125 ms)
[ RUN ] Parameters/TestRpc.TestCancellation/SSL_UnixSocket
I20260926 12:12:18.244299 4041 acceptor_pool.cc:254] collecting diagnostics on the listening RPC socket unix:/tmp/dist-test-taskk6aN1Q/test-tmp/rpc-test-3fd2c4b2d4634435b78d853148a6cf15.sock every 8 connection(s)
I20260926 12:12:18.244910 4042 acceptor_pool.cc:254] collecting diagnostics on the listening RPC socket unix:/tmp/dist-test-taskk6aN1Q/test-tmp/rpc-test-3fd2c4b2d4634435b78d853148a6cf15.sock every 8 connection(s)
I20260926 12:12:18.247766 3617 rpc-test.cc:1648] Connecting to unix:/tmp/dist-test-taskk6aN1Q/test-tmp/rpc-test-3fd2c4b2d4634435b78d853148a6cf15.sock
I20260926 12:12:18.344411 3617 rpc-test-base.h:595] status: Aborted: Sleep RPC to unix:/tmp/dist-test-taskk6aN1Q/test-tmp/rpc-test-3fd2c4b2d4634435b78d853148a6cf15.sock is cancelled in state READY, seconds elapsed: 0.000406813
I20260926 12:12:18.517699 3617 rpc-test-base.h:595] status: Aborted: Sleep RPC to unix:/tmp/dist-test-taskk6aN1Q/test-tmp/rpc-test-3fd2c4b2d4634435b78d853148a6cf15.sock is cancelled in state SENT, seconds elapsed: 0.000819672
I20260926 12:12:18.517912 4044 rpc-test-base.h:222] got call: sleep_micros: 510000
I20260926 12:12:18.688386 3617 rpc-test-base.h:595] status: Aborted: Sleep RPC to unix:/tmp/dist-test-taskk6aN1Q/test-tmp/rpc-test-3fd2c4b2d4634435b78d853148a6cf15.sock is cancelled in state SENT, seconds elapsed: 0.000661486
I20260926 12:12:18.688690 4043 rpc-test-base.h:222] got call: sleep_micros: 510000
I20260926 12:12:18.859086 3617 rpc-test-base.h:595] status: Aborted: Sleep RPC to unix:/tmp/dist-test-taskk6aN1Q/test-tmp/rpc-test-3fd2c4b2d4634435b78d853148a6cf15.sock is cancelled in state SENT, seconds elapsed: 0.000869958
W20260926 12:12:18.869877 4045 rpcz_store.cc:267] Call kudu.rpc.GenericCalculatorService.Sleep from unix:<unnamed> (request call id 11) took 10 ms (client timeout 10 ms). Trace:
W20260926 12:12:18.870210 4045 rpcz_store.cc:269] 0926 12:12:18.859038 (+ 0us) service_pool.cc:170] Inserting onto call queue
0926 12:12:18.869640 (+ 10602us) service_pool.cc:214] Skipping call since client already timed out
0926 12:12:18.869719 (+ 79us) inbound_call.cc:173] Queueing failure response
Metrics: {}
I20260926 12:12:18.870725 4045 rpc-test-base.h:222] got call: sleep_micros: 1500000
W20260926 12:12:19.028476 4044 rpcz_store.cc:267] Call kudu.rpc.GenericCalculatorService.Sleep from unix:<unnamed> (request call id 3) took 510 ms (client timeout 10 ms). Trace:
W20260926 12:12:19.028760 4044 rpcz_store.cc:269] 0926 12:12:18.517735 (+ 0us) service_pool.cc:170] Inserting onto call queue
0926 12:12:18.517857 (+ 122us) service_pool.cc:227] Handling call
0926 12:12:19.028414 (+510557us) inbound_call.cc:173] Queueing success response
Metrics: {}
W20260926 12:12:19.199270 4043 rpcz_store.cc:267] Call kudu.rpc.GenericCalculatorService.Sleep from unix:<unnamed> (request call id 7) took 510 ms (client timeout 10 ms). Trace:
W20260926 12:12:19.199579 4043 rpcz_store.cc:269] 0926 12:12:18.688538 (+ 0us) service_pool.cc:170] Inserting onto call queue
0926 12:12:18.688641 (+ 103us) service_pool.cc:227] Handling call
0926 12:12:19.199218 (+510577us) inbound_call.cc:173] Queueing success response
Metrics: {}
I20260926 12:12:19.861433 3617 rpc-test-base.h:595] status: Timed out: Sleep RPC to unix:/tmp/dist-test-taskk6aN1Q/test-tmp/rpc-test-3fd2c4b2d4634435b78d853148a6cf15.sock timed out after 1.000s (SENT), seconds elapsed: 1.00207
I20260926 12:12:19.862602 4043 rpc-test-base.h:222] got call: sleep_micros: 1500000
W20260926 12:12:20.371445 4045 rpcz_store.cc:267] Call kudu.rpc.GenericCalculatorService.Sleep from unix:<unnamed> (request call id 12) took 1511 ms (client timeout 1000 ms). Trace:
W20260926 12:12:20.371840 4045 rpcz_store.cc:269] 0926 12:12:18.860086 (+ 0us) service_pool.cc:170] Inserting onto call queue
0926 12:12:18.870690 (+ 10604us) service_pool.cc:227] Handling call
0926 12:12:20.371296 (+1500606us) inbound_call.cc:173] Queueing success response
Metrics: {}
I20260926 12:12:20.863570 3617 rpc-test-base.h:595] status: Timed out: Sleep RPC to unix:/tmp/dist-test-taskk6aN1Q/test-tmp/rpc-test-3fd2c4b2d4634435b78d853148a6cf15.sock timed out after 1.000s (SENT), seconds elapsed: 1.00176
W20260926 12:12:20.865284 4038 messenger.cc:357] Unable to handle RPC call: Not implemented: call requires unsupported application feature flags: 99, 1
W20260926 12:12:20.866762 4038 messenger.cc:357] Unable to handle RPC call: Not implemented: call requires unsupported application feature flags: 99, 1
W20260926 12:12:21.068852 4038 connection.cc:196] Error closing socket: Network error: TlsSocket::Close: Broken pipe
W20260926 12:12:21.363184 4043 rpcz_store.cc:267] Call kudu.rpc.GenericCalculatorService.Sleep from unix:<unnamed> (request call id 13) took 1500 ms (client timeout 1000 ms). Trace:
W20260926 12:12:21.363500 4043 rpcz_store.cc:269] 0926 12:12:19.862432 (+ 0us) service_pool.cc:170] Inserting onto call queue
0926 12:12:19.862561 (+ 129us) service_pool.cc:227] Handling call
0926 12:12:21.363046 (+1500485us) inbound_call.cc:173] Queueing success response
Metrics: {}
W20260926 12:12:21.364063 4038 connection.cc:441] server connection from unix:<unnamed> torn down before Call kudu.rpc.GenericCalculatorService.Sleep from unix:<unnamed> (request call id 13) could send its response
[ OK ] Parameters/TestRpc.TestCancellation/SSL_UnixSocket (3139 ms)
[ RUN ] Parameters/TestRpc.TestCancellationMultiThreads/SSL_UnixSocket
I20260926 12:12:21.417060 4067 acceptor_pool.cc:254] collecting diagnostics on the listening RPC socket unix:/tmp/dist-test-taskk6aN1Q/test-tmp/rpc-test-cfdbe197f1464c858f242629a571fdbe.sock every 8 connection(s)
I20260926 12:12:21.417835 4068 acceptor_pool.cc:254] collecting diagnostics on the listening RPC socket unix:/tmp/dist-test-taskk6aN1Q/test-tmp/rpc-test-cfdbe197f1464c858f242629a571fdbe.sock every 8 connection(s)
I20260926 12:12:21.420687 3617 rpc-test.cc:1808] Connecting to unix:/tmp/dist-test-taskk6aN1Q/test-tmp/rpc-test-cfdbe197f1464c858f242629a571fdbe.sock
I20260926 12:12:21.562222 4081 test_util.cc:268] Using random seed: -1095252221
I20260926 12:12:21.563248 4082 test_util.cc:268] Using random seed: -1095251143
I20260926 12:12:21.565371 4083 test_util.cc:268] Using random seed: -1095249092
I20260926 12:12:21.566675 4084 test_util.cc:268] Using random seed: -1095247701
I20260926 12:12:21.568161 4085 test_util.cc:268] Using random seed: -1095246344
I20260926 12:12:21.569604 4086 test_util.cc:268] Using random seed: -1095244887
I20260926 12:12:21.571115 4087 test_util.cc:268] Using random seed: -1095243376
I20260926 12:12:21.572561 4088 test_util.cc:268] Using random seed: -1095241937
I20260926 12:12:21.573845 4089 test_util.cc:268] Using random seed: -1095240654
I20260926 12:12:21.575219 4090 test_util.cc:268] Using random seed: -1095239283
I20260926 12:12:21.576519 4091 test_util.cc:268] Using random seed: -1095237967
I20260926 12:12:21.577907 4092 test_util.cc:268] Using random seed: -1095236641
I20260926 12:12:21.579469 4093 test_util.cc:268] Using random seed: -1095235032
I20260926 12:12:21.581372 4094 test_util.cc:268] Using random seed: -1095233173
I20260926 12:12:21.582760 4095 test_util.cc:268] Using random seed: -1095231777
I20260926 12:12:21.584244 4096 test_util.cc:268] Using random seed: -1095230292
I20260926 12:12:21.585845 4097 test_util.cc:268] Using random seed: -1095228695
I20260926 12:12:21.587363 4098 test_util.cc:268] Using random seed: -1095227170
I20260926 12:12:21.588762 4099 test_util.cc:268] Using random seed: -1095225768
I20260926 12:12:21.590263 4100 test_util.cc:268] Using random seed: -1095224232
I20260926 12:12:21.591825 4101 test_util.cc:268] Using random seed: -1095222687
I20260926 12:12:21.594183 4102 test_util.cc:268] Using random seed: -1095220339
I20260926 12:12:21.595644 4103 test_util.cc:268] Using random seed: -1095218861
I20260926 12:12:21.597478 4104 test_util.cc:268] Using random seed: -1095217011
I20260926 12:12:21.599207 4105 test_util.cc:268] Using random seed: -1095215333
I20260926 12:12:21.600873 4106 test_util.cc:268] Using random seed: -1095213687
I20260926 12:12:21.602375 4107 test_util.cc:268] Using random seed: -1095212166
I20260926 12:12:21.603842 4108 test_util.cc:268] Using random seed: -1095210666
I20260926 12:12:21.605566 4109 test_util.cc:268] Using random seed: -1095208940
I20260926 12:12:21.607079 4110 test_util.cc:268] Using random seed: -1095207393
W20260926 12:12:40.476008 4064 connection.cc:196] Error closing socket: Network error: TlsSocket::Close: Broken pipe
[ OK ] Parameters/TestRpc.TestCancellationMultiThreads/SSL_UnixSocket (19120 ms)
[ RUN ] Parameters/TestRpc.TestCallId/SSL_UnixSocket
I20260926 12:12:40.511019 4124 acceptor_pool.cc:254] collecting diagnostics on the listening RPC socket unix:/tmp/dist-test-taskk6aN1Q/test-tmp/rpc-test-695cb753535e484bbb1039d8bdbeda73.sock every 8 connection(s)
I20260926 12:12:40.511837 4125 acceptor_pool.cc:254] collecting diagnostics on the listening RPC socket unix:/tmp/dist-test-taskk6aN1Q/test-tmp/rpc-test-695cb753535e484bbb1039d8bdbeda73.sock every 8 connection(s)
[ OK ] Parameters/TestRpc.TestCallId/SSL_UnixSocket (75 ms)
[----------] 20 tests from Parameters/TestRpc (37533 ms total)
[----------] Global test environment tear-down
[==========] 21 tests from 2 test suites ran. (40652 ms total)
[ PASSED ] 20 tests.
[ FAILED ] 1 test, listed below:
[ FAILED ] Parameters/TestRpc.TestCallWithChainCertAndRootCA/SSL_UnixSocket, where GetParam() = (true, true)
1 FAILED TEST
I20260926 12:12:40.585549 3617 logging.cc:424] LogThrottler /data0/somelongdirectorytoavoidrpathissues/src/kudu/src/kudu/rpc/acceptor_pool.cc:285: suppressed but not reported on 3 messages since previous log ~33 seconds ago