Diagnosed failure
Parameters/TestRpc.TestCallWithChainCertAndChainCA/SSL_UnixSocket: /data0/somelongdirectorytoavoidrpathissues/src/kudu/src/kudu/rpc/rpc-test.cc:270: Failure
Failed
Bad status: Runtime error: could not verify certificate chain (error with cert: subject=CN = localhost, ST = sadfjas, C = AS, emailAddress = sdflkdsajf, O = lskdfjlsad, OU = sldfkja, issuer=C = AS, ST = ASDfkjdhf, L = lskdjf, O = saldfja, OU = skdjf, CN = localhost, emailAddress = sadjflkadsj): : certificate has expired
Google Test trace:
/data0/somelongdirectorytoavoidrpathissues/src/kudu/src/kudu/rpc/rpc-test.cc:267: Connecting to unix:/tmp/dist-test-taskiyzfxm/test-tmp/rpc-test-a8bbaeff80c345dbaaa77b990e55780b.sock
I20260929 10:49:57.516923 29422 test_util.cc:175] -----------------------------------------------
I20260929 10:49:57.516983 29422 test_util.cc:176] Had fatal failures, leaving test files at /tmp/dist-test-taskiyzfxm/test-tmp/rpc-test.6.Parameters_TestRpc.TestCallWithChainCertAndChainCA_SSL_UnixSocket.1790678997364734-29422-0
Full log
Note: This is test shard 7 of 8.
[==========] Running 21 tests from 2 test suites.
[----------] Global test environment set-up.
[----------] 20 tests from Parameters/TestRpc
[ RUN ] Parameters/TestRpc.TestMessengerCreateDestroy/SSL_UnixSocket
WARNING: Logging before InitGoogleLogging() is written to STDERR
I20260929 10:49:57.471951 29422 rpc-test.cc:169] started messenger TestCreateDestroy
[ OK ] Parameters/TestRpc.TestMessengerCreateDestroy/SSL_UnixSocket (97 ms)
[ RUN ] Parameters/TestRpc.TestNegotiationDeadlock/SSL_UnixSocket
I20260929 10:49:57.481781 29443 acceptor_pool.cc:254] collecting diagnostics on the listening RPC socket unix:/tmp/dist-test-taskiyzfxm/test-tmp/rpc-test-8b63886d7ba04986badb80b6de2ff6c7.sock every 8 connection(s)
I20260929 10:49:57.481784 29442 acceptor_pool.cc:254] collecting diagnostics on the listening RPC socket unix:/tmp/dist-test-taskiyzfxm/test-tmp/rpc-test-8b63886d7ba04986badb80b6de2ff6c7.sock every 8 connection(s)
[ OK ] Parameters/TestRpc.TestNegotiationDeadlock/SSL_UnixSocket (25 ms)
[ RUN ] Parameters/TestRpc.TestCallWithChainCertAndChainCA/SSL_UnixSocket
I20260929 10:49:57.513010 29458 acceptor_pool.cc:254] collecting diagnostics on the listening RPC socket unix:/tmp/dist-test-taskiyzfxm/test-tmp/rpc-test-a8bbaeff80c345dbaaa77b990e55780b.sock every 8 connection(s)
I20260929 10:49:57.513033 29459 acceptor_pool.cc:254] collecting diagnostics on the listening RPC socket unix:/tmp/dist-test-taskiyzfxm/test-tmp/rpc-test-a8bbaeff80c345dbaaa77b990e55780b.sock every 8 connection(s)
/data0/somelongdirectorytoavoidrpathissues/src/kudu/src/kudu/rpc/rpc-test.cc:270: Failure
Failed
Bad status: Runtime error: could not verify certificate chain (error with cert: subject=CN = localhost, ST = sadfjas, C = AS, emailAddress = sdflkdsajf, O = lskdfjlsad, OU = sldfkja, issuer=C = AS, ST = ASDfkjdhf, L = lskdjf, O = saldfja, OU = skdjf, CN = localhost, emailAddress = sadjflkadsj): : certificate has expired
Google Test trace:
/data0/somelongdirectorytoavoidrpathissues/src/kudu/src/kudu/rpc/rpc-test.cc:267: Connecting to unix:/tmp/dist-test-taskiyzfxm/test-tmp/rpc-test-a8bbaeff80c345dbaaa77b990e55780b.sock
I20260929 10:49:57.516923 29422 test_util.cc:175] -----------------------------------------------
I20260929 10:49:57.516983 29422 test_util.cc:176] Had fatal failures, leaving test files at /tmp/dist-test-taskiyzfxm/test-tmp/rpc-test.6.Parameters_TestRpc.TestCallWithChainCertAndChainCA_SSL_UnixSocket.1790678997364734-29422-0
[ FAILED ] Parameters/TestRpc.TestCallWithChainCertAndChainCA/SSL_UnixSocket, where GetParam() = (true, true) (18 ms)
[ RUN ] Parameters/TestRpc.TestCallWithPasswordProtectedKey/SSL_UnixSocket
I20260929 10:49:57.541334 29483 acceptor_pool.cc:254] collecting diagnostics on the listening RPC socket unix:/tmp/dist-test-taskiyzfxm/test-tmp/rpc-test-40df390ea4554dac966c5e795bee18d2.sock every 8 connection(s)
I20260929 10:49:57.541354 29484 acceptor_pool.cc:254] collecting diagnostics on the listening RPC socket unix:/tmp/dist-test-taskiyzfxm/test-tmp/rpc-test-40df390ea4554dac966c5e795bee18d2.sock every 8 connection(s)
W20260929 10:49:57.552729 29480 connection.cc:196] Error closing socket: Network error: TlsSocket::Close: Broken pipe
[ OK ] Parameters/TestRpc.TestCallWithPasswordProtectedKey/SSL_UnixSocket (37 ms)
[ RUN ] Parameters/TestRpc.TestCallToBadServer/SSL_UnixSocket
I20260929 10:49:57.560540 29422 rpc-test.cc:394] Status: Network error: Client connection negotiation failed: client connection to 0.0.0.0:0: connect: Connection refused (error 111)
I20260929 10:49:57.560823 29422 rpc-test.cc:394] Status: Network error: Client connection negotiation failed: client connection to 0.0.0.0:0: connect: Connection refused (error 111)
I20260929 10:49:57.561127 29422 rpc-test.cc:394] Status: Network error: Client connection negotiation failed: client connection to 0.0.0.0:0: connect: Connection refused (error 111)
I20260929 10:49:57.561316 29422 rpc-test.cc:394] Status: Network error: Client connection negotiation failed: client connection to 0.0.0.0:0: connect: Connection refused (error 111)
I20260929 10:49:57.561468 29422 rpc-test.cc:394] Status: Network error: Client connection negotiation failed: client connection to 0.0.0.0:0: connect: Connection refused (error 111)
[ OK ] Parameters/TestRpc.TestCallToBadServer/SSL_UnixSocket (7 ms)
[ RUN ] Parameters/TestRpc.TestWrongService/SSL_UnixSocket
I20260929 10:49:57.578926 29518 acceptor_pool.cc:254] collecting diagnostics on the listening RPC socket unix:/tmp/dist-test-taskiyzfxm/test-tmp/rpc-test-f9c40253153a4ef0b77591df1a3f6927.sock every 8 connection(s)
I20260929 10:49:57.578930 29519 acceptor_pool.cc:254] collecting diagnostics on the listening RPC socket unix:/tmp/dist-test-taskiyzfxm/test-tmp/rpc-test-f9c40253153a4ef0b77591df1a3f6927.sock every 8 connection(s)
I20260929 10:49:57.601259 29515 messenger.cc:345] service WrongServiceName not registered on TestServer
W20260929 10:49:57.601889 29515 connection.cc:196] Error closing socket: Network error: TlsSocket::Close: Broken pipe
[ OK ] Parameters/TestRpc.TestWrongService/SSL_UnixSocket (41 ms)
[ RUN ] Parameters/TestRpc.TestConnectionKeepalive/SSL_UnixSocket
I20260929 10:49:57.616068 29541 acceptor_pool.cc:254] collecting diagnostics on the listening RPC socket unix:/tmp/dist-test-taskiyzfxm/test-tmp/rpc-test-bac480ee3da84563b0a49c0a5aaf81c5.sock every 8 connection(s)
I20260929 10:49:57.616087 29542 acceptor_pool.cc:254] collecting diagnostics on the listening RPC socket unix:/tmp/dist-test-taskiyzfxm/test-tmp/rpc-test-bac480ee3da84563b0a49c0a5aaf81c5.sock every 8 connection(s)
I20260929 10:49:57.616230 29422 rpc-test.cc:488] Connecting to unix:/tmp/dist-test-taskiyzfxm/test-tmp/rpc-test-bac480ee3da84563b0a49c0a5aaf81c5.sock
W20260929 10:49:58.104444 29554 connection.cc:196] Error closing socket: Network error: TlsSocket::Close: Broken pipe
[ OK ] Parameters/TestRpc.TestConnectionKeepalive/SSL_UnixSocket (1047 ms)
[ RUN ] Parameters/TestRpc.TestClientConnectionMetrics/SSL_UnixSocket
I20260929 10:49:58.659010 29566 acceptor_pool.cc:254] collecting diagnostics on the listening RPC socket unix:/tmp/dist-test-taskiyzfxm/test-tmp/rpc-test-aa6daed6aa614bb18eba7efefb4b03d6.sock every 8 connection(s)
I20260929 10:49:58.659052 29567 acceptor_pool.cc:254] collecting diagnostics on the listening RPC socket unix:/tmp/dist-test-taskiyzfxm/test-tmp/rpc-test-aa6daed6aa614bb18eba7efefb4b03d6.sock every 8 connection(s)
I20260929 10:49:58.659214 29422 rpc-test.cc:569] Connecting to unix:/tmp/dist-test-taskiyzfxm/test-tmp/rpc-test-aa6daed6aa614bb18eba7efefb4b03d6.sock
W20260929 10:50:06.648236 29563 connection.cc:196] Error closing socket: Network error: TlsSocket::Close: Broken pipe
[ OK ] Parameters/TestRpc.TestClientConnectionMetrics/SSL_UnixSocket (7998 ms)
[ RUN ] Parameters/TestRpc.TestCredentialsPolicy/SSL_UnixSocket
I20260929 10:50:06.682920 29589 acceptor_pool.cc:254] collecting diagnostics on the listening RPC socket unix:/tmp/dist-test-taskiyzfxm/test-tmp/rpc-test-9b21e118676c4cc59adfb5947e3a45d4.sock every 8 connection(s)
I20260929 10:50:06.682962 29590 acceptor_pool.cc:254] collecting diagnostics on the listening RPC socket unix:/tmp/dist-test-taskiyzfxm/test-tmp/rpc-test-9b21e118676c4cc59adfb5947e3a45d4.sock every 8 connection(s)
I20260929 10:50:06.683103 29422 rpc-test.cc:700] Connecting to unix:/tmp/dist-test-taskiyzfxm/test-tmp/rpc-test-9b21e118676c4cc59adfb5947e3a45d4.sock
W20260929 10:50:06.705288 29588 connection.cc:196] Error closing socket: Network error: TlsSocket::Close: Broken pipe
[ OK ] Parameters/TestRpc.TestCredentialsPolicy/SSL_UnixSocket (60 ms)
[ RUN ] Parameters/TestRpc.TestCallLongerThanKeepalive/SSL_UnixSocket
I20260929 10:50:06.722266 29614 acceptor_pool.cc:254] collecting diagnostics on the listening RPC socket unix:/tmp/dist-test-taskiyzfxm/test-tmp/rpc-test-d3e392b4512747f7817f547fbeba125d.sock every 8 connection(s)
I20260929 10:50:06.722316 29615 acceptor_pool.cc:254] collecting diagnostics on the listening RPC socket unix:/tmp/dist-test-taskiyzfxm/test-tmp/rpc-test-d3e392b4512747f7817f547fbeba125d.sock every 8 connection(s)
I20260929 10:50:06.743503 29618 rpc-test-base.h:222] got call: sleep_micros: 3000000 deferred: true
I20260929 10:50:09.745594 29618 rpcz_store.cc:275] Call kudu.rpc.GenericCalculatorService.Sleep from unix:<unnamed> (request call id 0) took 3002 ms. Trace:
I20260929 10:50:09.745694 29618 rpcz_store.cc:276] 0929 10:50:06.743456 (+ 0us) service_pool.cc:170] Inserting onto call queue
0929 10:50:06.743486 (+ 30us) service_pool.cc:227] Handling call
0929 10:50:09.745577 (+3002091us) inbound_call.cc:173] Queueing success response
Metrics: {}
[ OK ] Parameters/TestRpc.TestCallLongerThanKeepalive/SSL_UnixSocket (3038 ms)
[ RUN ] Parameters/TestRpc.TestRpcSidecar/SSL_UnixSocket
I20260929 10:50:09.759554 29639 acceptor_pool.cc:254] collecting diagnostics on the listening RPC socket unix:/tmp/dist-test-taskiyzfxm/test-tmp/rpc-test-f937707687294fa596ca59d69487c6db.sock every 8 connection(s)
I20260929 10:50:09.759622 29640 acceptor_pool.cc:254] collecting diagnostics on the listening RPC socket unix:/tmp/dist-test-taskiyzfxm/test-tmp/rpc-test-f937707687294fa596ca59d69487c6db.sock every 8 connection(s)
W20260929 10:50:09.803905 29636 connection.cc:196] Error closing socket: Network error: TlsSocket::Close: Broken pipe
[ OK ] Parameters/TestRpc.TestRpcSidecar/SSL_UnixSocket (57 ms)
[ RUN ] Parameters/TestRpc.TestRpcSidecarLimits/SSL_UnixSocket
I20260929 10:50:11.561386 29664 acceptor_pool.cc:254] collecting diagnostics on the listening RPC socket unix:/tmp/dist-test-taskiyzfxm/test-tmp/rpc-test-28c63999f9d74e398ba36e42d7df9f77.sock every 8 connection(s)
I20260929 10:50:11.561426 29665 acceptor_pool.cc:254] collecting diagnostics on the listening RPC socket unix:/tmp/dist-test-taskiyzfxm/test-tmp/rpc-test-28c63999f9d74e398ba36e42d7df9f77.sock every 8 connection(s)
W20260929 10:50:11.574275 29422 serialization.cc:72] Serialized kudu.rpc_test.PushStringsRequestPB (2147483654 bytes) is larger than the maximum configured RPC message size (52428800 bytes). Sending anyway, but peer may reject the data.
W20260929 10:50:11.577389 29661 connection.cc:535] server connection from unix:<unnamed> recv error: Network error: RPC frame had a length of 2147483714, but we only support messages up to 52428800 bytes long.
W20260929 10:50:11.577453 29661 connection.cc:158] shutting down server connection from unix:<unnamed> with pending inbound data: 4/2147483714 bytes received; last active 0 ns ago: status Network error: RPC frame had a length of 2147483714, but we only support messages up to 52428800 bytes long.
W20260929 10:50:11.577656 29677 connection.cc:196] Error closing socket: Network error: TlsSocket::Close: Broken pipe
I20260929 10:50:11.597309 29690 acceptor_pool.cc:254] collecting diagnostics on the listening RPC socket unix:/tmp/dist-test-taskiyzfxm/test-tmp/rpc-test-28c63999f9d74e398ba36e42d7df9f77.sock every 8 connection(s)
I20260929 10:50:11.597440 29689 acceptor_pool.cc:254] collecting diagnostics on the listening RPC socket unix:/tmp/dist-test-taskiyzfxm/test-tmp/rpc-test-28c63999f9d74e398ba36e42d7df9f77.sock every 8 connection(s)
W20260929 10:50:16.274967 29686 connection.cc:577] server connection from unix:<unnamed>: received bad data: 'Corruption: Invalid packet: message had a length of 2147483710, but we only support messages up to 2147483647 bytes
'
W20260929 10:50:16.275319 29702 connection.cc:196] Error closing socket: Network error: TlsSocket::Close: Broken pipe
[ OK ] Parameters/TestRpc.TestRpcSidecarLimits/SSL_UnixSocket (6471 ms)
[ RUN ] Parameters/TestRpc.TestCallTimeoutDoesntAffectNegotiation/SSL_UnixSocket
I20260929 10:50:16.300793 29714 acceptor_pool.cc:254] collecting diagnostics on the listening RPC socket unix:/tmp/dist-test-taskiyzfxm/test-tmp/rpc-test-9b4ff4613a36423e8f1889943faf409e.sock every 8 connection(s)
I20260929 10:50:16.300827 29715 acceptor_pool.cc:254] collecting diagnostics on the listening RPC socket unix:/tmp/dist-test-taskiyzfxm/test-tmp/rpc-test-9b4ff4613a36423e8f1889943faf409e.sock every 8 connection(s)
W20260929 10:50:16.308564 29710 negotiation.cc:266] Injecting 500ms delay in negotiation
I20260929 10:50:16.358865 29422 rpc-test-base.h:595] status: Timed out: connection negotiation to unix:/tmp/dist-test-taskiyzfxm/test-tmp/rpc-test-9b4ff4613a36423e8f1889943faf409e.sock for RPC Sleep timed out after 0.050s (ON_OUTBOUND_QUEUE), seconds elapsed: 0.0505361
[ OK ] Parameters/TestRpc.TestCallTimeoutDoesntAffectNegotiation/SSL_UnixSocket (536 ms)
[ RUN ] Parameters/TestRpc.TestRpcHandlerLatencyMetric/SSL_UnixSocket
I20260929 10:50:16.826208 29739 acceptor_pool.cc:254] collecting diagnostics on the listening RPC socket unix:/tmp/dist-test-taskiyzfxm/test-tmp/rpc-test-a6d1711f2e544949a7fe175e8aefdd91.sock every 8 connection(s)
I20260929 10:50:16.826236 29740 acceptor_pool.cc:254] collecting diagnostics on the listening RPC socket unix:/tmp/dist-test-taskiyzfxm/test-tmp/rpc-test-a6d1711f2e544949a7fe175e8aefdd91.sock every 8 connection(s)
I20260929 10:50:16.867040 29422 rpc-test.cc:1236] Sleep() min lat: 20289
I20260929 10:50:16.867108 29422 rpc-test.cc:1237] Sleep() mean lat: 20289
I20260929 10:50:16.867134 29422 rpc-test.cc:1238] Sleep() max lat: 20289
I20260929 10:50:16.867146 29422 rpc-test.cc:1239] Sleep() #calls: 1
W20260929 10:50:16.867733 29736 connection.cc:196] Error closing socket: Network error: TlsSocket::Close: Broken pipe
[ OK ] Parameters/TestRpc.TestRpcHandlerLatencyMetric/SSL_UnixSocket (55 ms)
[ RUN ] Parameters/TestRpc.TimedOutOnResponseMetricServiceQueue/SSL_UnixSocket
I20260929 10:50:16.897780 29765 acceptor_pool.cc:254] collecting diagnostics on the listening RPC socket unix:/tmp/dist-test-taskiyzfxm/test-tmp/rpc-test-271e806807924187b903674180ac6912.sock every 8 connection(s)
I20260929 10:50:16.897832 29766 acceptor_pool.cc:254] collecting diagnostics on the listening RPC socket unix:/tmp/dist-test-taskiyzfxm/test-tmp/rpc-test-271e806807924187b903674180ac6912.sock every 8 connection(s)
W20260929 10:50:16.959369 29767 rpcz_store.cc:267] Call kudu.rpc_test.CalculatorService.Sleep from unix:<unnamed> (request call id 2) took 20 ms (client timeout 20 ms). Trace:
W20260929 10:50:16.959465 29767 rpcz_store.cc:269] 0929 10:50:16.939097 (+ 0us) service_pool.cc:170] Inserting onto call queue
0929 10:50:16.959339 (+ 20242us) service_pool.cc:214] Skipping call since client already timed out
0929 10:50:16.959353 (+ 14us) inbound_call.cc:173] Queueing failure response
Metrics: {}
[ OK ] Parameters/TestRpc.TimedOutOnResponseMetricServiceQueue/SSL_UnixSocket (92 ms)
[ RUN ] Parameters/TestRpc.RpcPendingConnectionsMetric/SSL_UnixSocket
I20260929 10:50:16.962478 29788 acceptor_pool.cc:254] collecting diagnostics on the listening RPC socket 0.0.0.0:33061 every 8 connection(s)
I20260929 10:50:16.962507 29789 acceptor_pool.cc:254] collecting diagnostics on the listening RPC socket 0.0.0.0:33061 every 8 connection(s)
W20260929 10:50:16.963243 29784 negotiation.cc:337] Failed RPC negotiation. Trace:
0929 10:50:16.963062 (+ 0us) reactor.cc:625] Submitting negotiation task for server connection from 127.0.0.1:37640 (local address 127.0.0.1:33061)
0929 10:50:16.963106 (+ 44us) server_negotiation.cc:206] Beginning negotiation
0929 10:50:16.963108 (+ 2us) server_negotiation.cc:399] Waiting for connection header
0929 10:50:16.963188 (+ 80us) negotiation.cc:327] Negotiation complete: Network error: Server connection negotiation failed: server connection from 127.0.0.1:37640: BlockingRecv error: recv got EOF from 127.0.0.1:37640 (error 108)
Metrics: {"server-negotiator.queue_time_us":14}
[ OK ] Parameters/TestRpc.RpcPendingConnectionsMetric/SSL_UnixSocket (13 ms)
[ RUN ] Parameters/TestRpc.TestRpcContextClientDeadline/SSL_UnixSocket
I20260929 10:50:16.989194 29804 acceptor_pool.cc:254] collecting diagnostics on the listening RPC socket unix:/tmp/dist-test-taskiyzfxm/test-tmp/rpc-test-b024c17a424445f68b463278b14fa711.sock every 8 connection(s)
I20260929 10:50:16.989220 29805 acceptor_pool.cc:254] collecting diagnostics on the listening RPC socket unix:/tmp/dist-test-taskiyzfxm/test-tmp/rpc-test-b024c17a424445f68b463278b14fa711.sock every 8 connection(s)
W20260929 10:50:17.029846 29801 connection.cc:196] Error closing socket: Network error: TlsSocket::Close: Broken pipe
[ OK ] Parameters/TestRpc.TestRpcContextClientDeadline/SSL_UnixSocket (56 ms)
[ RUN ] Parameters/TestRpc.TestApplicationFeatureFlagUnsupportedServer/SSL_UnixSocket
I20260929 10:50:17.039139 29830 acceptor_pool.cc:254] collecting diagnostics on the listening RPC socket unix:/tmp/dist-test-taskiyzfxm/test-tmp/rpc-test-7d2cb87b8774485db8bed068af0e0d5c.sock every 8 connection(s)
I20260929 10:50:17.039096 29829 acceptor_pool.cc:254] collecting diagnostics on the listening RPC socket unix:/tmp/dist-test-taskiyzfxm/test-tmp/rpc-test-7d2cb87b8774485db8bed068af0e0d5c.sock every 8 connection(s)
[ OK ] Parameters/TestRpc.TestApplicationFeatureFlagUnsupportedServer/SSL_UnixSocket (40 ms)
[ RUN ] Parameters/TestRpc.TestCancellationAsync/SSL_UnixSocket
I20260929 10:50:17.085320 29854 acceptor_pool.cc:254] collecting diagnostics on the listening RPC socket unix:/tmp/dist-test-taskiyzfxm/test-tmp/rpc-test-facf8a95e3b84b88862829fddf22ea11.sock every 8 connection(s)
I20260929 10:50:17.085361 29855 acceptor_pool.cc:254] collecting diagnostics on the listening RPC socket unix:/tmp/dist-test-taskiyzfxm/test-tmp/rpc-test-facf8a95e3b84b88862829fddf22ea11.sock every 8 connection(s)
I20260929 10:50:17.085498 29422 rpc-test.cc:1716] Connecting to unix:/tmp/dist-test-taskiyzfxm/test-tmp/rpc-test-facf8a95e3b84b88862829fddf22ea11.sock
I20260929 10:50:17.105069 29422 test_util.cc:268] Using random seed: -222779736
I20260929 10:50:17.118355 29858 rpc-test-base.h:240] got call: sleep_micros: 500 pattern: 4294967295 num_repetitions: 2097152 sidecar_idx: 0
I20260929 10:50:17.128291 29858 rpc-test-base.h:240] got call: sleep_micros: 500 pattern: 4294967295 num_repetitions: 2097152 sidecar_idx: 0
I20260929 10:50:17.138348 29858 rpc-test-base.h:240] got call: sleep_micros: 500 pattern: 4294967295 num_repetitions: 2097152 sidecar_idx: 0
I20260929 10:50:17.148293 29858 rpc-test-base.h:240] got call: sleep_micros: 500 pattern: 4294967295 num_repetitions: 2097152 sidecar_idx: 0
I20260929 10:50:17.158453 29858 rpc-test-base.h:240] got call: sleep_micros: 500 pattern: 4294967295 num_repetitions: 2097152 sidecar_idx: 0
I20260929 10:50:17.169040 29858 rpc-test-base.h:240] got call: sleep_micros: 500 pattern: 4294967295 num_repetitions: 2097152 sidecar_idx: 0
I20260929 10:50:17.179286 29858 rpc-test-base.h:240] got call: sleep_micros: 500 pattern: 4294967295 num_repetitions: 2097152 sidecar_idx: 0
I20260929 10:50:17.189079 29858 rpc-test-base.h:240] got call: sleep_micros: 500 pattern: 4294967295 num_repetitions: 2097152 sidecar_idx: 0
W20260929 10:50:17.190886 29851 connection.cc:196] Error closing socket: Network error: TlsSocket::Close: Broken pipe
W20260929 10:50:17.192281 29851 connection.cc:441] server connection from unix:<unnamed> torn down before Call kudu.rpc.GenericCalculatorService.SleepWithSidecar from unix:<unnamed> (request call id 9) could send its response
[ OK ] Parameters/TestRpc.TestCancellationAsync/SSL_UnixSocket (121 ms)
[ RUN ] Parameters/TestRpc.TestPerformanceBySocketType/SSL_UnixSocket
I20260929 10:50:17.215047 29879 acceptor_pool.cc:254] collecting diagnostics on the listening RPC socket unix:/tmp/dist-test-taskiyzfxm/test-tmp/rpc-test-7c0ebd3551724bd1a118841b654c490b.sock every 8 connection(s)
I20260929 10:50:17.215206 29422 rpc-test.cc:1846] Connecting to unix:/tmp/dist-test-taskiyzfxm/test-tmp/rpc-test-7c0ebd3551724bd1a118841b654c490b.sock
I20260929 10:50:17.215082 29880 acceptor_pool.cc:254] collecting diagnostics on the listening RPC socket unix:/tmp/dist-test-taskiyzfxm/test-tmp/rpc-test-7c0ebd3551724bd1a118841b654c490b.sock every 8 connection(s)
I20260929 10:50:18.399760 29422 rpc-test.cc:1859] Sending 1024MB via ssl-enabled unix socket: real 1.175s user 1.378s sys 0.733s
I20260929 10:50:19.577205 29422 rpc-test.cc:1859] Sending 1024MB via ssl-enabled unix socket: real 1.177s user 1.232s sys 0.880s
I20260929 10:50:20.787034 29422 rpc-test.cc:1859] Sending 1024MB via ssl-enabled unix socket: real 1.210s user 1.353s sys 0.817s
I20260929 10:50:21.986066 29422 rpc-test.cc:1859] Sending 1024MB via ssl-enabled unix socket: real 1.199s user 1.402s sys 0.746s
I20260929 10:50:23.168669 29422 rpc-test.cc:1859] Sending 1024MB via ssl-enabled unix socket: real 1.183s user 1.209s sys 0.917s
W20260929 10:50:23.169317 29876 connection.cc:196] Error closing socket: Network error: TlsSocket::Close: Broken pipe
[ OK ] Parameters/TestRpc.TestPerformanceBySocketType/SSL_UnixSocket (5977 ms)
[----------] 20 tests from Parameters/TestRpc (25795 ms total)
[----------] 1 test from Parameters/TestRpcSocketTxRxQueue
[ RUN ] Parameters/TestRpcSocketTxRxQueue.AcceptorRxQueueSizeMetric/0
I20260929 10:50:23.171810 29904 acceptor_pool.cc:254] collecting diagnostics on the listening RPC socket 0.0.0.0:45829 every 1 connection(s)
I20260929 10:50:23.171872 29905 acceptor_pool.cc:254] collecting diagnostics on the listening RPC socket 0.0.0.0:45829 every 1 connection(s)
W20260929 10:50:23.172333 29900 negotiation.cc:337] Failed RPC negotiation. Trace:
0929 10:50:23.172204 (+ 0us) reactor.cc:625] Submitting negotiation task for server connection from 127.0.0.1:35352 (local address 127.0.0.1:45829)
0929 10:50:23.172243 (+ 39us) server_negotiation.cc:206] Beginning negotiation
0929 10:50:23.172244 (+ 1us) server_negotiation.cc:399] Waiting for connection header
0929 10:50:23.172305 (+ 61us) negotiation.cc:327] Negotiation complete: Network error: Server connection negotiation failed: server connection from 127.0.0.1:35352: BlockingRecv error: recv got EOF from 127.0.0.1:35352 (error 108)
Metrics: {"server-negotiator.queue_time_us":15}
[ OK ] Parameters/TestRpcSocketTxRxQueue.AcceptorRxQueueSizeMetric/0 (3 ms)
[----------] 1 test from Parameters/TestRpcSocketTxRxQueue (3 ms total)
[----------] Global test environment tear-down
[==========] 21 tests from 2 test suites ran. (25799 ms total)
[ PASSED ] 20 tests.
[ FAILED ] 1 test, listed below:
[ FAILED ] Parameters/TestRpc.TestCallWithChainCertAndChainCA/SSL_UnixSocket, where GetParam() = (true, true)
1 FAILED TEST