Diagnosed failure
Parameters/TestRpc.TestCallWithChainCertAndChainCA/SSL_UnixSocket: /data0/somelongdirectorytoavoidrpathissues/src/kudu/src/kudu/rpc/rpc-test.cc:270: Failure
Failed
Bad status: Runtime error: could not verify certificate chain (error with cert: subject=CN = localhost, ST = sadfjas, C = AS, emailAddress = sdflkdsajf, O = lskdfjlsad, OU = sldfkja, issuer=C = AS, ST = ASDfkjdhf, L = lskdjf, O = saldfja, OU = skdjf, CN = localhost, emailAddress = sadjflkadsj): : certificate has expired
Google Test trace:
/data0/somelongdirectorytoavoidrpathissues/src/kudu/src/kudu/rpc/rpc-test.cc:267: Connecting to unix:/tmp/dist-test-taskdRvqlB/test-tmp/rpc-test-3145a29217664dd1a607ddd66da3cc4c.sock
I20260928 22:46:55.789439 383 test_util.cc:175] -----------------------------------------------
I20260928 22:46:55.789510 383 test_util.cc:176] Had fatal failures, leaving test files at /tmp/dist-test-taskdRvqlB/test-tmp/rpc-test.6.Parameters_TestRpc.TestCallWithChainCertAndChainCA_SSL_UnixSocket.1790635615736115-383-0
Full log
Note: This is test shard 7 of 8.
[==========] Running 21 tests from 2 test suites.
[----------] Global test environment set-up.
[----------] 20 tests from Parameters/TestRpc
[ RUN ] Parameters/TestRpc.TestMessengerCreateDestroy/SSL_UnixSocket
WARNING: Logging before InitGoogleLogging() is written to STDERR
I20260928 22:46:55.755126 383 rpc-test.cc:169] started messenger TestCreateDestroy
[ OK ] Parameters/TestRpc.TestMessengerCreateDestroy/SSL_UnixSocket (17 ms)
[ RUN ] Parameters/TestRpc.TestNegotiationDeadlock/SSL_UnixSocket
I20260928 22:46:55.770311 403 acceptor_pool.cc:254] collecting diagnostics on the listening RPC socket unix:/tmp/dist-test-taskdRvqlB/test-tmp/rpc-test-4056c917e2254feeb60c4eaa969b6b91.sock every 8 connection(s)
I20260928 22:46:55.770329 404 acceptor_pool.cc:254] collecting diagnostics on the listening RPC socket unix:/tmp/dist-test-taskdRvqlB/test-tmp/rpc-test-4056c917e2254feeb60c4eaa969b6b91.sock every 8 connection(s)
[ OK ] Parameters/TestRpc.TestNegotiationDeadlock/SSL_UnixSocket (21 ms)
[ RUN ] Parameters/TestRpc.TestCallWithChainCertAndChainCA/SSL_UnixSocket
I20260928 22:46:55.785085 419 acceptor_pool.cc:254] collecting diagnostics on the listening RPC socket unix:/tmp/dist-test-taskdRvqlB/test-tmp/rpc-test-3145a29217664dd1a607ddd66da3cc4c.sock every 8 connection(s)
I20260928 22:46:55.785104 420 acceptor_pool.cc:254] collecting diagnostics on the listening RPC socket unix:/tmp/dist-test-taskdRvqlB/test-tmp/rpc-test-3145a29217664dd1a607ddd66da3cc4c.sock every 8 connection(s)
/data0/somelongdirectorytoavoidrpathissues/src/kudu/src/kudu/rpc/rpc-test.cc:270: Failure
Failed
Bad status: Runtime error: could not verify certificate chain (error with cert: subject=CN = localhost, ST = sadfjas, C = AS, emailAddress = sdflkdsajf, O = lskdfjlsad, OU = sldfkja, issuer=C = AS, ST = ASDfkjdhf, L = lskdjf, O = saldfja, OU = skdjf, CN = localhost, emailAddress = sadjflkadsj): : certificate has expired
Google Test trace:
/data0/somelongdirectorytoavoidrpathissues/src/kudu/src/kudu/rpc/rpc-test.cc:267: Connecting to unix:/tmp/dist-test-taskdRvqlB/test-tmp/rpc-test-3145a29217664dd1a607ddd66da3cc4c.sock
I20260928 22:46:55.789439 383 test_util.cc:175] -----------------------------------------------
I20260928 22:46:55.789510 383 test_util.cc:176] Had fatal failures, leaving test files at /tmp/dist-test-taskdRvqlB/test-tmp/rpc-test.6.Parameters_TestRpc.TestCallWithChainCertAndChainCA_SSL_UnixSocket.1790635615736115-383-0
[ FAILED ] Parameters/TestRpc.TestCallWithChainCertAndChainCA/SSL_UnixSocket, where GetParam() = (true, true) (11 ms)
[ RUN ] Parameters/TestRpc.TestCallWithPasswordProtectedKey/SSL_UnixSocket
I20260928 22:46:55.798272 444 acceptor_pool.cc:254] collecting diagnostics on the listening RPC socket unix:/tmp/dist-test-taskdRvqlB/test-tmp/rpc-test-18ca8420029246508ea17b11e4e4512e.sock every 8 connection(s)
I20260928 22:46:55.798398 445 acceptor_pool.cc:254] collecting diagnostics on the listening RPC socket unix:/tmp/dist-test-taskdRvqlB/test-tmp/rpc-test-18ca8420029246508ea17b11e4e4512e.sock every 8 connection(s)
W20260928 22:46:55.809283 441 connection.cc:196] Error closing socket: Network error: TlsSocket::Close: Broken pipe
[ OK ] Parameters/TestRpc.TestCallWithPasswordProtectedKey/SSL_UnixSocket (21 ms)
[ RUN ] Parameters/TestRpc.TestCallToBadServer/SSL_UnixSocket
I20260928 22:46:55.822423 383 rpc-test.cc:394] Status: Network error: Client connection negotiation failed: client connection to 0.0.0.0:0: connect: Connection refused (error 111)
I20260928 22:46:55.822664 383 rpc-test.cc:394] Status: Network error: Client connection negotiation failed: client connection to 0.0.0.0:0: connect: Connection refused (error 111)
I20260928 22:46:55.822867 383 rpc-test.cc:394] Status: Network error: Client connection negotiation failed: client connection to 0.0.0.0:0: connect: Connection refused (error 111)
I20260928 22:46:55.823024 383 rpc-test.cc:394] Status: Network error: Client connection negotiation failed: client connection to 0.0.0.0:0: connect: Connection refused (error 111)
I20260928 22:46:55.823172 383 rpc-test.cc:394] Status: Network error: Client connection negotiation failed: client connection to 0.0.0.0:0: connect: Connection refused (error 111)
[ OK ] Parameters/TestRpc.TestCallToBadServer/SSL_UnixSocket (13 ms)
[ RUN ] Parameters/TestRpc.TestWrongService/SSL_UnixSocket
I20260928 22:46:55.831298 479 acceptor_pool.cc:254] collecting diagnostics on the listening RPC socket unix:/tmp/dist-test-taskdRvqlB/test-tmp/rpc-test-442b40d764d54c30883f96db701a4606.sock every 8 connection(s)
I20260928 22:46:55.831349 480 acceptor_pool.cc:254] collecting diagnostics on the listening RPC socket unix:/tmp/dist-test-taskdRvqlB/test-tmp/rpc-test-442b40d764d54c30883f96db701a4606.sock every 8 connection(s)
I20260928 22:46:55.851536 476 messenger.cc:345] service WrongServiceName not registered on TestServer
W20260928 22:46:55.852118 476 connection.cc:196] Error closing socket: Network error: TlsSocket::Close: Broken pipe
[ OK ] Parameters/TestRpc.TestWrongService/SSL_UnixSocket (29 ms)
[ RUN ] Parameters/TestRpc.TestConnectionKeepalive/SSL_UnixSocket
I20260928 22:46:55.869930 502 acceptor_pool.cc:254] collecting diagnostics on the listening RPC socket unix:/tmp/dist-test-taskdRvqlB/test-tmp/rpc-test-3a22b917e0844db58c464bd5e2ee9597.sock every 8 connection(s)
I20260928 22:46:55.869971 503 acceptor_pool.cc:254] collecting diagnostics on the listening RPC socket unix:/tmp/dist-test-taskdRvqlB/test-tmp/rpc-test-3a22b917e0844db58c464bd5e2ee9597.sock every 8 connection(s)
I20260928 22:46:55.870180 383 rpc-test.cc:488] Connecting to unix:/tmp/dist-test-taskdRvqlB/test-tmp/rpc-test-3a22b917e0844db58c464bd5e2ee9597.sock
W20260928 22:46:56.355211 515 connection.cc:196] Error closing socket: Network error: TlsSocket::Close: Broken pipe
[ OK ] Parameters/TestRpc.TestConnectionKeepalive/SSL_UnixSocket (1035 ms)
[ RUN ] Parameters/TestRpc.TestClientConnectionMetrics/SSL_UnixSocket
I20260928 22:46:56.904009 527 acceptor_pool.cc:254] collecting diagnostics on the listening RPC socket unix:/tmp/dist-test-taskdRvqlB/test-tmp/rpc-test-61a42d7c7dc74212ab8e387abe3b4aa0.sock every 8 connection(s)
I20260928 22:46:56.904050 528 acceptor_pool.cc:254] collecting diagnostics on the listening RPC socket unix:/tmp/dist-test-taskdRvqlB/test-tmp/rpc-test-61a42d7c7dc74212ab8e387abe3b4aa0.sock every 8 connection(s)
I20260928 22:46:56.904208 383 rpc-test.cc:569] Connecting to unix:/tmp/dist-test-taskdRvqlB/test-tmp/rpc-test-61a42d7c7dc74212ab8e387abe3b4aa0.sock
W20260928 22:47:05.240435 524 connection.cc:196] Error closing socket: Network error: TlsSocket::Close: Broken pipe
[ OK ] Parameters/TestRpc.TestClientConnectionMetrics/SSL_UnixSocket (8352 ms)
[ RUN ] Parameters/TestRpc.TestCredentialsPolicy/SSL_UnixSocket
I20260928 22:47:05.283496 550 acceptor_pool.cc:254] collecting diagnostics on the listening RPC socket unix:/tmp/dist-test-taskdRvqlB/test-tmp/rpc-test-765db7fd239e427cbc4f6447b09ed272.sock every 8 connection(s)
I20260928 22:47:05.283548 551 acceptor_pool.cc:254] collecting diagnostics on the listening RPC socket unix:/tmp/dist-test-taskdRvqlB/test-tmp/rpc-test-765db7fd239e427cbc4f6447b09ed272.sock every 8 connection(s)
I20260928 22:47:05.283715 383 rpc-test.cc:700] Connecting to unix:/tmp/dist-test-taskdRvqlB/test-tmp/rpc-test-765db7fd239e427cbc4f6447b09ed272.sock
W20260928 22:47:05.297771 549 connection.cc:196] Error closing socket: Network error: TlsSocket::Close: Broken pipe
W20260928 22:47:05.301401 549 connection.cc:196] Error closing socket: Network error: TlsSocket::Close: Broken pipe
[ OK ] Parameters/TestRpc.TestCredentialsPolicy/SSL_UnixSocket (60 ms)
[ RUN ] Parameters/TestRpc.TestCallLongerThanKeepalive/SSL_UnixSocket
I20260928 22:47:05.317162 575 acceptor_pool.cc:254] collecting diagnostics on the listening RPC socket unix:/tmp/dist-test-taskdRvqlB/test-tmp/rpc-test-b578fd5637ca468b87aa1aba8006336b.sock every 8 connection(s)
I20260928 22:47:05.317193 576 acceptor_pool.cc:254] collecting diagnostics on the listening RPC socket unix:/tmp/dist-test-taskdRvqlB/test-tmp/rpc-test-b578fd5637ca468b87aa1aba8006336b.sock every 8 connection(s)
I20260928 22:47:05.336079 578 rpc-test-base.h:222] got call: sleep_micros: 3000000 deferred: true
I20260928 22:47:08.337018 578 rpcz_store.cc:275] Call kudu.rpc.GenericCalculatorService.Sleep from unix:<unnamed> (request call id 0) took 3001 ms. Trace:
I20260928 22:47:08.337152 578 rpcz_store.cc:276] 0928 22:47:05.336017 (+ 0us) service_pool.cc:170] Inserting onto call queue
0928 22:47:05.336053 (+ 36us) service_pool.cc:227] Handling call
0928 22:47:08.337001 (+3000948us) inbound_call.cc:173] Queueing success response
Metrics: {}
[ OK ] Parameters/TestRpc.TestCallLongerThanKeepalive/SSL_UnixSocket (3036 ms)
[ RUN ] Parameters/TestRpc.TestRpcSidecar/SSL_UnixSocket
I20260928 22:47:08.358049 601 acceptor_pool.cc:254] collecting diagnostics on the listening RPC socket unix:/tmp/dist-test-taskdRvqlB/test-tmp/rpc-test-797a69f2df074903b1f6ecacc1ceb6d7.sock every 8 connection(s)
I20260928 22:47:08.358074 600 acceptor_pool.cc:254] collecting diagnostics on the listening RPC socket unix:/tmp/dist-test-taskdRvqlB/test-tmp/rpc-test-797a69f2df074903b1f6ecacc1ceb6d7.sock every 8 connection(s)
W20260928 22:47:08.399987 597 connection.cc:196] Error closing socket: Network error: TlsSocket::Close: Broken pipe
[ OK ] Parameters/TestRpc.TestRpcSidecar/SSL_UnixSocket (62 ms)
[ RUN ] Parameters/TestRpc.TestRpcSidecarLimits/SSL_UnixSocket
I20260928 22:47:10.201212 625 acceptor_pool.cc:254] collecting diagnostics on the listening RPC socket unix:/tmp/dist-test-taskdRvqlB/test-tmp/rpc-test-1cee016140a34c1786fefc5bcb3d2385.sock every 8 connection(s)
I20260928 22:47:10.201249 626 acceptor_pool.cc:254] collecting diagnostics on the listening RPC socket unix:/tmp/dist-test-taskdRvqlB/test-tmp/rpc-test-1cee016140a34c1786fefc5bcb3d2385.sock every 8 connection(s)
W20260928 22:47:10.230448 383 serialization.cc:72] Serialized kudu.rpc_test.PushStringsRequestPB (2147483654 bytes) is larger than the maximum configured RPC message size (52428800 bytes). Sending anyway, but peer may reject the data.
W20260928 22:47:10.233771 622 connection.cc:535] server connection from unix:<unnamed> recv error: Network error: RPC frame had a length of 2147483714, but we only support messages up to 52428800 bytes long.
W20260928 22:47:10.233850 622 connection.cc:158] shutting down server connection from unix:<unnamed> with pending inbound data: 4/2147483714 bytes received; last active 0 ns ago: status Network error: RPC frame had a length of 2147483714, but we only support messages up to 52428800 bytes long.
W20260928 22:47:10.234036 638 connection.cc:196] Error closing socket: Network error: TlsSocket::Close: Broken pipe
I20260928 22:47:10.248704 650 acceptor_pool.cc:254] collecting diagnostics on the listening RPC socket unix:/tmp/dist-test-taskdRvqlB/test-tmp/rpc-test-1cee016140a34c1786fefc5bcb3d2385.sock every 8 connection(s)
I20260928 22:47:10.248750 651 acceptor_pool.cc:254] collecting diagnostics on the listening RPC socket unix:/tmp/dist-test-taskdRvqlB/test-tmp/rpc-test-1cee016140a34c1786fefc5bcb3d2385.sock every 8 connection(s)
W20260928 22:47:14.941355 647 connection.cc:577] server connection from unix:<unnamed>: received bad data: 'Corruption: Invalid packet: message had a length of 2147483710, but we only support messages up to 2147483647 bytes
'
W20260928 22:47:14.941630 663 connection.cc:196] Error closing socket: Network error: TlsSocket::Close: Broken pipe
[ OK ] Parameters/TestRpc.TestRpcSidecarLimits/SSL_UnixSocket (6542 ms)
[ RUN ] Parameters/TestRpc.TestCallTimeoutDoesntAffectNegotiation/SSL_UnixSocket
I20260928 22:47:14.956321 675 acceptor_pool.cc:254] collecting diagnostics on the listening RPC socket unix:/tmp/dist-test-taskdRvqlB/test-tmp/rpc-test-acec8af704a84fa097b55441c87aecf2.sock every 8 connection(s)
I20260928 22:47:14.956459 676 acceptor_pool.cc:254] collecting diagnostics on the listening RPC socket unix:/tmp/dist-test-taskdRvqlB/test-tmp/rpc-test-acec8af704a84fa097b55441c87aecf2.sock every 8 connection(s)
W20260928 22:47:14.972584 671 negotiation.cc:266] Injecting 500ms delay in negotiation
I20260928 22:47:15.023051 383 rpc-test-base.h:595] status: Timed out: connection negotiation to unix:/tmp/dist-test-taskdRvqlB/test-tmp/rpc-test-acec8af704a84fa097b55441c87aecf2.sock for RPC Sleep timed out after 0.050s (ON_OUTBOUND_QUEUE), seconds elapsed: 0.0507342
[ OK ] Parameters/TestRpc.TestCallTimeoutDoesntAffectNegotiation/SSL_UnixSocket (534 ms)
[ RUN ] Parameters/TestRpc.TestRpcHandlerLatencyMetric/SSL_UnixSocket
I20260928 22:47:15.486734 700 acceptor_pool.cc:254] collecting diagnostics on the listening RPC socket unix:/tmp/dist-test-taskdRvqlB/test-tmp/rpc-test-9b6d10f705f74e8baff5bfe981efd6b2.sock every 8 connection(s)
I20260928 22:47:15.486869 701 acceptor_pool.cc:254] collecting diagnostics on the listening RPC socket unix:/tmp/dist-test-taskdRvqlB/test-tmp/rpc-test-9b6d10f705f74e8baff5bfe981efd6b2.sock every 8 connection(s)
I20260928 22:47:15.521329 383 rpc-test.cc:1236] Sleep() min lat: 20364
I20260928 22:47:15.521436 383 rpc-test.cc:1237] Sleep() mean lat: 20364
I20260928 22:47:15.521473 383 rpc-test.cc:1238] Sleep() max lat: 20364
I20260928 22:47:15.521494 383 rpc-test.cc:1239] Sleep() #calls: 1
W20260928 22:47:15.522034 697 connection.cc:196] Error closing socket: Network error: TlsSocket::Close: Broken pipe
[ OK ] Parameters/TestRpc.TestRpcHandlerLatencyMetric/SSL_UnixSocket (44 ms)
[ RUN ] Parameters/TestRpc.TimedOutOnResponseMetricServiceQueue/SSL_UnixSocket
I20260928 22:47:15.537742 726 acceptor_pool.cc:254] collecting diagnostics on the listening RPC socket unix:/tmp/dist-test-taskdRvqlB/test-tmp/rpc-test-ad8a934365c3436eac5d00676cbbc415.sock every 8 connection(s)
I20260928 22:47:15.537799 727 acceptor_pool.cc:254] collecting diagnostics on the listening RPC socket unix:/tmp/dist-test-taskdRvqlB/test-tmp/rpc-test-ad8a934365c3436eac5d00676cbbc415.sock every 8 connection(s)
W20260928 22:47:15.591593 728 rpcz_store.cc:267] Call kudu.rpc_test.CalculatorService.Sleep from unix:<unnamed> (request call id 2) took 20 ms (client timeout 20 ms). Trace:
W20260928 22:47:15.591725 728 rpcz_store.cc:269] 0928 22:47:15.571250 (+ 0us) service_pool.cc:170] Inserting onto call queue
0928 22:47:15.591561 (+ 20311us) service_pool.cc:214] Skipping call since client already timed out
0928 22:47:15.591576 (+ 15us) inbound_call.cc:173] Queueing failure response
Metrics: {}
W20260928 22:47:15.592483 723 connection.cc:196] Error closing socket: Network error: TlsSocket::Close: Broken pipe
[ OK ] Parameters/TestRpc.TimedOutOnResponseMetricServiceQueue/SSL_UnixSocket (69 ms)
[ RUN ] Parameters/TestRpc.RpcPendingConnectionsMetric/SSL_UnixSocket
I20260928 22:47:15.595214 749 acceptor_pool.cc:254] collecting diagnostics on the listening RPC socket 0.0.0.0:34177 every 8 connection(s)
I20260928 22:47:15.595275 750 acceptor_pool.cc:254] collecting diagnostics on the listening RPC socket 0.0.0.0:34177 every 8 connection(s)
W20260928 22:47:15.604975 745 negotiation.cc:337] Failed RPC negotiation. Trace:
0928 22:47:15.604642 (+ 0us) reactor.cc:625] Submitting negotiation task for server connection from 127.0.0.1:38988 (local address 127.0.0.1:34177)
0928 22:47:15.604704 (+ 62us) server_negotiation.cc:206] Beginning negotiation
0928 22:47:15.604707 (+ 3us) server_negotiation.cc:399] Waiting for connection header
0928 22:47:15.604846 (+ 139us) negotiation.cc:327] Negotiation complete: Network error: Server connection negotiation failed: server connection from 127.0.0.1:38988: BlockingRecv error: recv got EOF from 127.0.0.1:38988 (error 108)
Metrics: {"server-negotiator.queue_time_us":22}
[ OK ] Parameters/TestRpc.RpcPendingConnectionsMetric/SSL_UnixSocket (22 ms)
[ RUN ] Parameters/TestRpc.TestRpcContextClientDeadline/SSL_UnixSocket
I20260928 22:47:15.651937 765 acceptor_pool.cc:254] collecting diagnostics on the listening RPC socket unix:/tmp/dist-test-taskdRvqlB/test-tmp/rpc-test-5f8b1470f8aa4ca0b46a2a2991d45659.sock every 8 connection(s)
I20260928 22:47:15.651981 766 acceptor_pool.cc:254] collecting diagnostics on the listening RPC socket unix:/tmp/dist-test-taskdRvqlB/test-tmp/rpc-test-5f8b1470f8aa4ca0b46a2a2991d45659.sock every 8 connection(s)
W20260928 22:47:15.720585 762 connection.cc:196] Error closing socket: Network error: TlsSocket::Close: Broken pipe
[ OK ] Parameters/TestRpc.TestRpcContextClientDeadline/SSL_UnixSocket (105 ms)
[ RUN ] Parameters/TestRpc.TestApplicationFeatureFlagUnsupportedServer/SSL_UnixSocket
I20260928 22:47:15.729686 791 acceptor_pool.cc:254] collecting diagnostics on the listening RPC socket unix:/tmp/dist-test-taskdRvqlB/test-tmp/rpc-test-6f64066690904dfe95459bd6e144eb5a.sock every 8 connection(s)
I20260928 22:47:15.729653 790 acceptor_pool.cc:254] collecting diagnostics on the listening RPC socket unix:/tmp/dist-test-taskdRvqlB/test-tmp/rpc-test-6f64066690904dfe95459bd6e144eb5a.sock every 8 connection(s)
W20260928 22:47:15.748596 787 connection.cc:196] Error closing socket: Network error: TlsSocket::Close: Broken pipe
[ OK ] Parameters/TestRpc.TestApplicationFeatureFlagUnsupportedServer/SSL_UnixSocket (27 ms)
[ RUN ] Parameters/TestRpc.TestCancellationAsync/SSL_UnixSocket
I20260928 22:47:15.758941 815 acceptor_pool.cc:254] collecting diagnostics on the listening RPC socket unix:/tmp/dist-test-taskdRvqlB/test-tmp/rpc-test-c5536fb2e723456ea20561aee1cbfa97.sock every 8 connection(s)
I20260928 22:47:15.758971 816 acceptor_pool.cc:254] collecting diagnostics on the listening RPC socket unix:/tmp/dist-test-taskdRvqlB/test-tmp/rpc-test-c5536fb2e723456ea20561aee1cbfa97.sock every 8 connection(s)
I20260928 22:47:15.759135 383 rpc-test.cc:1716] Connecting to unix:/tmp/dist-test-taskdRvqlB/test-tmp/rpc-test-c5536fb2e723456ea20561aee1cbfa97.sock
I20260928 22:47:15.766593 383 test_util.cc:268] Using random seed: -654445250
I20260928 22:47:15.780615 819 rpc-test-base.h:240] got call: sleep_micros: 500 pattern: 4294967295 num_repetitions: 2097152 sidecar_idx: 0
I20260928 22:47:15.791414 819 rpc-test-base.h:240] got call: sleep_micros: 500 pattern: 4294967295 num_repetitions: 2097152 sidecar_idx: 0
I20260928 22:47:15.806617 819 rpc-test-base.h:240] got call: sleep_micros: 500 pattern: 4294967295 num_repetitions: 2097152 sidecar_idx: 0
I20260928 22:47:15.826788 819 rpc-test-base.h:240] got call: sleep_micros: 500 pattern: 4294967295 num_repetitions: 2097152 sidecar_idx: 0
I20260928 22:47:15.847154 819 rpc-test-base.h:240] got call: sleep_micros: 500 pattern: 4294967295 num_repetitions: 2097152 sidecar_idx: 0
I20260928 22:47:15.865300 819 rpc-test-base.h:240] got call: sleep_micros: 500 pattern: 4294967295 num_repetitions: 2097152 sidecar_idx: 0
I20260928 22:47:15.879513 819 rpc-test-base.h:240] got call: sleep_micros: 500 pattern: 4294967295 num_repetitions: 2097152 sidecar_idx: 0
I20260928 22:47:15.891676 819 rpc-test-base.h:240] got call: sleep_micros: 500 pattern: 4294967295 num_repetitions: 2097152 sidecar_idx: 0
W20260928 22:47:15.893872 812 connection.cc:196] Error closing socket: Network error: TlsSocket::Close: Broken pipe
W20260928 22:47:15.895409 812 connection.cc:441] server connection from unix:<unnamed> torn down before Call kudu.rpc.GenericCalculatorService.SleepWithSidecar from unix:<unnamed> (request call id 9) could send its response
[ OK ] Parameters/TestRpc.TestCancellationAsync/SSL_UnixSocket (147 ms)
[ RUN ] Parameters/TestRpc.TestPerformanceBySocketType/SSL_UnixSocket
I20260928 22:47:15.913462 840 acceptor_pool.cc:254] collecting diagnostics on the listening RPC socket unix:/tmp/dist-test-taskdRvqlB/test-tmp/rpc-test-0b2dd44f624f42bd8b939f4ccf3cc128.sock every 8 connection(s)
I20260928 22:47:15.913661 383 rpc-test.cc:1846] Connecting to unix:/tmp/dist-test-taskdRvqlB/test-tmp/rpc-test-0b2dd44f624f42bd8b939f4ccf3cc128.sock
I20260928 22:47:15.913489 841 acceptor_pool.cc:254] collecting diagnostics on the listening RPC socket unix:/tmp/dist-test-taskdRvqlB/test-tmp/rpc-test-0b2dd44f624f42bd8b939f4ccf3cc128.sock every 8 connection(s)
I20260928 22:47:17.342123 383 rpc-test.cc:1859] Sending 1024MB via ssl-enabled unix socket: real 1.406s user 1.529s sys 0.937s
I20260928 22:47:18.693514 383 rpc-test.cc:1859] Sending 1024MB via ssl-enabled unix socket: real 1.351s user 1.386s sys 1.001s
I20260928 22:47:19.971902 383 rpc-test.cc:1859] Sending 1024MB via ssl-enabled unix socket: real 1.278s user 1.459s sys 0.822s
I20260928 22:47:21.385131 383 rpc-test.cc:1859] Sending 1024MB via ssl-enabled unix socket: real 1.413s user 1.574s sys 0.917s
I20260928 22:47:22.879696 383 rpc-test.cc:1859] Sending 1024MB via ssl-enabled unix socket: real 1.494s user 1.578s sys 1.028s
[ OK ] Parameters/TestRpc.TestPerformanceBySocketType/SSL_UnixSocket (6984 ms)
[----------] 20 tests from Parameters/TestRpc (27143 ms total)
[----------] 1 test from Parameters/TestRpcSocketTxRxQueue
[ RUN ] Parameters/TestRpcSocketTxRxQueue.AcceptorRxQueueSizeMetric/0
I20260928 22:47:22.883227 865 acceptor_pool.cc:254] collecting diagnostics on the listening RPC socket 0.0.0.0:42195 every 1 connection(s)
I20260928 22:47:22.883299 866 acceptor_pool.cc:254] collecting diagnostics on the listening RPC socket 0.0.0.0:42195 every 1 connection(s)
W20260928 22:47:22.883850 861 negotiation.cc:337] Failed RPC negotiation. Trace:
0928 22:47:22.883691 (+ 0us) reactor.cc:625] Submitting negotiation task for server connection from 127.0.0.1:39776 (local address 127.0.0.1:42195)
0928 22:47:22.883749 (+ 58us) server_negotiation.cc:206] Beginning negotiation
0928 22:47:22.883751 (+ 2us) server_negotiation.cc:399] Waiting for connection header
0928 22:47:22.883820 (+ 69us) negotiation.cc:327] Negotiation complete: Network error: Server connection negotiation failed: server connection from 127.0.0.1:39776: BlockingRecv error: recv got EOF from 127.0.0.1:39776 (error 108)
Metrics: {"server-negotiator.queue_time_us":15}
[ OK ] Parameters/TestRpcSocketTxRxQueue.AcceptorRxQueueSizeMetric/0 (4 ms)
[----------] 1 test from Parameters/TestRpcSocketTxRxQueue (4 ms total)
[----------] Global test environment tear-down
[==========] 21 tests from 2 test suites ran. (27147 ms total)
[ PASSED ] 20 tests.
[ FAILED ] 1 test, listed below:
[ FAILED ] Parameters/TestRpc.TestCallWithChainCertAndChainCA/SSL_UnixSocket, where GetParam() = (true, true)
1 FAILED TEST