Diagnosed failure

Parameters/TestRpc.TestCallWithChainCertAndChainCA/SSL_UnixSocket: /data0/somelongdirectorytoavoidrpathissues/src/kudu/src/kudu/rpc/rpc-test.cc:270: Failure
Failed
Bad status: Runtime error: could not verify certificate chain (error with cert: subject=CN = localhost, ST = sadfjas, C = AS, emailAddress = sdflkdsajf, O = lskdfjlsad, OU = sldfkja, issuer=C = AS, ST = ASDfkjdhf, L = lskdjf, O = saldfja, OU = skdjf, CN = localhost, emailAddress = sadjflkadsj): : certificate has expired
Google Test trace:
/data0/somelongdirectorytoavoidrpathissues/src/kudu/src/kudu/rpc/rpc-test.cc:267: Connecting to unix:/tmp/dist-test-taskU8jsM2/test-tmp/rpc-test-602e870d5714408797e93ae3ff3df328.sock
I20260924 23:05:57.770870   383 test_util.cc:175] -----------------------------------------------
I20260924 23:05:57.770927   383 test_util.cc:176] Had fatal failures, leaving test files at /tmp/dist-test-taskU8jsM2/test-tmp/rpc-test.6.Parameters_TestRpc.TestCallWithChainCertAndChainCA_SSL_UnixSocket.1790291157696826-383-0

Full log

Note: This is test shard 7 of 8.
[==========] Running 21 tests from 2 test suites.
[----------] Global test environment set-up.
[----------] 20 tests from Parameters/TestRpc
[ RUN      ] Parameters/TestRpc.TestMessengerCreateDestroy/SSL_UnixSocket
WARNING: Logging before InitGoogleLogging() is written to STDERR
I20260924 23:05:57.727171   383 rpc-test.cc:169] started messenger TestCreateDestroy
[       OK ] Parameters/TestRpc.TestMessengerCreateDestroy/SSL_UnixSocket (28 ms)
[ RUN      ] Parameters/TestRpc.TestNegotiationDeadlock/SSL_UnixSocket
I20260924 23:05:57.739915   404 acceptor_pool.cc:254] collecting diagnostics on the listening RPC socket unix:/tmp/dist-test-taskU8jsM2/test-tmp/rpc-test-51bf2eb06475489bb8be6fe5823408d0.sock every 8 connection(s)
I20260924 23:05:57.739931   403 acceptor_pool.cc:254] collecting diagnostics on the listening RPC socket unix:/tmp/dist-test-taskU8jsM2/test-tmp/rpc-test-51bf2eb06475489bb8be6fe5823408d0.sock every 8 connection(s)
[       OK ] Parameters/TestRpc.TestNegotiationDeadlock/SSL_UnixSocket (18 ms)
[ RUN      ] Parameters/TestRpc.TestCallWithChainCertAndChainCA/SSL_UnixSocket
I20260924 23:05:57.766712   419 acceptor_pool.cc:254] collecting diagnostics on the listening RPC socket unix:/tmp/dist-test-taskU8jsM2/test-tmp/rpc-test-602e870d5714408797e93ae3ff3df328.sock every 8 connection(s)
I20260924 23:05:57.766742   420 acceptor_pool.cc:254] collecting diagnostics on the listening RPC socket unix:/tmp/dist-test-taskU8jsM2/test-tmp/rpc-test-602e870d5714408797e93ae3ff3df328.sock every 8 connection(s)
/data0/somelongdirectorytoavoidrpathissues/src/kudu/src/kudu/rpc/rpc-test.cc:270: Failure
Failed
Bad status: Runtime error: could not verify certificate chain (error with cert: subject=CN = localhost, ST = sadfjas, C = AS, emailAddress = sdflkdsajf, O = lskdfjlsad, OU = sldfkja, issuer=C = AS, ST = ASDfkjdhf, L = lskdjf, O = saldfja, OU = skdjf, CN = localhost, emailAddress = sadjflkadsj): : certificate has expired
Google Test trace:
/data0/somelongdirectorytoavoidrpathissues/src/kudu/src/kudu/rpc/rpc-test.cc:267: Connecting to unix:/tmp/dist-test-taskU8jsM2/test-tmp/rpc-test-602e870d5714408797e93ae3ff3df328.sock
I20260924 23:05:57.770870   383 test_util.cc:175] -----------------------------------------------
I20260924 23:05:57.770927   383 test_util.cc:176] Had fatal failures, leaving test files at /tmp/dist-test-taskU8jsM2/test-tmp/rpc-test.6.Parameters_TestRpc.TestCallWithChainCertAndChainCA_SSL_UnixSocket.1790291157696826-383-0
[  FAILED  ] Parameters/TestRpc.TestCallWithChainCertAndChainCA/SSL_UnixSocket, where GetParam() = (true, true) (23 ms)
[ RUN      ] Parameters/TestRpc.TestCallWithPasswordProtectedKey/SSL_UnixSocket
I20260924 23:05:57.779153   444 acceptor_pool.cc:254] collecting diagnostics on the listening RPC socket unix:/tmp/dist-test-taskU8jsM2/test-tmp/rpc-test-2e7b0373346d4f589bbf807142056c64.sock every 8 connection(s)
I20260924 23:05:57.779181   445 acceptor_pool.cc:254] collecting diagnostics on the listening RPC socket unix:/tmp/dist-test-taskU8jsM2/test-tmp/rpc-test-2e7b0373346d4f589bbf807142056c64.sock every 8 connection(s)
W20260924 23:05:57.792045   441 connection.cc:196] Error closing socket: Network error: TlsSocket::Close: Broken pipe
[       OK ] Parameters/TestRpc.TestCallWithPasswordProtectedKey/SSL_UnixSocket (22 ms)
[ RUN      ] Parameters/TestRpc.TestCallToBadServer/SSL_UnixSocket
I20260924 23:05:57.803345   383 rpc-test.cc:394] Status: Network error: Client connection negotiation failed: client connection to 0.0.0.0:0: connect: Connection refused (error 111)
I20260924 23:05:57.803619   383 rpc-test.cc:394] Status: Network error: Client connection negotiation failed: client connection to 0.0.0.0:0: connect: Connection refused (error 111)
I20260924 23:05:57.803807   383 rpc-test.cc:394] Status: Network error: Client connection negotiation failed: client connection to 0.0.0.0:0: connect: Connection refused (error 111)
I20260924 23:05:57.804005   383 rpc-test.cc:394] Status: Network error: Client connection negotiation failed: client connection to 0.0.0.0:0: connect: Connection refused (error 111)
I20260924 23:05:57.804248   383 rpc-test.cc:394] Status: Network error: Client connection negotiation failed: client connection to 0.0.0.0:0: connect: Connection refused (error 111)
[       OK ] Parameters/TestRpc.TestCallToBadServer/SSL_UnixSocket (11 ms)
[ RUN      ] Parameters/TestRpc.TestWrongService/SSL_UnixSocket
I20260924 23:05:57.832890   479 acceptor_pool.cc:254] collecting diagnostics on the listening RPC socket unix:/tmp/dist-test-taskU8jsM2/test-tmp/rpc-test-a7130e97924d46df8169082249f5f803.sock every 8 connection(s)
I20260924 23:05:57.832919   480 acceptor_pool.cc:254] collecting diagnostics on the listening RPC socket unix:/tmp/dist-test-taskU8jsM2/test-tmp/rpc-test-a7130e97924d46df8169082249f5f803.sock every 8 connection(s)
I20260924 23:05:57.845594   476 messenger.cc:345] service WrongServiceName not registered on TestServer
[       OK ] Parameters/TestRpc.TestWrongService/SSL_UnixSocket (42 ms)
[ RUN      ] Parameters/TestRpc.TestConnectionKeepalive/SSL_UnixSocket
I20260924 23:05:57.864955   502 acceptor_pool.cc:254] collecting diagnostics on the listening RPC socket unix:/tmp/dist-test-taskU8jsM2/test-tmp/rpc-test-ac02356b3c13469b84060894eaf165d4.sock every 8 connection(s)
I20260924 23:05:57.864979   503 acceptor_pool.cc:254] collecting diagnostics on the listening RPC socket unix:/tmp/dist-test-taskU8jsM2/test-tmp/rpc-test-ac02356b3c13469b84060894eaf165d4.sock every 8 connection(s)
I20260924 23:05:57.865157   383 rpc-test.cc:488] Connecting to unix:/tmp/dist-test-taskU8jsM2/test-tmp/rpc-test-ac02356b3c13469b84060894eaf165d4.sock
W20260924 23:05:58.348989   515 connection.cc:196] Error closing socket: Network error: TlsSocket::Close: Broken pipe
[       OK ] Parameters/TestRpc.TestConnectionKeepalive/SSL_UnixSocket (1053 ms)
[ RUN      ] Parameters/TestRpc.TestClientConnectionMetrics/SSL_UnixSocket
I20260924 23:05:58.912222   527 acceptor_pool.cc:254] collecting diagnostics on the listening RPC socket unix:/tmp/dist-test-taskU8jsM2/test-tmp/rpc-test-f9bfc3fbdf4b4e36ac927e98dd00fd6f.sock every 8 connection(s)
I20260924 23:05:58.912271   528 acceptor_pool.cc:254] collecting diagnostics on the listening RPC socket unix:/tmp/dist-test-taskU8jsM2/test-tmp/rpc-test-f9bfc3fbdf4b4e36ac927e98dd00fd6f.sock every 8 connection(s)
I20260924 23:05:58.912446   383 rpc-test.cc:569] Connecting to unix:/tmp/dist-test-taskU8jsM2/test-tmp/rpc-test-f9bfc3fbdf4b4e36ac927e98dd00fd6f.sock
W20260924 23:06:07.665620   524 connection.cc:196] Error closing socket: Network error: TlsSocket::Close: Broken pipe
[       OK ] Parameters/TestRpc.TestClientConnectionMetrics/SSL_UnixSocket (8766 ms)
[ RUN      ] Parameters/TestRpc.TestCredentialsPolicy/SSL_UnixSocket
I20260924 23:06:07.685985   550 acceptor_pool.cc:254] collecting diagnostics on the listening RPC socket unix:/tmp/dist-test-taskU8jsM2/test-tmp/rpc-test-abcbea7b2de546e3967549a4938a20cd.sock every 8 connection(s)
I20260924 23:06:07.686333   383 rpc-test.cc:700] Connecting to unix:/tmp/dist-test-taskU8jsM2/test-tmp/rpc-test-abcbea7b2de546e3967549a4938a20cd.sock
I20260924 23:06:07.686378   551 acceptor_pool.cc:254] collecting diagnostics on the listening RPC socket unix:/tmp/dist-test-taskU8jsM2/test-tmp/rpc-test-abcbea7b2de546e3967549a4938a20cd.sock every 8 connection(s)
W20260924 23:06:07.712424   549 connection.cc:196] Error closing socket: Network error: TlsSocket::Close: Broken pipe
[       OK ] Parameters/TestRpc.TestCredentialsPolicy/SSL_UnixSocket (50 ms)
[ RUN      ] Parameters/TestRpc.TestCallLongerThanKeepalive/SSL_UnixSocket
I20260924 23:06:07.736654   575 acceptor_pool.cc:254] collecting diagnostics on the listening RPC socket unix:/tmp/dist-test-taskU8jsM2/test-tmp/rpc-test-04c4ad1ff363442cb60005f0fce890d9.sock every 8 connection(s)
I20260924 23:06:07.736686   576 acceptor_pool.cc:254] collecting diagnostics on the listening RPC socket unix:/tmp/dist-test-taskU8jsM2/test-tmp/rpc-test-04c4ad1ff363442cb60005f0fce890d9.sock every 8 connection(s)
I20260924 23:06:07.749243   579 rpc-test-base.h:222] got call: sleep_micros: 3000000 deferred: true
I20260924 23:06:10.749957   579 rpcz_store.cc:275] Call kudu.rpc.GenericCalculatorService.Sleep from unix:<unnamed> (request call id 0) took 3000 ms. Trace:
I20260924 23:06:10.750063   579 rpcz_store.cc:276] 0924 23:06:07.749182 (+     0us) service_pool.cc:170] Inserting onto call queue
0924 23:06:07.749225 (+    43us) service_pool.cc:227] Handling call
0924 23:06:10.749940 (+3000715us) inbound_call.cc:173] Queueing success response
Metrics: {}
[       OK ] Parameters/TestRpc.TestCallLongerThanKeepalive/SSL_UnixSocket (3034 ms)
[ RUN      ] Parameters/TestRpc.TestRpcSidecar/SSL_UnixSocket
I20260924 23:06:10.769444   600 acceptor_pool.cc:254] collecting diagnostics on the listening RPC socket unix:/tmp/dist-test-taskU8jsM2/test-tmp/rpc-test-0cca556396784be796373e0859f7233a.sock every 8 connection(s)
I20260924 23:06:10.769469   601 acceptor_pool.cc:254] collecting diagnostics on the listening RPC socket unix:/tmp/dist-test-taskU8jsM2/test-tmp/rpc-test-0cca556396784be796373e0859f7233a.sock every 8 connection(s)
W20260924 23:06:10.804884   597 connection.cc:196] Error closing socket: Network error: TlsSocket::Close: Broken pipe
[       OK ] Parameters/TestRpc.TestRpcSidecar/SSL_UnixSocket (53 ms)
[ RUN      ] Parameters/TestRpc.TestRpcSidecarLimits/SSL_UnixSocket
I20260924 23:06:12.692198   625 acceptor_pool.cc:254] collecting diagnostics on the listening RPC socket unix:/tmp/dist-test-taskU8jsM2/test-tmp/rpc-test-7a4f0a4497e14d3ba5bf84c73f868947.sock every 8 connection(s)
I20260924 23:06:12.692236   626 acceptor_pool.cc:254] collecting diagnostics on the listening RPC socket unix:/tmp/dist-test-taskU8jsM2/test-tmp/rpc-test-7a4f0a4497e14d3ba5bf84c73f868947.sock every 8 connection(s)
W20260924 23:06:12.702088   383 serialization.cc:72] Serialized kudu.rpc_test.PushStringsRequestPB (2147483654 bytes) is larger than the maximum configured RPC message size (52428800 bytes). Sending anyway, but peer may reject the data.
W20260924 23:06:12.705479   622 connection.cc:535] server connection from unix:<unnamed> recv error: Network error: RPC frame had a length of 2147483714, but we only support messages up to 52428800 bytes long.
W20260924 23:06:12.705536   622 connection.cc:158] shutting down server connection from unix:<unnamed> with pending inbound data: 4/2147483714 bytes received; last active 0 ns ago: status Network error: RPC frame had a length of 2147483714, but we only support messages up to 52428800 bytes long.
W20260924 23:06:12.705652   638 connection.cc:698] client connection to unix:/tmp/dist-test-taskU8jsM2/test-tmp/rpc-test-7a4f0a4497e14d3ba5bf84c73f868947.sock send error: Network error: failed to write to TLS socket: Broken pipe
W20260924 23:06:12.705799   638 connection.cc:196] Error closing socket: Network error: TlsSocket::Close: Success
I20260924 23:06:12.723747   651 acceptor_pool.cc:254] collecting diagnostics on the listening RPC socket unix:/tmp/dist-test-taskU8jsM2/test-tmp/rpc-test-7a4f0a4497e14d3ba5bf84c73f868947.sock every 8 connection(s)
I20260924 23:06:12.723788   650 acceptor_pool.cc:254] collecting diagnostics on the listening RPC socket unix:/tmp/dist-test-taskU8jsM2/test-tmp/rpc-test-7a4f0a4497e14d3ba5bf84c73f868947.sock every 8 connection(s)
W20260924 23:06:17.273728   647 connection.cc:577] server connection from unix:<unnamed>: received bad data: 'Corruption: Invalid packet: message had a length of 2147483710, but we only support messages up to 2147483647 bytes
'
W20260924 23:06:17.274062   663 connection.cc:196] Error closing socket: Network error: TlsSocket::Close: Broken pipe
[       OK ] Parameters/TestRpc.TestRpcSidecarLimits/SSL_UnixSocket (6470 ms)
[ RUN      ] Parameters/TestRpc.TestCallTimeoutDoesntAffectNegotiation/SSL_UnixSocket
I20260924 23:06:17.295296   675 acceptor_pool.cc:254] collecting diagnostics on the listening RPC socket unix:/tmp/dist-test-taskU8jsM2/test-tmp/rpc-test-2066f1b350a142e6a0978dc1e9dfa300.sock every 8 connection(s)
I20260924 23:06:17.295321   676 acceptor_pool.cc:254] collecting diagnostics on the listening RPC socket unix:/tmp/dist-test-taskU8jsM2/test-tmp/rpc-test-2066f1b350a142e6a0978dc1e9dfa300.sock every 8 connection(s)
W20260924 23:06:17.311354   671 negotiation.cc:266] Injecting 500ms delay in negotiation
I20260924 23:06:17.361697   383 rpc-test-base.h:595] status: Timed out: connection negotiation to unix:/tmp/dist-test-taskU8jsM2/test-tmp/rpc-test-2066f1b350a142e6a0978dc1e9dfa300.sock for RPC Sleep timed out after 0.050s (ON_OUTBOUND_QUEUE), seconds elapsed: 0.0506637
W20260924 23:06:17.822217   672 connection.cc:196] Error closing socket: Network error: TlsSocket::Close: Broken pipe
[       OK ] Parameters/TestRpc.TestCallTimeoutDoesntAffectNegotiation/SSL_UnixSocket (546 ms)
[ RUN      ] Parameters/TestRpc.TestRpcHandlerLatencyMetric/SSL_UnixSocket
I20260924 23:06:17.846308   700 acceptor_pool.cc:254] collecting diagnostics on the listening RPC socket unix:/tmp/dist-test-taskU8jsM2/test-tmp/rpc-test-a368e6447e3a472c9cc412411f6336f0.sock every 8 connection(s)
I20260924 23:06:17.846370   701 acceptor_pool.cc:254] collecting diagnostics on the listening RPC socket unix:/tmp/dist-test-taskU8jsM2/test-tmp/rpc-test-a368e6447e3a472c9cc412411f6336f0.sock every 8 connection(s)
I20260924 23:06:17.878026   383 rpc-test.cc:1236] Sleep() min lat: 20357
I20260924 23:06:17.878104   383 rpc-test.cc:1237] Sleep() mean lat: 20357
I20260924 23:06:17.878134   383 rpc-test.cc:1238] Sleep() max lat: 20357
I20260924 23:06:17.878147   383 rpc-test.cc:1239] Sleep() #calls: 1
W20260924 23:06:17.879088   697 connection.cc:196] Error closing socket: Network error: TlsSocket::Close: Broken pipe
[       OK ] Parameters/TestRpc.TestRpcHandlerLatencyMetric/SSL_UnixSocket (56 ms)
[ RUN      ] Parameters/TestRpc.TimedOutOnResponseMetricServiceQueue/SSL_UnixSocket
I20260924 23:06:17.901988   726 acceptor_pool.cc:254] collecting diagnostics on the listening RPC socket unix:/tmp/dist-test-taskU8jsM2/test-tmp/rpc-test-6604e0eaecd341be95b209693972369d.sock every 8 connection(s)
I20260924 23:06:17.902046   727 acceptor_pool.cc:254] collecting diagnostics on the listening RPC socket unix:/tmp/dist-test-taskU8jsM2/test-tmp/rpc-test-6604e0eaecd341be95b209693972369d.sock every 8 connection(s)
W20260924 23:06:17.967061   728 rpcz_store.cc:267] Call kudu.rpc_test.CalculatorService.Sleep from unix:<unnamed> (request call id 2) took 20 ms (client timeout 20 ms). Trace:
W20260924 23:06:17.967176   728 rpcz_store.cc:269] 0924 23:06:17.946775 (+     0us) service_pool.cc:170] Inserting onto call queue
0924 23:06:17.967018 (+ 20243us) service_pool.cc:214] Skipping call since client already timed out
0924 23:06:17.967031 (+    13us) inbound_call.cc:173] Queueing failure response
Metrics: {}
W20260924 23:06:17.967820   723 connection.cc:196] Error closing socket: Network error: TlsSocket::Close: Broken pipe
[       OK ] Parameters/TestRpc.TimedOutOnResponseMetricServiceQueue/SSL_UnixSocket (88 ms)
[ RUN      ] Parameters/TestRpc.RpcPendingConnectionsMetric/SSL_UnixSocket
I20260924 23:06:17.970715   749 acceptor_pool.cc:254] collecting diagnostics on the listening RPC socket 0.0.0.0:43333 every 8 connection(s)
I20260924 23:06:17.970784   750 acceptor_pool.cc:254] collecting diagnostics on the listening RPC socket 0.0.0.0:43333 every 8 connection(s)
W20260924 23:06:17.979671   745 negotiation.cc:337] Failed RPC negotiation. Trace:
0924 23:06:17.979460 (+     0us) reactor.cc:625] Submitting negotiation task for server connection from 127.0.0.1:40588 (local address 127.0.0.1:43333)
0924 23:06:17.979528 (+    68us) server_negotiation.cc:206] Beginning negotiation
0924 23:06:17.979530 (+     2us) server_negotiation.cc:399] Waiting for connection header
0924 23:06:17.979605 (+    75us) negotiation.cc:327] Negotiation complete: Network error: Server connection negotiation failed: server connection from 127.0.0.1:40588: BlockingRecv error: recv got EOF from 127.0.0.1:40588 (error 108)
Metrics: {"server-negotiator.queue_time_us":34}
[       OK ] Parameters/TestRpc.RpcPendingConnectionsMetric/SSL_UnixSocket (22 ms)
[ RUN      ] Parameters/TestRpc.TestRpcContextClientDeadline/SSL_UnixSocket
I20260924 23:06:17.995867   765 acceptor_pool.cc:254] collecting diagnostics on the listening RPC socket unix:/tmp/dist-test-taskU8jsM2/test-tmp/rpc-test-fea78d9b6e344c25a625742f5a9ce454.sock every 8 connection(s)
I20260924 23:06:17.995900   766 acceptor_pool.cc:254] collecting diagnostics on the listening RPC socket unix:/tmp/dist-test-taskU8jsM2/test-tmp/rpc-test-fea78d9b6e344c25a625742f5a9ce454.sock every 8 connection(s)
[       OK ] Parameters/TestRpc.TestRpcContextClientDeadline/SSL_UnixSocket (60 ms)
[ RUN      ] Parameters/TestRpc.TestApplicationFeatureFlagUnsupportedServer/SSL_UnixSocket
I20260924 23:06:18.062233   791 acceptor_pool.cc:254] collecting diagnostics on the listening RPC socket unix:/tmp/dist-test-taskU8jsM2/test-tmp/rpc-test-694e362dd8cd4d44aa8ed6d43f8c3807.sock every 8 connection(s)
I20260924 23:06:18.062233   790 acceptor_pool.cc:254] collecting diagnostics on the listening RPC socket unix:/tmp/dist-test-taskU8jsM2/test-tmp/rpc-test-694e362dd8cd4d44aa8ed6d43f8c3807.sock every 8 connection(s)
[       OK ] Parameters/TestRpc.TestApplicationFeatureFlagUnsupportedServer/SSL_UnixSocket (26 ms)
[ RUN      ] Parameters/TestRpc.TestCancellationAsync/SSL_UnixSocket
I20260924 23:06:18.092500   815 acceptor_pool.cc:254] collecting diagnostics on the listening RPC socket unix:/tmp/dist-test-taskU8jsM2/test-tmp/rpc-test-c368e9b5c7954d5eadbeba1af9ce8fda.sock every 8 connection(s)
I20260924 23:06:18.092543   816 acceptor_pool.cc:254] collecting diagnostics on the listening RPC socket unix:/tmp/dist-test-taskU8jsM2/test-tmp/rpc-test-c368e9b5c7954d5eadbeba1af9ce8fda.sock every 8 connection(s)
I20260924 23:06:18.092710   383 rpc-test.cc:1716] Connecting to unix:/tmp/dist-test-taskU8jsM2/test-tmp/rpc-test-c368e9b5c7954d5eadbeba1af9ce8fda.sock
I20260924 23:06:18.114995   383 test_util.cc:268] Using random seed: -1514713167
I20260924 23:06:18.130798   819 rpc-test-base.h:240] got call: sleep_micros: 500 pattern: 4294967295 num_repetitions: 2097152 sidecar_idx: 0
I20260924 23:06:18.142459   819 rpc-test-base.h:240] got call: sleep_micros: 500 pattern: 4294967295 num_repetitions: 2097152 sidecar_idx: 0
I20260924 23:06:18.153676   819 rpc-test-base.h:240] got call: sleep_micros: 500 pattern: 4294967295 num_repetitions: 2097152 sidecar_idx: 0
I20260924 23:06:18.164906   819 rpc-test-base.h:240] got call: sleep_micros: 500 pattern: 4294967295 num_repetitions: 2097152 sidecar_idx: 0
I20260924 23:06:18.176026   819 rpc-test-base.h:240] got call: sleep_micros: 500 pattern: 4294967295 num_repetitions: 2097152 sidecar_idx: 0
I20260924 23:06:18.187217   819 rpc-test-base.h:240] got call: sleep_micros: 500 pattern: 4294967295 num_repetitions: 2097152 sidecar_idx: 0
I20260924 23:06:18.198225   819 rpc-test-base.h:240] got call: sleep_micros: 500 pattern: 4294967295 num_repetitions: 2097152 sidecar_idx: 0
I20260924 23:06:18.209473   819 rpc-test-base.h:240] got call: sleep_micros: 500 pattern: 4294967295 num_repetitions: 2097152 sidecar_idx: 0
W20260924 23:06:18.211284   812 connection.cc:196] Error closing socket: Network error: TlsSocket::Close: Broken pipe
W20260924 23:06:18.212668   812 connection.cc:441] server connection from unix:<unnamed> torn down before Call kudu.rpc.GenericCalculatorService.SleepWithSidecar from unix:<unnamed> (request call id 9) could send its response
[       OK ] Parameters/TestRpc.TestCancellationAsync/SSL_UnixSocket (135 ms)
[ RUN      ] Parameters/TestRpc.TestPerformanceBySocketType/SSL_UnixSocket
I20260924 23:06:18.246655   840 acceptor_pool.cc:254] collecting diagnostics on the listening RPC socket unix:/tmp/dist-test-taskU8jsM2/test-tmp/rpc-test-f9264c728d014c81b6d0427157b60bca.sock every 8 connection(s)
I20260924 23:06:18.246670   841 acceptor_pool.cc:254] collecting diagnostics on the listening RPC socket unix:/tmp/dist-test-taskU8jsM2/test-tmp/rpc-test-f9264c728d014c81b6d0427157b60bca.sock every 8 connection(s)
I20260924 23:06:18.246834   383 rpc-test.cc:1846] Connecting to unix:/tmp/dist-test-taskU8jsM2/test-tmp/rpc-test-f9264c728d014c81b6d0427157b60bca.sock
I20260924 23:06:19.739303   383 rpc-test.cc:1859] Sending 1024MB via ssl-enabled unix socket: real 1.478s	user 1.675s	sys 0.937s
I20260924 23:06:21.102545   383 rpc-test.cc:1859] Sending 1024MB via ssl-enabled unix socket: real 1.363s	user 1.490s	sys 0.905s
I20260924 23:06:22.524117   383 rpc-test.cc:1859] Sending 1024MB via ssl-enabled unix socket: real 1.421s	user 1.593s	sys 0.925s
I20260924 23:06:24.023012   383 rpc-test.cc:1859] Sending 1024MB via ssl-enabled unix socket: real 1.499s	user 1.632s	sys 0.999s
I20260924 23:06:25.409232   383 rpc-test.cc:1859] Sending 1024MB via ssl-enabled unix socket: real 1.386s	user 1.550s	sys 0.899s
[       OK ] Parameters/TestRpc.TestPerformanceBySocketType/SSL_UnixSocket (7197 ms)
[----------] 20 tests from Parameters/TestRpc (27711 ms total)

[----------] 1 test from Parameters/TestRpcSocketTxRxQueue
[ RUN      ] Parameters/TestRpcSocketTxRxQueue.AcceptorRxQueueSizeMetric/0
I20260924 23:06:25.419430   865 acceptor_pool.cc:254] collecting diagnostics on the listening RPC socket 0.0.0.0:35521 every 1 connection(s)
I20260924 23:06:25.419492   866 acceptor_pool.cc:254] collecting diagnostics on the listening RPC socket 0.0.0.0:35521 every 1 connection(s)
W20260924 23:06:25.420118   861 negotiation.cc:337] Failed RPC negotiation. Trace:
0924 23:06:25.419947 (+     0us) reactor.cc:625] Submitting negotiation task for server connection from 127.0.0.1:44662 (local address 127.0.0.1:35521)
0924 23:06:25.420004 (+    57us) server_negotiation.cc:206] Beginning negotiation
0924 23:06:25.420006 (+     2us) server_negotiation.cc:399] Waiting for connection header
0924 23:06:25.420073 (+    67us) negotiation.cc:327] Negotiation complete: Network error: Server connection negotiation failed: server connection from 127.0.0.1:44662: BlockingRecv error: recv got EOF from 127.0.0.1:44662 (error 108)
Metrics: {"server-negotiator.queue_time_us":28}
[       OK ] Parameters/TestRpcSocketTxRxQueue.AcceptorRxQueueSizeMetric/0 (11 ms)
[----------] 1 test from Parameters/TestRpcSocketTxRxQueue (11 ms total)

[----------] Global test environment tear-down
[==========] 21 tests from 2 test suites ran. (27723 ms total)
[  PASSED  ] 20 tests.
[  FAILED  ] 1 test, listed below:
[  FAILED  ] Parameters/TestRpc.TestCallWithChainCertAndChainCA/SSL_UnixSocket, where GetParam() = (true, true)

 1 FAILED TEST