Diagnosed failure

Parameters/TestRpc.TestCallWithChainCertAndChainCA/SSL_UnixSocket: /data0/somelongdirectorytoavoidrpathissues/src/kudu/src/kudu/rpc/rpc-test.cc:270: Failure
Failed
Bad status: Runtime error: could not verify certificate chain (error with cert: subject=CN = localhost, ST = sadfjas, C = AS, emailAddress = sdflkdsajf, O = lskdfjlsad, OU = sldfkja, issuer=C = AS, ST = ASDfkjdhf, L = lskdjf, O = saldfja, OU = skdjf, CN = localhost, emailAddress = sadjflkadsj): : certificate has expired
Google Test trace:
/data0/somelongdirectorytoavoidrpathissues/src/kudu/src/kudu/rpc/rpc-test.cc:267: Connecting to unix:/tmp/dist-test-taskUKbJHR/test-tmp/rpc-test-51db6daa14a24b168c4fe0b057c51dea.sock
I20260928 14:54:25.064632 14645 test_util.cc:175] -----------------------------------------------
I20260928 14:54:25.064684 14645 test_util.cc:176] Had fatal failures, leaving test files at /tmp/dist-test-taskUKbJHR/test-tmp/rpc-test.6.Parameters_TestRpc.TestCallWithChainCertAndChainCA_SSL_UnixSocket.1790607264991932-14645-0

Full log

Note: This is test shard 7 of 8.
[==========] Running 21 tests from 2 test suites.
[----------] Global test environment set-up.
[----------] 20 tests from Parameters/TestRpc
[ RUN      ] Parameters/TestRpc.TestMessengerCreateDestroy/SSL_UnixSocket
WARNING: Logging before InitGoogleLogging() is written to STDERR
I20260928 14:54:25.022601 14645 rpc-test.cc:169] started messenger TestCreateDestroy
[       OK ] Parameters/TestRpc.TestMessengerCreateDestroy/SSL_UnixSocket (29 ms)
[ RUN      ] Parameters/TestRpc.TestNegotiationDeadlock/SSL_UnixSocket
I20260928 14:54:25.048801 14665 acceptor_pool.cc:254] collecting diagnostics on the listening RPC socket unix:/tmp/dist-test-taskUKbJHR/test-tmp/rpc-test-e83f8397c8f544ef934e7ad98f8a6d2d.sock every 8 connection(s)
I20260928 14:54:25.048802 14666 acceptor_pool.cc:254] collecting diagnostics on the listening RPC socket unix:/tmp/dist-test-taskUKbJHR/test-tmp/rpc-test-e83f8397c8f544ef934e7ad98f8a6d2d.sock every 8 connection(s)
[       OK ] Parameters/TestRpc.TestNegotiationDeadlock/SSL_UnixSocket (31 ms)
[ RUN      ] Parameters/TestRpc.TestCallWithChainCertAndChainCA/SSL_UnixSocket
I20260928 14:54:25.060959 14681 acceptor_pool.cc:254] collecting diagnostics on the listening RPC socket unix:/tmp/dist-test-taskUKbJHR/test-tmp/rpc-test-51db6daa14a24b168c4fe0b057c51dea.sock every 8 connection(s)
I20260928 14:54:25.060997 14682 acceptor_pool.cc:254] collecting diagnostics on the listening RPC socket unix:/tmp/dist-test-taskUKbJHR/test-tmp/rpc-test-51db6daa14a24b168c4fe0b057c51dea.sock every 8 connection(s)
/data0/somelongdirectorytoavoidrpathissues/src/kudu/src/kudu/rpc/rpc-test.cc:270: Failure
Failed
Bad status: Runtime error: could not verify certificate chain (error with cert: subject=CN = localhost, ST = sadfjas, C = AS, emailAddress = sdflkdsajf, O = lskdfjlsad, OU = sldfkja, issuer=C = AS, ST = ASDfkjdhf, L = lskdjf, O = saldfja, OU = skdjf, CN = localhost, emailAddress = sadjflkadsj): : certificate has expired
Google Test trace:
/data0/somelongdirectorytoavoidrpathissues/src/kudu/src/kudu/rpc/rpc-test.cc:267: Connecting to unix:/tmp/dist-test-taskUKbJHR/test-tmp/rpc-test-51db6daa14a24b168c4fe0b057c51dea.sock
I20260928 14:54:25.064632 14645 test_util.cc:175] -----------------------------------------------
I20260928 14:54:25.064684 14645 test_util.cc:176] Had fatal failures, leaving test files at /tmp/dist-test-taskUKbJHR/test-tmp/rpc-test.6.Parameters_TestRpc.TestCallWithChainCertAndChainCA_SSL_UnixSocket.1790607264991932-14645-0
[  FAILED  ] Parameters/TestRpc.TestCallWithChainCertAndChainCA/SSL_UnixSocket, where GetParam() = (true, true) (9 ms)
[ RUN      ] Parameters/TestRpc.TestCallWithPasswordProtectedKey/SSL_UnixSocket
I20260928 14:54:25.079484 14707 acceptor_pool.cc:254] collecting diagnostics on the listening RPC socket unix:/tmp/dist-test-taskUKbJHR/test-tmp/rpc-test-cb4505ff67f84d00a57dbc333629da61.sock every 8 connection(s)
I20260928 14:54:25.079475 14706 acceptor_pool.cc:254] collecting diagnostics on the listening RPC socket unix:/tmp/dist-test-taskUKbJHR/test-tmp/rpc-test-cb4505ff67f84d00a57dbc333629da61.sock every 8 connection(s)
W20260928 14:54:25.090577 14703 connection.cc:196] Error closing socket: Network error: TlsSocket::Close: Broken pipe
[       OK ] Parameters/TestRpc.TestCallWithPasswordProtectedKey/SSL_UnixSocket (27 ms)
[ RUN      ] Parameters/TestRpc.TestCallToBadServer/SSL_UnixSocket
I20260928 14:54:25.110406 14645 rpc-test.cc:394] Status: Network error: Client connection negotiation failed: client connection to 0.0.0.0:0: connect: Connection refused (error 111)
I20260928 14:54:25.110716 14645 rpc-test.cc:394] Status: Network error: Client connection negotiation failed: client connection to 0.0.0.0:0: connect: Connection refused (error 111)
I20260928 14:54:25.110924 14645 rpc-test.cc:394] Status: Network error: Client connection negotiation failed: client connection to 0.0.0.0:0: connect: Connection refused (error 111)
I20260928 14:54:25.111179 14645 rpc-test.cc:394] Status: Network error: Client connection negotiation failed: client connection to 0.0.0.0:0: connect: Connection refused (error 111)
I20260928 14:54:25.111366 14645 rpc-test.cc:394] Status: Network error: Client connection negotiation failed: client connection to 0.0.0.0:0: connect: Connection refused (error 111)
[       OK ] Parameters/TestRpc.TestCallToBadServer/SSL_UnixSocket (20 ms)
[ RUN      ] Parameters/TestRpc.TestWrongService/SSL_UnixSocket
I20260928 14:54:25.142378 14742 acceptor_pool.cc:254] collecting diagnostics on the listening RPC socket unix:/tmp/dist-test-taskUKbJHR/test-tmp/rpc-test-18fa1388c6f747bab365fc436d159c28.sock every 8 connection(s)
I20260928 14:54:25.142366 14741 acceptor_pool.cc:254] collecting diagnostics on the listening RPC socket unix:/tmp/dist-test-taskUKbJHR/test-tmp/rpc-test-18fa1388c6f747bab365fc436d159c28.sock every 8 connection(s)
I20260928 14:54:25.173537 14738 messenger.cc:345] service WrongServiceName not registered on TestServer
W20260928 14:54:25.174398 14738 connection.cc:196] Error closing socket: Network error: TlsSocket::Close: Broken pipe
[       OK ] Parameters/TestRpc.TestWrongService/SSL_UnixSocket (63 ms)
[ RUN      ] Parameters/TestRpc.TestConnectionKeepalive/SSL_UnixSocket
I20260928 14:54:25.189952 14764 acceptor_pool.cc:254] collecting diagnostics on the listening RPC socket unix:/tmp/dist-test-taskUKbJHR/test-tmp/rpc-test-57517ec14fe9454c8d7b351d633a0d69.sock every 8 connection(s)
I20260928 14:54:25.189986 14765 acceptor_pool.cc:254] collecting diagnostics on the listening RPC socket unix:/tmp/dist-test-taskUKbJHR/test-tmp/rpc-test-57517ec14fe9454c8d7b351d633a0d69.sock every 8 connection(s)
I20260928 14:54:25.190115 14645 rpc-test.cc:488] Connecting to unix:/tmp/dist-test-taskUKbJHR/test-tmp/rpc-test-57517ec14fe9454c8d7b351d633a0d69.sock
W20260928 14:54:25.677346 14777 connection.cc:196] Error closing socket: Network error: TlsSocket::Close: Broken pipe
[       OK ] Parameters/TestRpc.TestConnectionKeepalive/SSL_UnixSocket (1035 ms)
[ RUN      ] Parameters/TestRpc.TestClientConnectionMetrics/SSL_UnixSocket
I20260928 14:54:26.229220 14789 acceptor_pool.cc:254] collecting diagnostics on the listening RPC socket unix:/tmp/dist-test-taskUKbJHR/test-tmp/rpc-test-740b70b429e548849fa2fd6061e61e5c.sock every 8 connection(s)
I20260928 14:54:26.229242 14790 acceptor_pool.cc:254] collecting diagnostics on the listening RPC socket unix:/tmp/dist-test-taskUKbJHR/test-tmp/rpc-test-740b70b429e548849fa2fd6061e61e5c.sock every 8 connection(s)
I20260928 14:54:26.229461 14645 rpc-test.cc:569] Connecting to unix:/tmp/dist-test-taskUKbJHR/test-tmp/rpc-test-740b70b429e548849fa2fd6061e61e5c.sock
W20260928 14:54:34.441560 14786 connection.cc:196] Error closing socket: Network error: TlsSocket::Close: Broken pipe
[       OK ] Parameters/TestRpc.TestClientConnectionMetrics/SSL_UnixSocket (8231 ms)
[ RUN      ] Parameters/TestRpc.TestCredentialsPolicy/SSL_UnixSocket
I20260928 14:54:34.454176 14812 acceptor_pool.cc:254] collecting diagnostics on the listening RPC socket unix:/tmp/dist-test-taskUKbJHR/test-tmp/rpc-test-57393ea0e53c4b1e9c41fc8c8e1817f7.sock every 8 connection(s)
I20260928 14:54:34.454231 14813 acceptor_pool.cc:254] collecting diagnostics on the listening RPC socket unix:/tmp/dist-test-taskUKbJHR/test-tmp/rpc-test-57393ea0e53c4b1e9c41fc8c8e1817f7.sock every 8 connection(s)
I20260928 14:54:34.454376 14645 rpc-test.cc:700] Connecting to unix:/tmp/dist-test-taskUKbJHR/test-tmp/rpc-test-57393ea0e53c4b1e9c41fc8c8e1817f7.sock
W20260928 14:54:34.472487 14811 connection.cc:196] Error closing socket: Network error: TlsSocket::Close: Broken pipe
[       OK ] Parameters/TestRpc.TestCredentialsPolicy/SSL_UnixSocket (34 ms)
[ RUN      ] Parameters/TestRpc.TestCallLongerThanKeepalive/SSL_UnixSocket
I20260928 14:54:34.488094 14837 acceptor_pool.cc:254] collecting diagnostics on the listening RPC socket unix:/tmp/dist-test-taskUKbJHR/test-tmp/rpc-test-b16d4051e6fc4eada21ceec904ee2354.sock every 8 connection(s)
I20260928 14:54:34.488119 14838 acceptor_pool.cc:254] collecting diagnostics on the listening RPC socket unix:/tmp/dist-test-taskUKbJHR/test-tmp/rpc-test-b16d4051e6fc4eada21ceec904ee2354.sock every 8 connection(s)
I20260928 14:54:34.509085 14839 rpc-test-base.h:222] got call: sleep_micros: 3000000 deferred: true
I20260928 14:54:37.509843 14839 rpcz_store.cc:275] Call kudu.rpc.GenericCalculatorService.Sleep from unix:<unnamed> (request call id 0) took 3000 ms. Trace:
I20260928 14:54:37.509984 14839 rpcz_store.cc:276] 0928 14:54:34.509027 (+     0us) service_pool.cc:170] Inserting onto call queue
0928 14:54:34.509061 (+    34us) service_pool.cc:227] Handling call
0928 14:54:37.509816 (+3000755us) inbound_call.cc:173] Queueing success response
Metrics: {}
W20260928 14:54:37.511240 14834 connection.cc:196] Error closing socket: Network error: TlsSocket::Close: Broken pipe
[       OK ] Parameters/TestRpc.TestCallLongerThanKeepalive/SSL_UnixSocket (3036 ms)
[ RUN      ] Parameters/TestRpc.TestRpcSidecar/SSL_UnixSocket
I20260928 14:54:37.542176 14862 acceptor_pool.cc:254] collecting diagnostics on the listening RPC socket unix:/tmp/dist-test-taskUKbJHR/test-tmp/rpc-test-9df2731f515748898c5637ddc91e9e11.sock every 8 connection(s)
I20260928 14:54:37.542217 14863 acceptor_pool.cc:254] collecting diagnostics on the listening RPC socket unix:/tmp/dist-test-taskUKbJHR/test-tmp/rpc-test-9df2731f515748898c5637ddc91e9e11.sock every 8 connection(s)
W20260928 14:54:37.585805 14859 connection.cc:196] Error closing socket: Network error: TlsSocket::Close: Broken pipe
[       OK ] Parameters/TestRpc.TestRpcSidecar/SSL_UnixSocket (73 ms)
[ RUN      ] Parameters/TestRpc.TestRpcSidecarLimits/SSL_UnixSocket
I20260928 14:54:39.258158 14887 acceptor_pool.cc:254] collecting diagnostics on the listening RPC socket unix:/tmp/dist-test-taskUKbJHR/test-tmp/rpc-test-f790a759be8d4cb4aa6bc44db012fa5a.sock every 8 connection(s)
I20260928 14:54:39.258199 14888 acceptor_pool.cc:254] collecting diagnostics on the listening RPC socket unix:/tmp/dist-test-taskUKbJHR/test-tmp/rpc-test-f790a759be8d4cb4aa6bc44db012fa5a.sock every 8 connection(s)
W20260928 14:54:39.263746 14645 serialization.cc:72] Serialized kudu.rpc_test.PushStringsRequestPB (2147483654 bytes) is larger than the maximum configured RPC message size (52428800 bytes). Sending anyway, but peer may reject the data.
W20260928 14:54:39.266569 14884 connection.cc:535] server connection from unix:<unnamed> recv error: Network error: RPC frame had a length of 2147483714, but we only support messages up to 52428800 bytes long.
W20260928 14:54:39.266619 14884 connection.cc:158] shutting down server connection from unix:<unnamed> with pending inbound data: 4/2147483714 bytes received; last active 0 ns ago: status Network error: RPC frame had a length of 2147483714, but we only support messages up to 52428800 bytes long.
W20260928 14:54:39.266793 14900 connection.cc:196] Error closing socket: Network error: TlsSocket::Close: Broken pipe
I20260928 14:54:39.281667 14912 acceptor_pool.cc:254] collecting diagnostics on the listening RPC socket unix:/tmp/dist-test-taskUKbJHR/test-tmp/rpc-test-f790a759be8d4cb4aa6bc44db012fa5a.sock every 8 connection(s)
I20260928 14:54:39.281667 14913 acceptor_pool.cc:254] collecting diagnostics on the listening RPC socket unix:/tmp/dist-test-taskUKbJHR/test-tmp/rpc-test-f790a759be8d4cb4aa6bc44db012fa5a.sock every 8 connection(s)
W20260928 14:54:45.432060 14909 connection.cc:577] server connection from unix:<unnamed>: received bad data: 'Corruption: Invalid packet: message had a length of 2147483710, but we only support messages up to 2147483647 bytes
'
W20260928 14:54:45.432384 14925 connection.cc:196] Error closing socket: Network error: TlsSocket::Close: Broken pipe
[       OK ] Parameters/TestRpc.TestRpcSidecarLimits/SSL_UnixSocket (7847 ms)
[ RUN      ] Parameters/TestRpc.TestCallTimeoutDoesntAffectNegotiation/SSL_UnixSocket
I20260928 14:54:45.456554 14937 acceptor_pool.cc:254] collecting diagnostics on the listening RPC socket unix:/tmp/dist-test-taskUKbJHR/test-tmp/rpc-test-544c43f03f0a424db4617d4e1c0bba3c.sock every 8 connection(s)
I20260928 14:54:45.456624 14938 acceptor_pool.cc:254] collecting diagnostics on the listening RPC socket unix:/tmp/dist-test-taskUKbJHR/test-tmp/rpc-test-544c43f03f0a424db4617d4e1c0bba3c.sock every 8 connection(s)
W20260928 14:54:45.466050 14930 negotiation.cc:266] Injecting 500ms delay in negotiation
I20260928 14:54:45.516325 14645 rpc-test-base.h:595] status: Timed out: connection negotiation to unix:/tmp/dist-test-taskUKbJHR/test-tmp/rpc-test-544c43f03f0a424db4617d4e1c0bba3c.sock for RPC Sleep timed out after 0.050s (ON_OUTBOUND_QUEUE), seconds elapsed: 0.0505737
W20260928 14:54:45.970258 14934 connection.cc:196] Error closing socket: Network error: TlsSocket::Close: Broken pipe
[       OK ] Parameters/TestRpc.TestCallTimeoutDoesntAffectNegotiation/SSL_UnixSocket (537 ms)
[ RUN      ] Parameters/TestRpc.TestRpcHandlerLatencyMetric/SSL_UnixSocket
I20260928 14:54:45.997368 14962 acceptor_pool.cc:254] collecting diagnostics on the listening RPC socket unix:/tmp/dist-test-taskUKbJHR/test-tmp/rpc-test-4f3e29bf774c4fddad0c84afba5b6646.sock every 8 connection(s)
I20260928 14:54:45.997375 14963 acceptor_pool.cc:254] collecting diagnostics on the listening RPC socket unix:/tmp/dist-test-taskUKbJHR/test-tmp/rpc-test-4f3e29bf774c4fddad0c84afba5b6646.sock every 8 connection(s)
I20260928 14:54:46.033504 14645 rpc-test.cc:1236] Sleep() min lat: 20309
I20260928 14:54:46.033583 14645 rpc-test.cc:1237] Sleep() mean lat: 20309
I20260928 14:54:46.033610 14645 rpc-test.cc:1238] Sleep() max lat: 20309
I20260928 14:54:46.033622 14645 rpc-test.cc:1239] Sleep() #calls: 1
[       OK ] Parameters/TestRpc.TestRpcHandlerLatencyMetric/SSL_UnixSocket (64 ms)
[ RUN      ] Parameters/TestRpc.TimedOutOnResponseMetricServiceQueue/SSL_UnixSocket
I20260928 14:54:46.048892 14989 acceptor_pool.cc:254] collecting diagnostics on the listening RPC socket unix:/tmp/dist-test-taskUKbJHR/test-tmp/rpc-test-ce78e8e2ed864716a42421d8883a34d5.sock every 8 connection(s)
I20260928 14:54:46.048877 14988 acceptor_pool.cc:254] collecting diagnostics on the listening RPC socket unix:/tmp/dist-test-taskUKbJHR/test-tmp/rpc-test-ce78e8e2ed864716a42421d8883a34d5.sock every 8 connection(s)
W20260928 14:54:46.112330 14990 rpcz_store.cc:267] Call kudu.rpc_test.CalculatorService.Sleep from unix:<unnamed> (request call id 2) took 20 ms (client timeout 20 ms). Trace:
W20260928 14:54:46.112416 14990 rpcz_store.cc:269] 0928 14:54:46.092052 (+     0us) service_pool.cc:170] Inserting onto call queue
0928 14:54:46.112288 (+ 20236us) service_pool.cc:214] Skipping call since client already timed out
0928 14:54:46.112297 (+     9us) inbound_call.cc:173] Queueing failure response
Metrics: {}
W20260928 14:54:46.113049 14985 connection.cc:196] Error closing socket: Network error: TlsSocket::Close: Broken pipe
[       OK ] Parameters/TestRpc.TimedOutOnResponseMetricServiceQueue/SSL_UnixSocket (78 ms)
[ RUN      ] Parameters/TestRpc.RpcPendingConnectionsMetric/SSL_UnixSocket
I20260928 14:54:46.115486 15011 acceptor_pool.cc:254] collecting diagnostics on the listening RPC socket 0.0.0.0:45639 every 8 connection(s)
I20260928 14:54:46.115556 15012 acceptor_pool.cc:254] collecting diagnostics on the listening RPC socket 0.0.0.0:45639 every 8 connection(s)
W20260928 14:54:46.116118 15007 negotiation.cc:337] Failed RPC negotiation. Trace:
0928 14:54:46.115933 (+     0us) reactor.cc:625] Submitting negotiation task for server connection from 127.0.0.1:55470 (local address 127.0.0.1:45639)
0928 14:54:46.115976 (+    43us) server_negotiation.cc:206] Beginning negotiation
0928 14:54:46.115977 (+     1us) server_negotiation.cc:399] Waiting for connection header
0928 14:54:46.116061 (+    84us) negotiation.cc:327] Negotiation complete: Network error: Server connection negotiation failed: server connection from 127.0.0.1:55470: BlockingRecv error: recv got EOF from 127.0.0.1:55470 (error 108)
Metrics: {"server-negotiator.queue_time_us":14}
[       OK ] Parameters/TestRpc.RpcPendingConnectionsMetric/SSL_UnixSocket (13 ms)
[ RUN      ] Parameters/TestRpc.TestRpcContextClientDeadline/SSL_UnixSocket
I20260928 14:54:46.139822 15027 acceptor_pool.cc:254] collecting diagnostics on the listening RPC socket unix:/tmp/dist-test-taskUKbJHR/test-tmp/rpc-test-1e001c2c160041089e0ce29fbfe511ca.sock every 8 connection(s)
I20260928 14:54:46.139848 15028 acceptor_pool.cc:254] collecting diagnostics on the listening RPC socket unix:/tmp/dist-test-taskUKbJHR/test-tmp/rpc-test-1e001c2c160041089e0ce29fbfe511ca.sock every 8 connection(s)
W20260928 14:54:46.186410 15024 connection.cc:196] Error closing socket: Network error: TlsSocket::Close: Broken pipe
[       OK ] Parameters/TestRpc.TestRpcContextClientDeadline/SSL_UnixSocket (60 ms)
[ RUN      ] Parameters/TestRpc.TestApplicationFeatureFlagUnsupportedServer/SSL_UnixSocket
I20260928 14:54:46.193746 15052 acceptor_pool.cc:254] collecting diagnostics on the listening RPC socket unix:/tmp/dist-test-taskUKbJHR/test-tmp/rpc-test-13d6900a35da44deb77ebf369b786a97.sock every 8 connection(s)
I20260928 14:54:46.193785 15053 acceptor_pool.cc:254] collecting diagnostics on the listening RPC socket unix:/tmp/dist-test-taskUKbJHR/test-tmp/rpc-test-13d6900a35da44deb77ebf369b786a97.sock every 8 connection(s)
[       OK ] Parameters/TestRpc.TestApplicationFeatureFlagUnsupportedServer/SSL_UnixSocket (23 ms)
[ RUN      ] Parameters/TestRpc.TestCancellationAsync/SSL_UnixSocket
I20260928 14:54:46.218231 15077 acceptor_pool.cc:254] collecting diagnostics on the listening RPC socket unix:/tmp/dist-test-taskUKbJHR/test-tmp/rpc-test-0dbf6edaec2d4fcd8c3bf53c91bed60a.sock every 8 connection(s)
I20260928 14:54:46.218240 15078 acceptor_pool.cc:254] collecting diagnostics on the listening RPC socket unix:/tmp/dist-test-taskUKbJHR/test-tmp/rpc-test-0dbf6edaec2d4fcd8c3bf53c91bed60a.sock every 8 connection(s)
I20260928 14:54:46.218370 14645 rpc-test.cc:1716] Connecting to unix:/tmp/dist-test-taskUKbJHR/test-tmp/rpc-test-0dbf6edaec2d4fcd8c3bf53c91bed60a.sock
I20260928 14:54:46.221992 14645 test_util.cc:268] Using random seed: 1060781220
I20260928 14:54:46.235853 15081 rpc-test-base.h:240] got call: sleep_micros: 500 pattern: 4294967295 num_repetitions: 2097152 sidecar_idx: 0
I20260928 14:54:46.245983 15081 rpc-test-base.h:240] got call: sleep_micros: 500 pattern: 4294967295 num_repetitions: 2097152 sidecar_idx: 0
I20260928 14:54:46.256088 15081 rpc-test-base.h:240] got call: sleep_micros: 500 pattern: 4294967295 num_repetitions: 2097152 sidecar_idx: 0
I20260928 14:54:46.265851 15081 rpc-test-base.h:240] got call: sleep_micros: 500 pattern: 4294967295 num_repetitions: 2097152 sidecar_idx: 0
I20260928 14:54:46.275746 15081 rpc-test-base.h:240] got call: sleep_micros: 500 pattern: 4294967295 num_repetitions: 2097152 sidecar_idx: 0
I20260928 14:54:46.286238 15081 rpc-test-base.h:240] got call: sleep_micros: 500 pattern: 4294967295 num_repetitions: 2097152 sidecar_idx: 0
I20260928 14:54:46.296209 15081 rpc-test-base.h:240] got call: sleep_micros: 500 pattern: 4294967295 num_repetitions: 2097152 sidecar_idx: 0
I20260928 14:54:46.306566 15081 rpc-test-base.h:240] got call: sleep_micros: 500 pattern: 4294967295 num_repetitions: 2097152 sidecar_idx: 0
W20260928 14:54:46.307940 15074 connection.cc:196] Error closing socket: Network error: TlsSocket::Close: Broken pipe
W20260928 14:54:46.309571 15074 connection.cc:441] server connection from unix:<unnamed> torn down before Call kudu.rpc.GenericCalculatorService.SleepWithSidecar from unix:<unnamed> (request call id 9) could send its response
[       OK ] Parameters/TestRpc.TestCancellationAsync/SSL_UnixSocket (99 ms)
[ RUN      ] Parameters/TestRpc.TestPerformanceBySocketType/SSL_UnixSocket
I20260928 14:54:46.334982 15102 acceptor_pool.cc:254] collecting diagnostics on the listening RPC socket unix:/tmp/dist-test-taskUKbJHR/test-tmp/rpc-test-bda002d0ba5843dd8423fa0bbca3e120.sock every 8 connection(s)
I20260928 14:54:46.335170 14645 rpc-test.cc:1846] Connecting to unix:/tmp/dist-test-taskUKbJHR/test-tmp/rpc-test-bda002d0ba5843dd8423fa0bbca3e120.sock
I20260928 14:54:46.335016 15103 acceptor_pool.cc:254] collecting diagnostics on the listening RPC socket unix:/tmp/dist-test-taskUKbJHR/test-tmp/rpc-test-bda002d0ba5843dd8423fa0bbca3e120.sock every 8 connection(s)
I20260928 14:54:47.562193 14645 rpc-test.cc:1859] Sending 1024MB via ssl-enabled unix socket: real 1.223s	user 1.292s	sys 0.882s
I20260928 14:54:48.875061 14645 rpc-test.cc:1859] Sending 1024MB via ssl-enabled unix socket: real 1.313s	user 1.455s	sys 0.882s
I20260928 14:54:50.183983 14645 rpc-test.cc:1859] Sending 1024MB via ssl-enabled unix socket: real 1.309s	user 1.514s	sys 0.808s
I20260928 14:54:51.410297 14645 rpc-test.cc:1859] Sending 1024MB via ssl-enabled unix socket: real 1.226s	user 1.291s	sys 0.886s
I20260928 14:54:52.658126 14645 rpc-test.cc:1859] Sending 1024MB via ssl-enabled unix socket: real 1.248s	user 1.378s	sys 0.860s
W20260928 14:54:52.658820 15099 connection.cc:196] Error closing socket: Network error: TlsSocket::Close: Broken pipe
[       OK ] Parameters/TestRpc.TestPerformanceBySocketType/SSL_UnixSocket (6349 ms)
[----------] 20 tests from Parameters/TestRpc (27665 ms total)

[----------] 1 test from Parameters/TestRpcSocketTxRxQueue
[ RUN      ] Parameters/TestRpcSocketTxRxQueue.AcceptorRxQueueSizeMetric/0
I20260928 14:54:52.661262 15127 acceptor_pool.cc:254] collecting diagnostics on the listening RPC socket 0.0.0.0:44441 every 1 connection(s)
I20260928 14:54:52.661310 15128 acceptor_pool.cc:254] collecting diagnostics on the listening RPC socket 0.0.0.0:44441 every 1 connection(s)
W20260928 14:54:52.661847 15123 negotiation.cc:337] Failed RPC negotiation. Trace:
0928 14:54:52.661710 (+     0us) reactor.cc:625] Submitting negotiation task for server connection from 127.0.0.1:56630 (local address 127.0.0.1:44441)
0928 14:54:52.661754 (+    44us) server_negotiation.cc:206] Beginning negotiation
0928 14:54:52.661756 (+     2us) server_negotiation.cc:399] Waiting for connection header
0928 14:54:52.661820 (+    64us) negotiation.cc:327] Negotiation complete: Network error: Server connection negotiation failed: server connection from 127.0.0.1:56630: BlockingRecv error: recv got EOF from 127.0.0.1:56630 (error 108)
Metrics: {"server-negotiator.queue_time_us":15}
[       OK ] Parameters/TestRpcSocketTxRxQueue.AcceptorRxQueueSizeMetric/0 (4 ms)
[----------] 1 test from Parameters/TestRpcSocketTxRxQueue (4 ms total)

[----------] Global test environment tear-down
[==========] 21 tests from 2 test suites ran. (27669 ms total)
[  PASSED  ] 20 tests.
[  FAILED  ] 1 test, listed below:
[  FAILED  ] Parameters/TestRpc.TestCallWithChainCertAndChainCA/SSL_UnixSocket, where GetParam() = (true, true)

 1 FAILED TEST