Parameters/TestRpc.TestCallWithChainCertAndRootCA/SSL_TCP: /data0/somelongdirectorytoavoidrpathissues/src/kudu/src/kudu/rpc/rpc-test.cc:303: Failure
Failed
Bad status: Runtime error: could not verify certificate chain (error with cert: subject=CN = localhost, ST = sadfjas, C = AS, emailAddress = sdflkdsajf, O = lskdfjlsad, OU = sldfkja, issuer=C = AS, ST = ASDfkjdhf, L = lskdjf, O = saldfja, OU = skdjf, CN = localhost, emailAddress = sadjflkadsj): : certificate has expired
Google Test trace:
/data0/somelongdirectorytoavoidrpathissues/src/kudu/src/kudu/rpc/rpc-test.cc:300: Connecting to 0.0.0.0:36459
I20260926 12:11:59.184089 2354 test_util.cc:175] -----------------------------------------------
I20260926 12:11:59.184275 2354 test_util.cc:176] Had fatal failures, leaving test files at /tmp/dist-test-taskAia4Vw/test-tmp/rpc-test.1.Parameters_TestRpc.TestCallWithChainCertAndRootCA_SSL_TCP.1790424717687258-2354-0
Note: This is test shard 2 of 8.
[==========] Running 21 tests from 2 test suites.
[----------] Global test environment set-up.
[----------] 1 test from TestRpc
[ RUN ] TestRpc.TestMethodsByName
[ OK ] TestRpc.TestMethodsByName (6 ms)
[----------] 1 test from TestRpc (6 ms total)
[----------] 20 tests from Parameters/TestRpc
[ RUN ] Parameters/TestRpc.TestAcceptorPoolStartStop/SSL_TCP
WARNING: Logging before InitGoogleLogging() is written to STDERR
I20260926 12:11:57.795141 2369 acceptor_pool.cc:254] collecting diagnostics on the listening RPC socket 0.0.0.0:32871 every 8 connection(s)
I20260926 12:11:57.796444 2370 acceptor_pool.cc:254] collecting diagnostics on the listening RPC socket 0.0.0.0:32871 every 8 connection(s)
I20260926 12:11:58.911051 2381 acceptor_pool.cc:254] collecting diagnostics on the listening RPC socket 0.0.0.0:36739 every 8 connection(s)
I20260926 12:11:58.912454 2382 acceptor_pool.cc:254] collecting diagnostics on the listening RPC socket 0.0.0.0:36739 every 8 connection(s)
I20260926 12:11:58.935211 2392 acceptor_pool.cc:254] collecting diagnostics on the listening RPC socket 0.0.0.0:37983 every 8 connection(s)
I20260926 12:11:58.936581 2393 acceptor_pool.cc:254] collecting diagnostics on the listening RPC socket 0.0.0.0:37983 every 8 connection(s)
I20260926 12:11:58.959115 2403 acceptor_pool.cc:254] collecting diagnostics on the listening RPC socket 0.0.0.0:36371 every 8 connection(s)
I20260926 12:11:58.959750 2404 acceptor_pool.cc:254] collecting diagnostics on the listening RPC socket 0.0.0.0:36371 every 8 connection(s)
I20260926 12:11:59.000008 2414 acceptor_pool.cc:254] collecting diagnostics on the listening RPC socket 0.0.0.0:46857 every 8 connection(s)
I20260926 12:11:59.000702 2415 acceptor_pool.cc:254] collecting diagnostics on the listening RPC socket 0.0.0.0:46857 every 8 connection(s)
[ OK ] Parameters/TestRpc.TestAcceptorPoolStartStop/SSL_TCP (1259 ms)
[ RUN ] Parameters/TestRpc.TestCall/SSL_TCP
I20260926 12:11:59.029696 2427 acceptor_pool.cc:254] collecting diagnostics on the listening RPC socket 0.0.0.0:36347 every 8 connection(s)
I20260926 12:11:59.031672 2428 acceptor_pool.cc:254] collecting diagnostics on the listening RPC socket 0.0.0.0:36347 every 8 connection(s)
I20260926 12:11:59.036844 2354 rpc-test.cc:234] Connecting to 0.0.0.0:36347
[ OK ] Parameters/TestRpc.TestCall/SSL_TCP (121 ms)
[ RUN ] Parameters/TestRpc.TestCallWithChainCertAndRootCA/SSL_TCP
I20260926 12:11:59.163094 2452 acceptor_pool.cc:254] collecting diagnostics on the listening RPC socket 0.0.0.0:36459 every 8 connection(s)
I20260926 12:11:59.163842 2453 acceptor_pool.cc:254] collecting diagnostics on the listening RPC socket 0.0.0.0:36459 every 8 connection(s)
/data0/somelongdirectorytoavoidrpathissues/src/kudu/src/kudu/rpc/rpc-test.cc:303: Failure
Failed
Bad status: Runtime error: could not verify certificate chain (error with cert: subject=CN = localhost, ST = sadfjas, C = AS, emailAddress = sdflkdsajf, O = lskdfjlsad, OU = sldfkja, issuer=C = AS, ST = ASDfkjdhf, L = lskdjf, O = saldfja, OU = skdjf, CN = localhost, emailAddress = sadjflkadsj): : certificate has expired
Google Test trace:
/data0/somelongdirectorytoavoidrpathissues/src/kudu/src/kudu/rpc/rpc-test.cc:300: Connecting to 0.0.0.0:36459
I20260926 12:11:59.184089 2354 test_util.cc:175] -----------------------------------------------
I20260926 12:11:59.184275 2354 test_util.cc:176] Had fatal failures, leaving test files at /tmp/dist-test-taskAia4Vw/test-tmp/rpc-test.1.Parameters_TestRpc.TestCallWithChainCertAndRootCA_SSL_TCP.1790424717687258-2354-0
[ FAILED ] Parameters/TestRpc.TestCallWithChainCertAndRootCA/SSL_TCP, where GetParam() = (true, false) (57 ms)
[ RUN ] Parameters/TestRpc.TestCallWithBadPasswordProtectedKey/SSL_TCP
[ OK ] Parameters/TestRpc.TestCallWithBadPasswordProtectedKey/SSL_TCP (31 ms)
[ RUN ] Parameters/TestRpc.TestInvalidMethodCall/SSL_TCP
I20260926 12:11:59.245501 2489 acceptor_pool.cc:254] collecting diagnostics on the listening RPC socket 0.0.0.0:33519 every 8 connection(s)
I20260926 12:11:59.246192 2490 acceptor_pool.cc:254] collecting diagnostics on the listening RPC socket 0.0.0.0:33519 every 8 connection(s)
I20260926 12:11:59.249440 2354 rpc-test.cc:406] Connecting to 0.0.0.0:33519
[ OK ] Parameters/TestRpc.TestInvalidMethodCall/SSL_TCP (89 ms)
[ RUN ] Parameters/TestRpc.TestHighFDs/SSL_TCP
I20260926 12:11:59.516484 2514 acceptor_pool.cc:254] collecting diagnostics on the listening RPC socket 0.0.0.0:43635 every 8 connection(s)
I20260926 12:11:59.517170 2515 acceptor_pool.cc:254] collecting diagnostics on the listening RPC socket 0.0.0.0:43635 every 8 connection(s)
[ OK ] Parameters/TestRpc.TestHighFDs/SSL_TCP (255 ms)
[ RUN ] Parameters/TestRpc.TestConnectionAlwaysKeepalive/SSL_TCP
I20260926 12:11:59.583741 2537 acceptor_pool.cc:254] collecting diagnostics on the listening RPC socket 0.0.0.0:33011 every 8 connection(s)
I20260926 12:11:59.584455 2538 acceptor_pool.cc:254] collecting diagnostics on the listening RPC socket 0.0.0.0:33011 every 8 connection(s)
I20260926 12:11:59.587463 2354 rpc-test.cc:532] Connecting to 0.0.0.0:33011
[ OK ] Parameters/TestRpc.TestConnectionAlwaysKeepalive/SSL_TCP (3062 ms)
[ RUN ] Parameters/TestRpc.TestReopenOutboundConnections/SSL_TCP
I20260926 12:12:02.651530 2560 acceptor_pool.cc:254] collecting diagnostics on the listening RPC socket 0.0.0.0:38217 every 8 connection(s)
I20260926 12:12:02.652139 2561 acceptor_pool.cc:254] collecting diagnostics on the listening RPC socket 0.0.0.0:38217 every 8 connection(s)
I20260926 12:12:02.655162 2354 rpc-test.cc:658] Connecting to 0.0.0.0:38217
[ OK ] Parameters/TestRpc.TestReopenOutboundConnections/SSL_TCP (418 ms)
[ RUN ] Parameters/TestRpc.TestConnectionNetworkPlane/SSL_TCP
I20260926 12:12:03.058145 2583 acceptor_pool.cc:254] collecting diagnostics on the listening RPC socket 0.0.0.0:36981 every 8 connection(s)
I20260926 12:12:03.058929 2584 acceptor_pool.cc:254] collecting diagnostics on the listening RPC socket 0.0.0.0:36981 every 8 connection(s)
I20260926 12:12:03.062215 2354 rpc-test.cc:772] Connecting to 0.0.0.0:36981
[ OK ] Parameters/TestRpc.TestConnectionNetworkPlane/SSL_TCP (74 ms)
[ RUN ] Parameters/TestRpc.TestTCPKeepalive/SSL_TCP
I20260926 12:12:03.133684 2608 acceptor_pool.cc:254] collecting diagnostics on the listening RPC socket 0.0.0.0:34475 every 8 connection(s)
I20260926 12:12:03.134399 2609 acceptor_pool.cc:254] collecting diagnostics on the listening RPC socket 0.0.0.0:34475 every 8 connection(s)
I20260926 12:12:03.175293 2612 rpc-test-base.h:222] got call: sleep_micros: 8000000 deferred: true
I20260926 12:12:11.179337 2612 rpcz_store.cc:275] Call kudu.rpc.GenericCalculatorService.Sleep from 127.0.0.1:47386 (request call id 0) took 8004 ms. Trace:
I20260926 12:12:11.179800 2612 rpcz_store.cc:276] 0926 12:12:03.174948 (+ 0us) service_pool.cc:170] Inserting onto call queue
0926 12:12:03.175130 (+ 182us) service_pool.cc:227] Handling call
0926 12:12:11.179181 (+8004051us) inbound_call.cc:173] Queueing success response
Metrics: {}
[ OK ] Parameters/TestRpc.TestTCPKeepalive/SSL_TCP (8077 ms)
[ RUN ] Parameters/TestRpc.TestMaxSmallSidecars/SSL_TCP
I20260926 12:12:11.229465 2634 acceptor_pool.cc:254] collecting diagnostics on the listening RPC socket 0.0.0.0:42267 every 8 connection(s)
I20260926 12:12:11.230173 2635 acceptor_pool.cc:254] collecting diagnostics on the listening RPC socket 0.0.0.0:42267 every 8 connection(s)
[ OK ] Parameters/TestRpc.TestMaxSmallSidecars/SSL_TCP (232 ms)
[ RUN ] Parameters/TestRpc.TestCallTimeout/SSL_TCP
I20260926 12:12:11.446178 2659 acceptor_pool.cc:254] collecting diagnostics on the listening RPC socket 0.0.0.0:40605 every 8 connection(s)
I20260926 12:12:11.446849 2660 acceptor_pool.cc:254] collecting diagnostics on the listening RPC socket 0.0.0.0:40605 every 8 connection(s)
I20260926 12:12:11.477515 2354 rpc-test-base.h:595] status: Timed out: connection negotiation to 0.0.0.0:40605 for RPC Sleep timed out after 0.000s (ON_OUTBOUND_QUEUE), seconds elapsed: 0.00251837
I20260926 12:12:11.485555 2663 rpc-test-base.h:222] got call: sleep_micros: 700000
I20260926 12:12:11.678369 2354 rpc-test-base.h:595] status: Timed out: Sleep RPC to 0.0.0.0:40605 timed out after 0.200s (SENT), seconds elapsed: 0.200436
I20260926 12:12:11.679831 2662 rpc-test-base.h:222] got call: sleep_micros: 2000000
W20260926 12:12:12.186134 2663 rpcz_store.cc:267] Call kudu.rpc.GenericCalculatorService.Sleep from 127.0.0.1:59890 (request call id 1) took 700 ms (client timeout 200 ms). Trace:
W20260926 12:12:12.186456 2663 rpcz_store.cc:269] 0926 12:12:11.485402 (+ 0us) service_pool.cc:170] Inserting onto call queue
0926 12:12:11.485497 (+ 95us) service_pool.cc:227] Handling call
0926 12:12:12.186074 (+700577us) inbound_call.cc:173] Queueing success response
Metrics: {}
I20260926 12:12:13.180939 2354 rpc-test-base.h:595] status: Timed out: Sleep RPC to 0.0.0.0:40605 timed out after 1.500s (SENT), seconds elapsed: 1.50219
W20260926 12:12:13.680454 2662 rpcz_store.cc:267] Call kudu.rpc.GenericCalculatorService.Sleep from 127.0.0.1:59890 (request call id 2) took 2000 ms (client timeout 1500 ms). Trace:
W20260926 12:12:13.680763 2662 rpcz_store.cc:269] 0926 12:12:11.679551 (+ 0us) service_pool.cc:170] Inserting onto call queue
0926 12:12:11.679684 (+ 133us) service_pool.cc:227] Handling call
0926 12:12:13.680398 (+2000714us) inbound_call.cc:173] Queueing success response
Metrics: {}
W20260926 12:12:13.681270 2657 connection.cc:441] server connection from 127.0.0.1:59890 torn down before Call kudu.rpc.GenericCalculatorService.Sleep from 127.0.0.1:59890 (request call id 2) could send its response
[ OK ] Parameters/TestRpc.TestCallTimeout/SSL_TCP (2260 ms)
[ RUN ] Parameters/TestRpc.TestServerShutsDown/SSL_TCP
I20260926 12:12:13.688292 2354 rpc-test.cc:1125] Connecting to 0.0.0.0:45989
W20260926 12:12:13.696753 2676 negotiation.cc:337] Failed RPC negotiation. Trace:
0926 12:12:13.695181 (+ 0us) reactor.cc:625] Submitting negotiation task for client connection to 0.0.0.0:45989 (local address 127.0.0.1:40134)
0926 12:12:13.695645 (+ 464us) negotiation.cc:107] Waiting for socket to connect
0926 12:12:13.695677 (+ 32us) client_negotiation.cc:174] Beginning negotiation
0926 12:12:13.695901 (+ 224us) client_negotiation.cc:252] Sending NEGOTIATE NegotiatePB request
0926 12:12:13.696156 (+ 255us) negotiation.cc:327] Negotiation complete: Network error: Client connection negotiation failed: client connection to 0.0.0.0:45989: BlockingWrite error: write error: Broken pipe (error 32)
Metrics: {"client-negotiator.queue_time_us":120}
[ OK ] Parameters/TestRpc.TestServerShutsDown/SSL_TCP (12 ms)
[ RUN ] Parameters/TestRpc.TimedOutOnResponseMetric/SSL_TCP
I20260926 12:12:13.717751 2693 acceptor_pool.cc:254] collecting diagnostics on the listening RPC socket 0.0.0.0:45009 every 8 connection(s)
I20260926 12:12:13.718411 2694 acceptor_pool.cc:254] collecting diagnostics on the listening RPC socket 0.0.0.0:45009 every 8 connection(s)
W20260926 12:12:13.973512 2697 rpcz_store.cc:267] Call kudu.rpc_test.CalculatorService.Sleep from 127.0.0.1:43824 (request call id 3) took 50 ms (client timeout 25 ms). Trace:
W20260926 12:12:13.973832 2697 rpcz_store.cc:269] 0926 12:12:13.922871 (+ 0us) service_pool.cc:170] Inserting onto call queue
0926 12:12:13.922993 (+ 122us) service_pool.cc:227] Handling call
0926 12:12:13.973431 (+ 50438us) inbound_call.cc:173] Queueing success response
Related trace 'test_child':
Metrics: {"test_sleep_us":50000,"child_traces":[["test_child",{"related_trace_metric":1}]]}
W20260926 12:12:14.032932 2697 rpcz_store.cc:267] Call kudu.rpc_test.CalculatorService.Sleep from 127.0.0.1:43824 (request call id 4) took 50 ms (client timeout 50 ms). Trace:
W20260926 12:12:14.033258 2697 rpcz_store.cc:269] 0926 12:12:13.982357 (+ 0us) service_pool.cc:170] Inserting onto call queue
0926 12:12:13.982490 (+ 133us) service_pool.cc:227] Handling call
0926 12:12:14.032864 (+ 50374us) inbound_call.cc:173] Queueing success response
Related trace 'test_child':
Metrics: {"test_sleep_us":50000,"child_traces":[["test_child",{"related_trace_metric":1}]]}
W20260926 12:12:14.035786 2690 connection.cc:196] Error closing socket: Network error: TlsSocket::Close: Connection reset by peer
[ OK ] Parameters/TestRpc.TimedOutOnResponseMetric/SSL_TCP (340 ms)
[ RUN ] Parameters/TestRpc.AcceptorDispatchingTimesMetric/SSL_TCP
I20260926 12:12:14.051510 2718 acceptor_pool.cc:254] collecting diagnostics on the listening RPC socket 0.0.0.0:36251 every 8 connection(s)
I20260926 12:12:14.052167 2719 acceptor_pool.cc:254] collecting diagnostics on the listening RPC socket 0.0.0.0:36251 every 8 connection(s)
W20260926 12:12:14.056730 2714 negotiation.cc:337] Failed RPC negotiation. Trace:
0926 12:12:14.055661 (+ 0us) reactor.cc:625] Submitting negotiation task for server connection from 127.0.0.1:35564 (local address 127.0.0.1:36251)
0926 12:12:14.056037 (+ 376us) server_negotiation.cc:206] Beginning negotiation
0926 12:12:14.056055 (+ 18us) server_negotiation.cc:399] Waiting for connection header
0926 12:12:14.056285 (+ 230us) negotiation.cc:327] Negotiation complete: Network error: Server connection negotiation failed: server connection from 127.0.0.1:35564: BlockingRecv error: recv got EOF from 127.0.0.1:35564 (error 108)
Metrics: {"server-negotiator.queue_time_us":102}
[ OK ] Parameters/TestRpc.AcceptorDispatchingTimesMetric/SSL_TCP (21 ms)
[ RUN ] Parameters/TestRpc.TestRpcCallbackDestroysMessenger/SSL_TCP
[ OK ] Parameters/TestRpc.TestRpcCallbackDestroysMessenger/SSL_TCP (23 ms)
[ RUN ] Parameters/TestRpc.TestApplicationFeatureFlag/SSL_TCP
I20260926 12:12:14.107198 2743 acceptor_pool.cc:254] collecting diagnostics on the listening RPC socket 0.0.0.0:43751 every 8 connection(s)
I20260926 12:12:14.107939 2744 acceptor_pool.cc:254] collecting diagnostics on the listening RPC socket 0.0.0.0:43751 every 8 connection(s)
W20260926 12:12:14.134857 2742 messenger.cc:357] Unable to handle RPC call: Not implemented: call requires unsupported application feature flags: 99
[ OK ] Parameters/TestRpc.TestApplicationFeatureFlag/SSL_TCP (56 ms)
[ RUN ] Parameters/TestRpc.TestCancellation/SSL_TCP
I20260926 12:12:14.163143 2768 acceptor_pool.cc:254] collecting diagnostics on the listening RPC socket 0.0.0.0:34939 every 8 connection(s)
I20260926 12:12:14.163828 2769 acceptor_pool.cc:254] collecting diagnostics on the listening RPC socket 0.0.0.0:34939 every 8 connection(s)
I20260926 12:12:14.166843 2354 rpc-test.cc:1648] Connecting to 0.0.0.0:34939
I20260926 12:12:14.280711 2354 rpc-test-base.h:595] status: Aborted: Sleep RPC to 0.0.0.0:34939 is cancelled in state READY, seconds elapsed: 0.000423794
I20260926 12:12:14.419034 2354 rpc-test-base.h:595] status: Aborted: Sleep RPC to 0.0.0.0:34939 is cancelled in state SENT, seconds elapsed: 0.000933096
I20260926 12:12:14.458362 2771 rpc-test-base.h:222] got call: sleep_micros: 510000
I20260926 12:12:14.586885 2354 rpc-test-base.h:595] status: Aborted: Sleep RPC to 0.0.0.0:34939 is cancelled in state SENT, seconds elapsed: 0.000797094
I20260926 12:12:14.622460 2770 rpc-test-base.h:222] got call: sleep_micros: 510000
I20260926 12:12:14.738448 2354 rpc-test-base.h:595] status: Aborted: Sleep RPC to 0.0.0.0:34939 is cancelled in state SENT, seconds elapsed: 0.000819268
W20260926 12:12:14.775636 2772 rpcz_store.cc:267] Call kudu.rpc.GenericCalculatorService.Sleep from 127.0.0.1:48078 (request call id 11) took 14 ms (client timeout 10 ms). Trace:
W20260926 12:12:14.775935 2772 rpcz_store.cc:269] 0926 12:12:14.760858 (+ 0us) service_pool.cc:170] Inserting onto call queue
0926 12:12:14.775367 (+ 14509us) service_pool.cc:214] Skipping call since client already timed out
0926 12:12:14.775470 (+ 103us) inbound_call.cc:173] Queueing failure response
Metrics: {}
I20260926 12:12:14.776423 2772 rpc-test-base.h:222] got call: sleep_micros: 1500000
W20260926 12:12:14.969012 2771 rpcz_store.cc:267] Call kudu.rpc.GenericCalculatorService.Sleep from 127.0.0.1:48078 (request call id 3) took 510 ms (client timeout 10 ms). Trace:
W20260926 12:12:14.969363 2771 rpcz_store.cc:269] 0926 12:12:14.458159 (+ 0us) service_pool.cc:170] Inserting onto call queue
0926 12:12:14.458291 (+ 132us) service_pool.cc:227] Handling call
0926 12:12:14.968962 (+510671us) inbound_call.cc:173] Queueing success response
Metrics: {}
W20260926 12:12:15.133189 2770 rpcz_store.cc:267] Call kudu.rpc.GenericCalculatorService.Sleep from 127.0.0.1:48078 (request call id 7) took 511 ms (client timeout 10 ms). Trace:
W20260926 12:12:15.133530 2770 rpcz_store.cc:269] 0926 12:12:14.622192 (+ 0us) service_pool.cc:170] Inserting onto call queue
0926 12:12:14.622369 (+ 177us) service_pool.cc:227] Handling call
0926 12:12:15.133103 (+510734us) inbound_call.cc:173] Queueing success response
Metrics: {}
I20260926 12:12:15.740538 2354 rpc-test-base.h:595] status: Timed out: Sleep RPC to 0.0.0.0:34939 timed out after 1.000s (SENT), seconds elapsed: 1.00168
I20260926 12:12:15.741808 2770 rpc-test-base.h:222] got call: sleep_micros: 1500000
W20260926 12:12:16.276932 2772 rpcz_store.cc:267] Call kudu.rpc.GenericCalculatorService.Sleep from 127.0.0.1:48078 (request call id 12) took 1515 ms (client timeout 1000 ms). Trace:
W20260926 12:12:16.277236 2772 rpcz_store.cc:269] 0926 12:12:14.761182 (+ 0us) service_pool.cc:170] Inserting onto call queue
0926 12:12:14.776386 (+ 15204us) service_pool.cc:227] Handling call
0926 12:12:16.276886 (+1500500us) inbound_call.cc:173] Queueing success response
Metrics: {}
I20260926 12:12:16.742193 2354 rpc-test-base.h:595] status: Timed out: Sleep RPC to 0.0.0.0:34939 timed out after 1.000s (SENT), seconds elapsed: 1.00135
W20260926 12:12:16.743575 2767 messenger.cc:357] Unable to handle RPC call: Not implemented: call requires unsupported application feature flags: 99, 1
W20260926 12:12:16.745048 2767 messenger.cc:357] Unable to handle RPC call: Not implemented: call requires unsupported application feature flags: 99, 1
W20260926 12:12:17.242339 2770 rpcz_store.cc:267] Call kudu.rpc.GenericCalculatorService.Sleep from 127.0.0.1:48078 (request call id 13) took 1500 ms (client timeout 1000 ms). Trace:
W20260926 12:12:17.242647 2770 rpcz_store.cc:269] 0926 12:12:15.741637 (+ 0us) service_pool.cc:170] Inserting onto call queue
0926 12:12:15.741761 (+ 124us) service_pool.cc:227] Handling call
0926 12:12:17.242288 (+1500527us) inbound_call.cc:173] Queueing success response
Metrics: {}
W20260926 12:12:17.243191 2767 connection.cc:441] server connection from 127.0.0.1:48078 torn down before Call kudu.rpc.GenericCalculatorService.Sleep from 127.0.0.1:48078 (request call id 13) could send its response
[ OK ] Parameters/TestRpc.TestCancellation/SSL_TCP (3106 ms)
[ RUN ] Parameters/TestRpc.TestCancellationMultiThreads/SSL_TCP
I20260926 12:12:17.281019 2793 acceptor_pool.cc:254] collecting diagnostics on the listening RPC socket 0.0.0.0:36215 every 8 connection(s)
I20260926 12:12:17.281646 2794 acceptor_pool.cc:254] collecting diagnostics on the listening RPC socket 0.0.0.0:36215 every 8 connection(s)
I20260926 12:12:17.284550 2354 rpc-test.cc:1808] Connecting to 0.0.0.0:36215
I20260926 12:12:17.436137 2807 test_util.cc:268] Using random seed: -1099378226
I20260926 12:12:17.437229 2808 test_util.cc:268] Using random seed: -1099377134
I20260926 12:12:17.438683 2809 test_util.cc:268] Using random seed: -1099375680
I20260926 12:12:17.439900 2810 test_util.cc:268] Using random seed: -1099374478
I20260926 12:12:17.441396 2811 test_util.cc:268] Using random seed: -1099373155
I20260926 12:12:17.442546 2812 test_util.cc:268] Using random seed: -1099371909
I20260926 12:12:17.443827 2813 test_util.cc:268] Using random seed: -1099370628
I20260926 12:12:17.445385 2814 test_util.cc:268] Using random seed: -1099369101
I20260926 12:12:17.446825 2815 test_util.cc:268] Using random seed: -1099367677
I20260926 12:12:17.448053 2816 test_util.cc:268] Using random seed: -1099366401
I20260926 12:12:17.449540 2817 test_util.cc:268] Using random seed: -1099364954
I20260926 12:12:17.454056 2818 test_util.cc:268] Using random seed: -1099360435
I20260926 12:12:17.455899 2819 test_util.cc:268] Using random seed: -1099358618
I20260926 12:12:17.457579 2820 test_util.cc:268] Using random seed: -1099356935
I20260926 12:12:17.459843 2821 test_util.cc:268] Using random seed: -1099354712
I20260926 12:12:17.461477 2822 test_util.cc:268] Using random seed: -1099353075
I20260926 12:12:17.463096 2823 test_util.cc:268] Using random seed: -1099351396
I20260926 12:12:17.465399 2824 test_util.cc:268] Using random seed: -1099349136
I20260926 12:12:17.467178 2825 test_util.cc:268] Using random seed: -1099347378
I20260926 12:12:17.468746 2826 test_util.cc:268] Using random seed: -1099345768
I20260926 12:12:17.470745 2827 test_util.cc:268] Using random seed: -1099343762
I20260926 12:12:17.473027 2828 test_util.cc:268] Using random seed: -1099341463
I20260926 12:12:17.475883 2829 test_util.cc:268] Using random seed: -1099338661
I20260926 12:12:17.477941 2830 test_util.cc:268] Using random seed: -1099336584
I20260926 12:12:17.479519 2831 test_util.cc:268] Using random seed: -1099334987
I20260926 12:12:17.481128 2832 test_util.cc:268] Using random seed: -1099333392
I20260926 12:12:17.482643 2833 test_util.cc:268] Using random seed: -1099331856
I20260926 12:12:17.484179 2834 test_util.cc:268] Using random seed: -1099330303
I20260926 12:12:17.485769 2835 test_util.cc:268] Using random seed: -1099328755
I20260926 12:12:17.488235 2836 test_util.cc:268] Using random seed: -1099326261
[ OK ] Parameters/TestRpc.TestCancellationMultiThreads/SSL_TCP (17273 ms)
[ RUN ] Parameters/TestRpc.TestCallId/SSL_TCP
I20260926 12:12:34.550462 2850 acceptor_pool.cc:254] collecting diagnostics on the listening RPC socket 0.0.0.0:38415 every 8 connection(s)
I20260926 12:12:34.551188 2851 acceptor_pool.cc:254] collecting diagnostics on the listening RPC socket 0.0.0.0:38415 every 8 connection(s)
[ OK ] Parameters/TestRpc.TestCallId/SSL_TCP (80 ms)
[----------] 20 tests from Parameters/TestRpc (36858 ms total)
[----------] Global test environment tear-down
[==========] 21 tests from 2 test suites ran. (36866 ms total)
[ PASSED ] 20 tests.
[ FAILED ] 1 test, listed below:
[ FAILED ] Parameters/TestRpc.TestCallWithChainCertAndRootCA/SSL_TCP, where GetParam() = (true, false)
1 FAILED TEST