Diagnosed failure
Parameters/TestRpc.TestCallWithChainCertAndChainCA/SSL_TCP: /data0/somelongdirectorytoavoidrpathissues/src/kudu/src/kudu/rpc/rpc-test.cc:270: Failure
Failed
Bad status: Runtime error: could not verify certificate chain (error with cert: subject=CN = localhost, ST = sadfjas, C = AS, emailAddress = sdflkdsajf, O = lskdfjlsad, OU = sldfkja, issuer=C = AS, ST = ASDfkjdhf, L = lskdjf, O = saldfja, OU = skdjf, CN = localhost, emailAddress = sadjflkadsj): : certificate has expired
Google Test trace:
/data0/somelongdirectorytoavoidrpathissues/src/kudu/src/kudu/rpc/rpc-test.cc:267: Connecting to 0.0.0.0:41173
I20260924 03:10:07.438010 3227 test_util.cc:175] -----------------------------------------------
I20260924 03:10:07.438108 3227 test_util.cc:176] Had fatal failures, leaving test files at /tmp/dist-test-task7BWBM0/test-tmp/rpc-test.5.Parameters_TestRpc.TestCallWithChainCertAndChainCA_SSL_TCP.1790219407326421-3227-0
Full log
Note: This is test shard 6 of 8.
[==========] Running 21 tests from 2 test suites.
[----------] Global test environment set-up.
[----------] 20 tests from Parameters/TestRpc
[ RUN ] Parameters/TestRpc.TestMessengerCreateDestroy/SSL_TCP
WARNING: Logging before InitGoogleLogging() is written to STDERR
I20260924 03:10:07.371836 3227 rpc-test.cc:169] started messenger TestCreateDestroy
[ OK ] Parameters/TestRpc.TestMessengerCreateDestroy/SSL_TCP (29 ms)
[ RUN ] Parameters/TestRpc.TestNegotiationDeadlock/SSL_TCP
I20260924 03:10:07.385008 3247 acceptor_pool.cc:254] collecting diagnostics on the listening RPC socket 0.0.0.0:40415 every 8 connection(s)
I20260924 03:10:07.385322 3248 acceptor_pool.cc:254] collecting diagnostics on the listening RPC socket 0.0.0.0:40415 every 8 connection(s)
[ OK ] Parameters/TestRpc.TestNegotiationDeadlock/SSL_TCP (29 ms)
[ RUN ] Parameters/TestRpc.TestCallWithChainCertAndChainCA/SSL_TCP
I20260924 03:10:07.426113 3263 acceptor_pool.cc:254] collecting diagnostics on the listening RPC socket 0.0.0.0:41173 every 8 connection(s)
I20260924 03:10:07.426436 3264 acceptor_pool.cc:254] collecting diagnostics on the listening RPC socket 0.0.0.0:41173 every 8 connection(s)
/data0/somelongdirectorytoavoidrpathissues/src/kudu/src/kudu/rpc/rpc-test.cc:270: Failure
Failed
Bad status: Runtime error: could not verify certificate chain (error with cert: subject=CN = localhost, ST = sadfjas, C = AS, emailAddress = sdflkdsajf, O = lskdfjlsad, OU = sldfkja, issuer=C = AS, ST = ASDfkjdhf, L = lskdjf, O = saldfja, OU = skdjf, CN = localhost, emailAddress = sadjflkadsj): : certificate has expired
Google Test trace:
/data0/somelongdirectorytoavoidrpathissues/src/kudu/src/kudu/rpc/rpc-test.cc:267: Connecting to 0.0.0.0:41173
I20260924 03:10:07.438010 3227 test_util.cc:175] -----------------------------------------------
I20260924 03:10:07.438108 3227 test_util.cc:176] Had fatal failures, leaving test files at /tmp/dist-test-task7BWBM0/test-tmp/rpc-test.5.Parameters_TestRpc.TestCallWithChainCertAndChainCA_SSL_TCP.1790219407326421-3227-0
[ FAILED ] Parameters/TestRpc.TestCallWithChainCertAndChainCA/SSL_TCP, where GetParam() = (true, false) (33 ms)
[ RUN ] Parameters/TestRpc.TestCallWithPasswordProtectedKey/SSL_TCP
I20260924 03:10:07.453099 3288 acceptor_pool.cc:254] collecting diagnostics on the listening RPC socket 0.0.0.0:44859 every 8 connection(s)
I20260924 03:10:07.453323 3289 acceptor_pool.cc:254] collecting diagnostics on the listening RPC socket 0.0.0.0:44859 every 8 connection(s)
[ OK ] Parameters/TestRpc.TestCallWithPasswordProtectedKey/SSL_TCP (52 ms)
[ RUN ] Parameters/TestRpc.TestCallToBadServer/SSL_TCP
I20260924 03:10:07.515329 3227 rpc-test.cc:394] Status: Network error: Client connection negotiation failed: client connection to 0.0.0.0:0: connect: Connection refused (error 111)
I20260924 03:10:07.516089 3227 rpc-test.cc:394] Status: Network error: Client connection negotiation failed: client connection to 0.0.0.0:0: connect: Connection refused (error 111)
I20260924 03:10:07.516703 3227 rpc-test.cc:394] Status: Network error: Client connection negotiation failed: client connection to 0.0.0.0:0: connect: Connection refused (error 111)
I20260924 03:10:07.517292 3227 rpc-test.cc:394] Status: Network error: Client connection negotiation failed: client connection to 0.0.0.0:0: connect: Connection refused (error 111)
I20260924 03:10:07.517865 3227 rpc-test.cc:394] Status: Network error: Client connection negotiation failed: client connection to 0.0.0.0:0: connect: Connection refused (error 111)
[ OK ] Parameters/TestRpc.TestCallToBadServer/SSL_TCP (28 ms)
[ RUN ] Parameters/TestRpc.TestWrongService/SSL_TCP
I20260924 03:10:07.531193 3323 acceptor_pool.cc:254] collecting diagnostics on the listening RPC socket 0.0.0.0:35461 every 8 connection(s)
I20260924 03:10:07.531455 3324 acceptor_pool.cc:254] collecting diagnostics on the listening RPC socket 0.0.0.0:35461 every 8 connection(s)
I20260924 03:10:07.558717 3322 messenger.cc:345] service WrongServiceName not registered on TestServer
[ OK ] Parameters/TestRpc.TestWrongService/SSL_TCP (44 ms)
[ RUN ] Parameters/TestRpc.TestConnectionKeepalive/SSL_TCP
I20260924 03:10:07.573067 3346 acceptor_pool.cc:254] collecting diagnostics on the listening RPC socket 0.0.0.0:45363 every 8 connection(s)
I20260924 03:10:07.573351 3347 acceptor_pool.cc:254] collecting diagnostics on the listening RPC socket 0.0.0.0:45363 every 8 connection(s)
I20260924 03:10:07.574268 3227 rpc-test.cc:488] Connecting to 0.0.0.0:45363
[ OK ] Parameters/TestRpc.TestConnectionKeepalive/SSL_TCP (1044 ms)
[ RUN ] Parameters/TestRpc.TestClientConnectionMetrics/SSL_TCP
I20260924 03:10:08.627102 3371 acceptor_pool.cc:254] collecting diagnostics on the listening RPC socket 0.0.0.0:45879 every 8 connection(s)
I20260924 03:10:08.627354 3372 acceptor_pool.cc:254] collecting diagnostics on the listening RPC socket 0.0.0.0:45879 every 8 connection(s)
I20260924 03:10:08.628311 3227 rpc-test.cc:569] Connecting to 0.0.0.0:45879
[ OK ] Parameters/TestRpc.TestClientConnectionMetrics/SSL_TCP (19555 ms)
[ RUN ] Parameters/TestRpc.TestCredentialsPolicy/SSL_TCP
I20260924 03:10:28.197993 3394 acceptor_pool.cc:254] collecting diagnostics on the listening RPC socket 0.0.0.0:39825 every 8 connection(s)
I20260924 03:10:28.198225 3395 acceptor_pool.cc:254] collecting diagnostics on the listening RPC socket 0.0.0.0:39825 every 8 connection(s)
I20260924 03:10:28.199165 3227 rpc-test.cc:700] Connecting to 0.0.0.0:39825
[ OK ] Parameters/TestRpc.TestCredentialsPolicy/SSL_TCP (74 ms)
[ RUN ] Parameters/TestRpc.TestCallLongerThanKeepalive/SSL_TCP
I20260924 03:10:28.247198 3419 acceptor_pool.cc:254] collecting diagnostics on the listening RPC socket 0.0.0.0:35761 every 8 connection(s)
I20260924 03:10:28.247440 3420 acceptor_pool.cc:254] collecting diagnostics on the listening RPC socket 0.0.0.0:35761 every 8 connection(s)
I20260924 03:10:28.263500 3423 rpc-test-base.h:222] got call: sleep_micros: 3000000 deferred: true
I20260924 03:10:31.265210 3423 rpcz_store.cc:275] Call kudu.rpc.GenericCalculatorService.Sleep from 127.0.0.1:43114 (request call id 0) took 3001 ms. Trace:
I20260924 03:10:31.265444 3423 rpcz_store.cc:276] 0924 03:10:28.263392 (+ 0us) service_pool.cc:170] Inserting onto call queue
0924 03:10:28.263455 (+ 63us) service_pool.cc:227] Handling call
0924 03:10:31.265163 (+3001708us) inbound_call.cc:173] Queueing success response
Metrics: {}
[ OK ] Parameters/TestRpc.TestCallLongerThanKeepalive/SSL_TCP (3032 ms)
[ RUN ] Parameters/TestRpc.TestRpcSidecar/SSL_TCP
I20260924 03:10:31.302052 3444 acceptor_pool.cc:254] collecting diagnostics on the listening RPC socket 0.0.0.0:40561 every 8 connection(s)
I20260924 03:10:31.302325 3445 acceptor_pool.cc:254] collecting diagnostics on the listening RPC socket 0.0.0.0:40561 every 8 connection(s)
[ OK ] Parameters/TestRpc.TestRpcSidecar/SSL_TCP (134 ms)
[ RUN ] Parameters/TestRpc.TestRpcSidecarLimits/SSL_TCP
I20260924 03:10:33.500753 3469 acceptor_pool.cc:254] collecting diagnostics on the listening RPC socket 0.0.0.0:40163 every 8 connection(s)
I20260924 03:10:33.501071 3470 acceptor_pool.cc:254] collecting diagnostics on the listening RPC socket 0.0.0.0:40163 every 8 connection(s)
W20260924 03:10:33.517657 3227 serialization.cc:72] Serialized kudu.rpc_test.PushStringsRequestPB (2147483654 bytes) is larger than the maximum configured RPC message size (52428800 bytes). Sending anyway, but peer may reject the data.
W20260924 03:10:33.523713 3468 connection.cc:535] server connection from 127.0.0.1:46614 recv error: Network error: RPC frame had a length of 2147483714, but we only support messages up to 52428800 bytes long.
W20260924 03:10:33.523831 3468 connection.cc:158] shutting down server connection from 127.0.0.1:46614 with pending inbound data: 4/2147483714 bytes received; last active 0 ns ago: status Network error: RPC frame had a length of 2147483714, but we only support messages up to 52428800 bytes long.
W20260924 03:10:33.524346 3482 connection.cc:196] Error closing socket: Network error: TlsSocket::Close: Connection reset by peer
I20260924 03:10:33.548207 3494 acceptor_pool.cc:254] collecting diagnostics on the listening RPC socket 0.0.0.0:35135 every 8 connection(s)
I20260924 03:10:33.548460 3495 acceptor_pool.cc:254] collecting diagnostics on the listening RPC socket 0.0.0.0:35135 every 8 connection(s)
W20260924 03:10:38.793069 3493 connection.cc:577] server connection from 127.0.0.1:42286: received bad data: 'Corruption: Invalid packet: message had a length of 2147483710, but we only support messages up to 2147483647 bytes
'
[ OK ] Parameters/TestRpc.TestRpcSidecarLimits/SSL_TCP (7853 ms)
[ RUN ] Parameters/TestRpc.TestCallTimeoutDoesntAffectNegotiation/SSL_TCP
I20260924 03:10:39.281814 3519 acceptor_pool.cc:254] collecting diagnostics on the listening RPC socket 0.0.0.0:41133 every 8 connection(s)
I20260924 03:10:39.282114 3520 acceptor_pool.cc:254] collecting diagnostics on the listening RPC socket 0.0.0.0:41133 every 8 connection(s)
W20260924 03:10:39.300107 3515 negotiation.cc:266] Injecting 500ms delay in negotiation
I20260924 03:10:39.350687 3227 rpc-test-base.h:595] status: Timed out: connection negotiation to 0.0.0.0:41133 for RPC Sleep timed out after 0.050s (ON_OUTBOUND_QUEUE), seconds elapsed: 0.0511633
[ OK ] Parameters/TestRpc.TestCallTimeoutDoesntAffectNegotiation/SSL_TCP (550 ms)
[ RUN ] Parameters/TestRpc.TestRpcHandlerLatencyMetric/SSL_TCP
I20260924 03:10:39.847272 3544 acceptor_pool.cc:254] collecting diagnostics on the listening RPC socket 0.0.0.0:32773 every 8 connection(s)
I20260924 03:10:39.847556 3545 acceptor_pool.cc:254] collecting diagnostics on the listening RPC socket 0.0.0.0:32773 every 8 connection(s)
I20260924 03:10:39.895982 3227 rpc-test.cc:1236] Sleep() min lat: 20583
I20260924 03:10:39.896066 3227 rpc-test.cc:1237] Sleep() mean lat: 20583
I20260924 03:10:39.896103 3227 rpc-test.cc:1238] Sleep() max lat: 20583
I20260924 03:10:39.896122 3227 rpc-test.cc:1239] Sleep() #calls: 1
[ OK ] Parameters/TestRpc.TestRpcHandlerLatencyMetric/SSL_TCP (90 ms)
[ RUN ] Parameters/TestRpc.TimedOutOnResponseMetricServiceQueue/SSL_TCP
I20260924 03:10:39.917361 3570 acceptor_pool.cc:254] collecting diagnostics on the listening RPC socket 0.0.0.0:36561 every 8 connection(s)
I20260924 03:10:39.917560 3571 acceptor_pool.cc:254] collecting diagnostics on the listening RPC socket 0.0.0.0:36561 every 8 connection(s)
W20260924 03:10:39.979198 3572 rpcz_store.cc:267] Call kudu.rpc_test.CalculatorService.Sleep from 127.0.0.1:34906 (request call id 2) took 20 ms (client timeout 20 ms). Trace:
W20260924 03:10:39.979396 3572 rpcz_store.cc:269] 0924 03:10:39.958727 (+ 0us) service_pool.cc:170] Inserting onto call queue
0924 03:10:39.979120 (+ 20393us) service_pool.cc:214] Skipping call since client already timed out
0924 03:10:39.979174 (+ 54us) inbound_call.cc:173] Queueing failure response
Metrics: {}
[ OK ] Parameters/TestRpc.TimedOutOnResponseMetricServiceQueue/SSL_TCP (82 ms)
[ RUN ] Parameters/TestRpc.RpcPendingConnectionsMetric/SSL_TCP
I20260924 03:10:39.987942 3593 acceptor_pool.cc:254] collecting diagnostics on the listening RPC socket 0.0.0.0:44869 every 8 connection(s)
I20260924 03:10:39.988152 3594 acceptor_pool.cc:254] collecting diagnostics on the listening RPC socket 0.0.0.0:44869 every 8 connection(s)
W20260924 03:10:39.990103 3589 negotiation.cc:337] Failed RPC negotiation. Trace:
0924 03:10:39.989492 (+ 0us) reactor.cc:625] Submitting negotiation task for server connection from 127.0.0.1:56136 (local address 127.0.0.1:44869)
0924 03:10:39.989645 (+ 153us) server_negotiation.cc:206] Beginning negotiation
0924 03:10:39.989649 (+ 4us) server_negotiation.cc:399] Waiting for connection header
0924 03:10:39.989784 (+ 135us) negotiation.cc:327] Negotiation complete: Network error: Server connection negotiation failed: server connection from 127.0.0.1:56136: BlockingRecv error: recv got EOF from 127.0.0.1:56136 (error 108)
Metrics: {"server-negotiator.queue_time_us":40}
[ OK ] Parameters/TestRpc.RpcPendingConnectionsMetric/SSL_TCP (19 ms)
[ RUN ] Parameters/TestRpc.TestRpcContextClientDeadline/SSL_TCP
I20260924 03:10:40.017863 3609 acceptor_pool.cc:254] collecting diagnostics on the listening RPC socket 0.0.0.0:39797 every 8 connection(s)
I20260924 03:10:40.018071 3610 acceptor_pool.cc:254] collecting diagnostics on the listening RPC socket 0.0.0.0:39797 every 8 connection(s)
[ OK ] Parameters/TestRpc.TestRpcContextClientDeadline/SSL_TCP (54 ms)
[ RUN ] Parameters/TestRpc.TestApplicationFeatureFlagUnsupportedServer/SSL_TCP
I20260924 03:10:40.077678 3634 acceptor_pool.cc:254] collecting diagnostics on the listening RPC socket 0.0.0.0:44835 every 8 connection(s)
I20260924 03:10:40.077922 3635 acceptor_pool.cc:254] collecting diagnostics on the listening RPC socket 0.0.0.0:44835 every 8 connection(s)
[ OK ] Parameters/TestRpc.TestApplicationFeatureFlagUnsupportedServer/SSL_TCP (43 ms)
[ RUN ] Parameters/TestRpc.TestCancellationAsync/SSL_TCP
I20260924 03:10:40.112601 3659 acceptor_pool.cc:254] collecting diagnostics on the listening RPC socket 0.0.0.0:45941 every 8 connection(s)
I20260924 03:10:40.112864 3660 acceptor_pool.cc:254] collecting diagnostics on the listening RPC socket 0.0.0.0:45941 every 8 connection(s)
I20260924 03:10:40.113662 3227 rpc-test.cc:1716] Connecting to 0.0.0.0:45941
I20260924 03:10:40.125638 3227 test_util.cc:268] Using random seed: -238258518
I20260924 03:10:40.161592 3663 rpc-test-base.h:240] got call: sleep_micros: 500 pattern: 4294967295 num_repetitions: 2097152 sidecar_idx: 0
I20260924 03:10:40.180670 3662 rpc-test-base.h:240] got call: sleep_micros: 500 pattern: 4294967295 num_repetitions: 2097152 sidecar_idx: 0
I20260924 03:10:40.214428 3661 rpc-test-base.h:240] got call: sleep_micros: 500 pattern: 4294967295 num_repetitions: 2097152 sidecar_idx: 0
I20260924 03:10:40.245227 3662 rpc-test-base.h:240] got call: sleep_micros: 500 pattern: 4294967295 num_repetitions: 2097152 sidecar_idx: 0
I20260924 03:10:40.270026 3663 rpc-test-base.h:240] got call: sleep_micros: 500 pattern: 4294967295 num_repetitions: 2097152 sidecar_idx: 0
I20260924 03:10:40.302356 3661 rpc-test-base.h:240] got call: sleep_micros: 500 pattern: 4294967295 num_repetitions: 2097152 sidecar_idx: 0
W20260924 03:10:40.324424 3656 connection.cc:698] server connection from 127.0.0.1:38314 send error: Network error: failed to write to TLS socket: Broken pipe
W20260924 03:10:40.324586 3656 connection.cc:441] server connection from 127.0.0.1:38314 torn down before Call kudu.rpc.GenericCalculatorService.SleepWithSidecar from 127.0.0.1:38314 (request call id 9) could send its response
W20260924 03:10:40.324922 3656 connection.cc:196] Error closing socket: Network error: TlsSocket::Close: Success
W20260924 03:10:40.344969 3656 connection.cc:441] server connection from 127.0.0.1:38314 torn down before Call kudu.rpc.GenericCalculatorService.SleepWithSidecar from 127.0.0.1:38314 (request call id 8) could send its response
[ OK ] Parameters/TestRpc.TestCancellationAsync/SSL_TCP (247 ms)
[ RUN ] Parameters/TestRpc.TestPerformanceBySocketType/SSL_TCP
I20260924 03:10:40.364617 3684 acceptor_pool.cc:254] collecting diagnostics on the listening RPC socket 0.0.0.0:44211 every 8 connection(s)
I20260924 03:10:40.364850 3685 acceptor_pool.cc:254] collecting diagnostics on the listening RPC socket 0.0.0.0:44211 every 8 connection(s)
I20260924 03:10:40.365633 3227 rpc-test.cc:1846] Connecting to 0.0.0.0:44211
I20260924 03:10:43.366633 3227 rpc-test.cc:1859] Sending 1024MB via ssl-enabled tcp socket: real 2.988s user 2.835s sys 2.177s
I20260924 03:10:46.199193 3227 rpc-test.cc:1859] Sending 1024MB via ssl-enabled tcp socket: real 2.832s user 2.506s sys 2.159s
I20260924 03:10:49.113916 3227 rpc-test.cc:1859] Sending 1024MB via ssl-enabled tcp socket: real 2.915s user 2.657s sys 2.190s
I20260924 03:10:51.974004 3227 rpc-test.cc:1859] Sending 1024MB via ssl-enabled tcp socket: real 2.860s user 2.751s sys 1.955s
I20260924 03:10:54.852171 3227 rpc-test.cc:1859] Sending 1024MB via ssl-enabled tcp socket: real 2.878s user 2.517s sys 2.230s
[ OK ] Parameters/TestRpc.TestPerformanceBySocketType/SSL_TCP (14511 ms)
[----------] 20 tests from Parameters/TestRpc (47514 ms total)
[----------] 1 test from Parameters/TestRpcSocketTxRxQueue
[ RUN ] Parameters/TestRpcSocketTxRxQueue.OverCapacity/0
W20260924 03:10:55.155927 3701 negotiation.cc:337] Failed RPC negotiation. Trace:
0924 03:10:54.863750 (+ 0us) reactor.cc:625] Submitting negotiation task for client connection to 0.0.0.0:36499 (local address 127.0.0.1:47094)
0924 03:10:54.863970 (+ 220us) negotiation.cc:107] Waiting for socket to connect
0924 03:10:54.863989 (+ 19us) client_negotiation.cc:174] Beginning negotiation
0924 03:10:54.864131 (+ 142us) client_negotiation.cc:252] Sending NEGOTIATE NegotiatePB request
0924 03:10:55.155498 (+291367us) negotiation.cc:327] Negotiation complete: Network error: Client connection negotiation failed: client connection to 0.0.0.0:36499: BlockingRecv error: recv error from unknown peer: Transport endpoint is not connected (error 107)
Metrics: {"client-negotiator.queue_time_us":34}
W20260924 03:10:55.155967 3719 negotiation.cc:337] Failed RPC negotiation. Trace:
0924 03:10:54.868658 (+ 0us) reactor.cc:625] Submitting negotiation task for client connection to 0.0.0.0:36499 (local address 127.0.0.1:47122)
0924 03:10:54.868819 (+ 161us) negotiation.cc:107] Waiting for socket to connect
0924 03:10:54.868836 (+ 17us) client_negotiation.cc:174] Beginning negotiation
0924 03:10:54.868947 (+ 111us) client_negotiation.cc:252] Sending NEGOTIATE NegotiatePB request
0924 03:10:55.155665 (+286718us) negotiation.cc:327] Negotiation complete: Network error: Client connection negotiation failed: client connection to 0.0.0.0:36499: BlockingRecv error: recv error from unknown peer: Transport endpoint is not connected (error 107)
Metrics: {"client-negotiator.queue_time_us":32}
W20260924 03:10:55.156047 3746 negotiation.cc:337] Failed RPC negotiation. Trace:
0924 03:10:54.877158 (+ 0us) reactor.cc:625] Submitting negotiation task for client connection to 0.0.0.0:36499 (local address 127.0.0.1:47168)
0924 03:10:54.877354 (+ 196us) negotiation.cc:107] Waiting for socket to connect
0924 03:10:54.877368 (+ 14us) client_negotiation.cc:174] Beginning negotiation
0924 03:10:54.877454 (+ 86us) client_negotiation.cc:252] Sending NEGOTIATE NegotiatePB request
0924 03:10:55.155769 (+278315us) negotiation.cc:327] Negotiation complete: Network error: Client connection negotiation failed: client connection to 0.0.0.0:36499: BlockingRecv error: recv error from unknown peer: Transport endpoint is not connected (error 107)
Metrics: {"client-negotiator.queue_time_us":56}
W20260924 03:10:55.156642 3728 negotiation.cc:337] Failed RPC negotiation. Trace:
0924 03:10:54.871271 (+ 0us) reactor.cc:625] Submitting negotiation task for client connection to 0.0.0.0:36499 (local address 127.0.0.1:47136)
0924 03:10:54.871455 (+ 184us) negotiation.cc:107] Waiting for socket to connect
0924 03:10:54.871469 (+ 14us) client_negotiation.cc:174] Beginning negotiation
0924 03:10:54.871553 (+ 84us) client_negotiation.cc:252] Sending NEGOTIATE NegotiatePB request
0924 03:10:55.155512 (+283959us) negotiation.cc:327] Negotiation complete: Network error: Client connection negotiation failed: client connection to 0.0.0.0:36499: BlockingRecv error: recv error from unknown peer: Transport endpoint is not connected (error 107)
Metrics: {"client-negotiator.queue_time_us":54}
W20260924 03:10:55.156791 3710 negotiation.cc:337] Failed RPC negotiation. Trace:
0924 03:10:54.866122 (+ 0us) reactor.cc:625] Submitting negotiation task for client connection to 0.0.0.0:36499 (local address 127.0.0.1:47108)
0924 03:10:54.866297 (+ 175us) negotiation.cc:107] Waiting for socket to connect
0924 03:10:54.866312 (+ 15us) client_negotiation.cc:174] Beginning negotiation
0924 03:10:54.866406 (+ 94us) client_negotiation.cc:252] Sending NEGOTIATE NegotiatePB request
0924 03:10:55.155599 (+289193us) negotiation.cc:327] Negotiation complete: Network error: Client connection negotiation failed: client connection to 0.0.0.0:36499: BlockingRecv error: recv error from unknown peer: Transport endpoint is not connected (error 107)
Metrics: {"client-negotiator.queue_time_us":54}
W20260924 03:10:55.156442 3737 negotiation.cc:337] Failed RPC negotiation. Trace:
0924 03:10:54.874337 (+ 0us) reactor.cc:625] Submitting negotiation task for client connection to 0.0.0.0:36499 (local address 127.0.0.1:47152)
0924 03:10:54.874517 (+ 180us) negotiation.cc:107] Waiting for socket to connect
0924 03:10:54.874536 (+ 19us) client_negotiation.cc:174] Beginning negotiation
0924 03:10:54.874641 (+ 105us) client_negotiation.cc:252] Sending NEGOTIATE NegotiatePB request
0924 03:10:55.156106 (+281465us) negotiation.cc:327] Negotiation complete: Network error: Client connection negotiation failed: client connection to 0.0.0.0:36499: BlockingRecv error: recv error from unknown peer: Transport endpoint is not connected (error 107)
Metrics: {"client-negotiator.queue_time_us":47}
[ OK ] Parameters/TestRpcSocketTxRxQueue.OverCapacity/0 (1069 ms)
[----------] 1 test from Parameters/TestRpcSocketTxRxQueue (1069 ms total)
[----------] Global test environment tear-down
[==========] 21 tests from 2 test suites ran. (48584 ms total)
[ PASSED ] 20 tests.
[ FAILED ] 1 test, listed below:
[ FAILED ] Parameters/TestRpc.TestCallWithChainCertAndChainCA/SSL_TCP, where GetParam() = (true, false)
1 FAILED TEST